{
  "_id": "61bb65fdeb8f3401f272c0bb",
  "name": "F5 Member Creation",
  "description": "",
  "componentName": "F5 Member Management",
  "componentType": "workflows",
  "gbac": {
    "write": [],
    "read": []
  },
  "created": "2021-12-16T16:14:53.012Z",
  "createdBy": "zach.baskin@itential.com",
  "lastUpdated": "2021-12-16T16:14:53.012Z",
  "lastUpdatedBy": "zach.baskin@itential.com",
  "triggers": [
    {
      "_id": "61bb65fdeb8f3401f272c0bc",
      "created": "2021-12-16T16:14:53.104Z",
      "createdBy": "zach.baskin@itential.com",
      "lastUpdated": "2021-12-16T16:14:53.104Z",
      "lastUpdatedBy": "zach.baskin@itential.com",
      "name": "Manual Trigger (migrated from F5 Member Creation)",
      "type": "manual",
      "enabled": true,
      "actionType": "automations",
      "actionId": "61bb65fdeb8f3401f272c0bb",
      "formId": "F5 Members Creation",
      "formData": {},
      "migrationVersion": 1
    }
  ]
}