{
  "id": "5e7cc1749e503f07b099bf3c",
  "created": "2020-03-26T14:51:32.822Z",
  "createdBy": "mani.chekuri",
  "lastUpdated": "2020-12-31T21:58:05.793Z",
  "lastUpdatedBy": "mani.chekuri",
  "name": "Cloudify Create Deployment",
  "description": "Create a Cloudify Deployment",
  "struct": {
    "type": "object",
    "description": "",
    "items": [
      {
        "nodeId": "90ca4a48-ae8b-4738-982b-5dece00907c4",
        "type": "string",
        "title": "Deployment ID",
        "description": "Unique Deployment ID for instantiation. Must begin with a letter.",
        "placeholder": "",
        "required": true,
        "pattern": "^[a-zA-Z]"
      },
      {
        "nodeId": "e32a0a3a-cce6-45b2-8459-ed386461910d",
        "type": "string",
        "title": "Blueprint ID",
        "description": "ID for the Cloudify Blueprint",
        "placeholder": "",
        "required": true
      },
      {
        "nodeId": "08fe0575-3dd6-4d40-afe6-9da6c4ead6a0",
        "type": "string",
        "widget": "textarea",
        "title": "Inputs",
        "description": "JSON object of inputs for Cloudify blueprint. If no inputs enter an empty object {}",
        "placeholder": "",
        "required": false
      }
    ]
  },
  "schema": {
    "title": "Cloudify Create Deployment",
    "description": "Create a Cloudify Deployment",
    "type": "object",
    "required": [
      "deploymentId",
      "blueprintId"
    ],
    "properties": {
      "deploymentId": {
        "type": "string",
        "title": "Deployment ID",
        "description": "Unique Deployment ID for instantiation. Must begin with a letter.",
        "pattern": "^[a-zA-Z]"
      },
      "blueprintId": {
        "type": "string",
        "title": "Blueprint ID",
        "description": "ID for the Cloudify Blueprint"
      },
      "inputs": {
        "type": "string",
        "title": "Inputs",
        "description": "JSON object of inputs for Cloudify blueprint. If no inputs enter an empty object {}"
      }
    }
  },
  "uiSchema": {
    "inputs": {
      "ui:widget": "textarea",
      "ui:maxHeight": 500
    }
  },
  "bindingSchema": {},
  "validationSchema": {},
  "version": "2020.1"
}