{
  "metadata": {
    "name": "@itentialopensource/cloudify-create-delete-deployment",
    "version": "0.0.10",
    "description": "Cloudify Create Delete Deployment",
    "license": "Apache-2.0",
    "repository": {
      "type": "gitlab",
      "hostname": "gitlab.com",
      "path": "itentialopensource/pre-built-automations"
    },
    "keywords": [
      "Itential",
      "IAP",
      "artifacts",
      "Cloudify",
      "Deployment",
      "Blueprint"
    ],
    "author": "Itential Artifacts",
    "IAPDependencies": {
      "@itential/app-operations_manager": "",
      "@itential/app-json_forms": "",
      "@itential/app-workflow_engine": ""
    },
    "gitlabId": 23450559
  },
  "manifest": {
    "bundleName": "Cloudify Create Delete Deployment",
    "fingerprint": "5ff33e7a654277540bc46dff",
    "createdEpoch": "1609776762791",
    "artifacts": [
      {
        "id": "Cloudify Create Deployment",
        "name": "Cloudify Create Deployment",
        "type": "automation",
        "location": "/bundles/automations/Cloudify Create Deployment.json",
        "properties": {
          "entryPoint": false
        }
      },
      {
        "id": "Cloudify Delete Deployment",
        "name": "Cloudify Delete Deployment",
        "type": "automation",
        "location": "/bundles/automations/Cloudify Delete Deployment.json",
        "properties": {
          "entryPoint": false
        }
      },
      {
        "id": "Cloudify Create Deployment",
        "name": "Cloudify Create Deployment",
        "type": "workflow",
        "location": "/bundles/workflows/Cloudify Create Deployment.json",
        "properties": {
          "entryPoint": false
        }
      },
      {
        "id": "Cloudify Delete Deployment",
        "name": "Cloudify Delete Deployment",
        "type": "workflow",
        "location": "/bundles/workflows/Cloudify Delete Deployment.json",
        "properties": {
          "entryPoint": false
        }
      },
      {
        "id": "Cloudify Create Deployment",
        "name": "Cloudify Create Deployment",
        "type": "json-forms",
        "location": "/bundles/json_forms/Cloudify Create Deployment.json",
        "properties": {
          "entryPoint": false
        }
      },
      {
        "id": "Cloudify Delete Deployment",
        "name": "Cloudify Delete Deployment",
        "type": "json-forms",
        "location": "/bundles/json_forms/Cloudify Delete Deployment.json",
        "properties": {
          "entryPoint": false
        }
      }
    ]
  },
  "bundles": [
    {
      "type": "automation",
      "data": {
        "_id": "61cb7d4ce660f301b0e4f257",
        "name": "Cloudify Create Deployment",
        "description": "",
        "componentName": "Cloudify Create Deployment",
        "componentType": "workflows",
        "gbac": {
          "write": [],
          "read": []
        },
        "created": "2021-12-28T21:10:36.424Z",
        "createdBy": "kay.wolfe@itential.com",
        "lastUpdated": "2021-12-28T21:10:36.424Z",
        "lastUpdatedBy": "kay.wolfe@itential.com",
        "triggers": [
          {
            "_id": "61cb7d4ce660f301b0e4f258",
            "created": "2021-12-28T21:10:36.807Z",
            "createdBy": "kay.wolfe@itential.com",
            "lastUpdated": "2021-12-28T21:10:36.807Z",
            "lastUpdatedBy": "kay.wolfe@itential.com",
            "name": "Manual Trigger (migrated from Cloudify Create Deployment)",
            "type": "manual",
            "enabled": true,
            "actionType": "automations",
            "actionId": "61cb7d4ce660f301b0e4f257",
            "formId": "Cloudify Create Deployment",
            "formData": {},
            "migrationVersion": 1
          }
        ]
      }
    },
    {
      "type": "automation",
      "data": {
        "_id": "61cb7d52e660f301b0e4f259",
        "name": "Cloudify Delete Deployment",
        "description": "",
        "componentName": "Cloudify Delete Deployment",
        "componentType": "workflows",
        "gbac": {
          "write": [],
          "read": []
        },
        "created": "2021-12-28T21:10:42.706Z",
        "createdBy": "kay.wolfe@itential.com",
        "lastUpdated": "2021-12-28T21:10:42.706Z",
        "lastUpdatedBy": "kay.wolfe@itential.com",
        "triggers": [
          {
            "_id": "61cb7d53e660f301b0e4f25a",
            "created": "2021-12-28T21:10:43.033Z",
            "createdBy": "kay.wolfe@itential.com",
            "lastUpdated": "2021-12-28T21:10:43.033Z",
            "lastUpdatedBy": "kay.wolfe@itential.com",
            "name": "Manual Trigger (migrated from Cloudify Delete Deployment)",
            "type": "manual",
            "enabled": true,
            "actionType": "automations",
            "actionId": "61cb7d52e660f301b0e4f259",
            "formId": "Cloudify Delete Deployment",
            "formData": {},
            "migrationVersion": 1
          }
        ]
      }
    },
    {
      "type": "workflow",
      "data": {
        "name": "Cloudify Create Deployment",
        "tasks": {
          "4956": {
            "name": "getDeploymentOutputs",
            "summary": "Get Deployment Outputs",
            "description": "getDeploymentOutputs from Cloudify",
            "location": "Adapter",
            "locationType": "Cloudify",
            "app": "Cloudify",
            "displayName": "Cloudify",
            "type": "automatic",
            "variables": {
              "incoming": {
                "deploymentId": "$var.eb13.return_data",
                "adapter_id": "adapter-cloudify"
              },
              "outgoing": {
                "result": "$var.job.cloudifyOutputs"
              },
              "error": ""
            },
            "deprecated": false,
            "matched": [],
            "groups": [],
            "actor": "Pronghorn",
            "x": 1.1574803149606299,
            "y": 0.7226277372262774,
            "scheduled": false
          },
          "8508": {
            "name": "getExecution",
            "summary": "Get Execution Detail",
            "description": "getExecution to check status",
            "location": "Adapter",
            "locationType": "Cloudify",
            "app": "Cloudify",
            "displayName": "Cloudify",
            "type": "automatic",
            "variables": {
              "incoming": {
                "include": "",
                "executionId": "$var.2da2.return_data",
                "adapter_id": "adapter-cloudify"
              },
              "outgoing": {
                "result": "$var.job.cloudifyResult"
              },
              "error": ""
            },
            "deprecated": false,
            "matched": [
              {
                "key": "name",
                "highlightString": "<span class='highlight-string'>get</span><span class='highlight-string'>Execution</span>"
              },
              {
                "key": "summary",
                "highlightString": "<span class='highlight-string'>get</span><span class='highlight-string'>Execution</span>"
              },
              {
                "key": "description",
                "highlightString": "<span class='highlight-string'>get</span><span class='highlight-string'>Execution</span>"
              }
            ],
            "groups": [],
            "actor": "Pronghorn",
            "x": 0.7299212598425197,
            "y": 0.49635036496350365,
            "scheduled": false
          },
          "workflow_start": {
            "name": "workflow_start",
            "groups": [],
            "x": -0.31402002861230327,
            "y": 0.4874835309617918
          },
          "workflow_end": {
            "name": "workflow_end",
            "groups": [],
            "x": 1.3433070866141732,
            "y": 0.43795620437956206
          },
          "5e4a": {
            "name": "createDeployment",
            "summary": "createDeployment",
            "description": "createDeployment",
            "location": "Adapter",
            "locationType": "Cloudify",
            "app": "Cloudify",
            "displayName": "Cloudify",
            "type": "automatic",
            "variables": {
              "incoming": {
                "include": "",
                "deploymentId": "$var.eb13.return_data",
                "body": "$var.b3ba.object",
                "adapter_id": "adapter-cloudify"
              },
              "outgoing": {
                "result": null
              },
              "error": "$var.job.createDeploymentError"
            },
            "deprecated": false,
            "matched": [],
            "groups": [],
            "actor": "Pronghorn",
            "x": 0.08405797101449275,
            "y": 0.49801324503311256,
            "scheduled": false
          },
          "a060": {
            "name": "startExecution",
            "summary": "Start Execution",
            "description": "startExecution for Cloudify deployment",
            "location": "Adapter",
            "locationType": "Cloudify",
            "app": "Cloudify",
            "displayName": "Cloudify",
            "type": "automatic",
            "variables": {
              "incoming": {
                "include": "",
                "body": "$var.8e0a.output",
                "adapter_id": "adapter-cloudify"
              },
              "outgoing": {
                "result": null
              },
              "error": "$var.job.executionFailure"
            },
            "deprecated": false,
            "matched": [
              {
                "key": "name",
                "highlightString": "<span class='highlight-string'>start</span><span class='highlight-string'>Execu</span>tion"
              },
              {
                "key": "summary",
                "highlightString": "<span class='highlight-string'>start</span><span class='highlight-string'>Execu</span>tion"
              },
              {
                "key": "description",
                "highlightString": "<span class='highlight-string'>start</span><span class='highlight-string'>Execu</span>tion"
              }
            ],
            "groups": [],
            "actor": "Pronghorn",
            "x": 0.3977110157367668,
            "y": 0.4993412384716733,
            "scheduled": false
          },
          "2da2": {
            "name": "query",
            "summary": "Query execution id",
            "description": "query the execution id",
            "location": "Application",
            "locationType": null,
            "app": "WorkFlowEngine",
            "displayName": "WorkFlowEngine",
            "type": "operation",
            "variables": {
              "incoming": {
                "pass_on_null": false,
                "query": "response.id",
                "obj": "$var.a060.result"
              },
              "outgoing": {
                "return_data": null
              },
              "error": ""
            },
            "deprecated": false,
            "matched": [
              {
                "key": "name",
                "highlightString": "<span class='highlight-string'>query</span>"
              },
              {
                "key": "summary",
                "highlightString": "<span class='highlight-string'>Query</span> Data Using 'json-query' Format"
              },
              {
                "key": "description",
                "highlightString": "<span class='highlight-string'>Query</span> data using a dot/bracket notation string and a matching key/value pair."
              }
            ],
            "groups": [],
            "x": 0.5551181102362205,
            "y": 0.6021897810218978,
            "scheduled": false
          },
          "8e0a": {
            "name": "makeData",
            "summary": "Start Execution Payload",
            "description": "Make Data payload for Start Execution",
            "location": "Application",
            "locationType": null,
            "app": "WorkFlowEngine",
            "displayName": "Tools",
            "type": "automatic",
            "variables": {
              "incoming": {
                "input": "{\"deployment_id\":\"<!deploymentId!>\",\"workflow_id\":\"install\"}",
                "outputType": "json",
                "variables": "$var.job.formData"
              },
              "outgoing": {
                "output": null
              },
              "error": ""
            },
            "deprecated": false,
            "matched": [
              {
                "key": "name",
                "highlightString": "<span class='highlight-string'>makeData</span>"
              }
            ],
            "groups": [],
            "actor": "Pronghorn",
            "x": 0.22603719599427755,
            "y": 0.3820816864295125,
            "scheduled": false
          },
          "cb03": {
            "name": "evaluation",
            "summary": "Check status Success",
            "description": "Run an evaluation to check status for success (terminated)",
            "location": "Application",
            "locationType": null,
            "app": "WorkFlowEngine",
            "displayName": "WorkFlowEngine",
            "type": "operation",
            "variables": {
              "incoming": {
                "all_true_flag": false,
                "evaluation_groups": [
                  {
                    "all_true_flag": false,
                    "evaluations": [
                      {
                        "query": "response.status",
                        "operand_1": {
                          "variable": "result",
                          "task": "8508"
                        },
                        "operator": "==",
                        "operand_2": {
                          "variable": "terminated",
                          "task": "static"
                        }
                      }
                    ]
                  }
                ]
              },
              "outgoing": {
                "return_value": null
              }
            },
            "deprecated": false,
            "matched": [
              {
                "key": "name",
                "highlightString": "<span class='highlight-string'>eval</span>uation"
              },
              {
                "key": "summary",
                "highlightString": "Run <span class='highlight-string'>Eval</span>uation Task"
              },
              {
                "key": "description",
                "highlightString": "Run an <span class='highlight-string'>eval</span>uation"
              }
            ],
            "groups": [],
            "x": 1.0188976377952756,
            "y": 0.5924574209245742
          },
          "9cbd": {
            "name": "reattempt",
            "summary": "Re-attempt Execution",
            "description": "Re-attempt the execution start",
            "location": "Application",
            "locationType": null,
            "app": "MOP",
            "displayName": "Command Templates",
            "type": "automatic",
            "variables": {
              "incoming": {
                "job_id": "$var.job._id",
                "attemptID": "1",
                "minutes": 1,
                "attempts": 10
              },
              "outgoing": {
                "response": null
              },
              "error": ""
            },
            "deprecated": false,
            "matched": [
              {
                "key": "name",
                "highlightString": "<span class='highlight-string'>reattemp</span>t"
              }
            ],
            "groups": [],
            "actor": "Pronghorn",
            "x": 0.5834645669291338,
            "y": 0.35279805352798055,
            "scheduled": false
          },
          "ee77": {
            "name": "ViewData",
            "summary": "Execution Failure",
            "description": "Could not execute start for cloudify",
            "location": "Application",
            "app": "WorkFlowEngine",
            "displayName": "Tools",
            "type": "manual",
            "variables": {
              "incoming": {
                "header": "Cloudify Execution Failure",
                "message": "Could not start the execution for the cloudify blueprint.  Please Review and Retry.",
                "body": "$var.job.executionFailure",
                "btn_success": "Retry",
                "btn_failure": ""
              },
              "outgoing": {},
              "error": ""
            },
            "view": "/workflow_engine/task/ViewData",
            "deprecated": false,
            "matched": [
              {
                "key": "name",
                "highlightString": "<span class='highlight-string'>ViewData</span>"
              }
            ],
            "groups": [],
            "x": 0.7582677165354331,
            "y": 0.1678832116788321,
            "scheduled": false
          },
          "6c31": {
            "name": "reattempt",
            "summary": "Re-attempt Status Check",
            "description": "Re-attempt the status check",
            "location": "Application",
            "locationType": null,
            "app": "MOP",
            "displayName": "Command Templates",
            "type": "automatic",
            "variables": {
              "incoming": {
                "job_id": "$var.job._id",
                "attemptID": "2",
                "minutes": 1,
                "attempts": 20
              },
              "outgoing": {
                "response": null
              },
              "error": ""
            },
            "deprecated": false,
            "matched": [
              {
                "key": "name",
                "highlightString": "<span class='highlight-string'>reattemp</span>t"
              }
            ],
            "groups": [],
            "actor": "Pronghorn",
            "x": 1.1409448818897638,
            "y": 0.40875912408759124,
            "scheduled": false
          },
          "ddbe": {
            "name": "ViewData",
            "summary": "Status Check Failure",
            "description": "Status not successful for deployment",
            "location": "Application",
            "app": "WorkFlowEngine",
            "displayName": "Tools",
            "type": "manual",
            "variables": {
              "incoming": {
                "header": "Status Check Failure",
                "message": "The status check has not passed for the deployment.  Please review and retest or skip.",
                "body": "$var.8508.result",
                "btn_success": "Retest",
                "btn_failure": "Skip Test"
              },
              "outgoing": {},
              "error": ""
            },
            "view": "/workflow_engine/task/ViewData",
            "deprecated": false,
            "matched": [
              {
                "key": "name",
                "highlightString": "<span class='highlight-string'>ViewData</span>"
              }
            ],
            "groups": [],
            "x": 1.1228346456692913,
            "y": 0.14841849148418493,
            "scheduled": false
          },
          "61f2": {
            "name": "delay",
            "summary": "Wait",
            "description": "Give cloudify a chance to get ready",
            "location": "Application",
            "locationType": null,
            "app": "WorkFlowEngine",
            "displayName": "WorkFlowEngine",
            "type": "operation",
            "variables": {
              "incoming": {
                "time": 30
              },
              "outgoing": {
                "time_in_milliseconds": null
              },
              "error": ""
            },
            "deprecated": false,
            "matched": [
              {
                "key": "name",
                "highlightString": "<span class='highlight-string'>delay</span>"
              },
              {
                "key": "summary",
                "highlightString": "<span class='highlight-string'>Delay</span> a Job"
              },
              {
                "key": "description",
                "highlightString": "<span class='highlight-string'>Delay</span> a Job for a duration by Job ID and number of seconds."
              }
            ],
            "groups": [],
            "x": 0.22603719599427755,
            "y": 0.549407114624506,
            "scheduled": false
          },
          "b823": {
            "name": "evaluation",
            "summary": "Check failed status",
            "description": "Run an evaluation to check status for failure",
            "location": "Application",
            "locationType": null,
            "app": "WorkFlowEngine",
            "displayName": "WorkFlowEngine",
            "type": "operation",
            "variables": {
              "incoming": {
                "all_true_flag": false,
                "evaluation_groups": [
                  {
                    "all_true_flag": false,
                    "evaluations": [
                      {
                        "query": "response.status",
                        "operand_1": {
                          "variable": "result",
                          "task": "8508"
                        },
                        "operator": "!=",
                        "operand_2": {
                          "variable": "failed",
                          "task": "static"
                        }
                      }
                    ]
                  }
                ]
              },
              "outgoing": {
                "return_value": null
              }
            },
            "deprecated": false,
            "matched": [
              {
                "key": "name",
                "highlightString": "<span class='highlight-string'>eval</span>uation"
              },
              {
                "key": "summary",
                "highlightString": "Run <span class='highlight-string'>Eval</span>uation Task"
              },
              {
                "key": "description",
                "highlightString": "Run an <span class='highlight-string'>eval</span>uation"
              }
            ],
            "groups": [],
            "x": 0.9094488188976378,
            "y": 0.49391727493917276
          },
          "bda8": {
            "name": "makeData",
            "canvasName": "makeData",
            "summary": "Inputs JSON",
            "description": "Make Data to Covert Inputs to JSON",
            "location": "Application",
            "locationType": null,
            "app": "WorkFlowEngine",
            "displayName": "Tools",
            "type": "automatic",
            "variables": {
              "incoming": {
                "input": "$var.fa10.return_data",
                "outputType": "json",
                "variables": ""
              },
              "outgoing": {
                "output": null
              },
              "error": ""
            },
            "deprecated": false,
            "matched": [
              {
                "key": "canvasName",
                "highlightString": "<span class='highlight-string'>makeData</span>"
              }
            ],
            "groups": [],
            "actor": "Pronghorn",
            "x": -0.15236051502145923,
            "y": 0.37681159420289856,
            "scheduled": false
          },
          "fa10": {
            "name": "query",
            "canvasName": "query",
            "summary": "Query Inputs",
            "description": "query form data for inputs",
            "location": "Application",
            "locationType": null,
            "app": "WorkFlowEngine",
            "displayName": "WorkFlowEngine",
            "type": "operation",
            "variables": {
              "incoming": {
                "pass_on_null": false,
                "query": "inputs",
                "obj": "$var.job.formData"
              },
              "outgoing": {
                "return_data": null
              },
              "error": ""
            },
            "deprecated": false,
            "matched": [
              {
                "key": "canvasName",
                "highlightString": "<span class='highlight-string'>query</span>"
              },
              {
                "key": "summary",
                "highlightString": "<span class='highlight-string'>Query</span> Data Using 'json-query' Format"
              },
              {
                "key": "description",
                "highlightString": "<span class='highlight-string'>Query</span> data using a dot/bracket notation string and a matching key/value pair."
              }
            ],
            "groups": [],
            "x": -0.2217453505007153,
            "y": 0.3847167325428195,
            "scheduled": false
          },
          "a4f4": {
            "name": "makeData",
            "canvasName": "makeData",
            "summary": "Deployment JSON",
            "description": "Setup the Deployment JSON",
            "location": "Application",
            "locationType": null,
            "app": "WorkFlowEngine",
            "displayName": "Tools",
            "type": "automatic",
            "variables": {
              "incoming": {
                "input": "{\"blueprint_id\":\"<!blueprintId!>\"}",
                "outputType": "json",
                "variables": "$var.job.formData"
              },
              "outgoing": {
                "output": null
              },
              "error": ""
            },
            "deprecated": false,
            "matched": [
              {
                "key": "canvasName",
                "highlightString": "<span class='highlight-string'>makeData</span>"
              }
            ],
            "groups": [],
            "actor": "Pronghorn",
            "x": -0.15593705293276108,
            "y": 0.6100131752305665,
            "scheduled": false
          },
          "eb13": {
            "name": "query",
            "canvasName": "query",
            "summary": "Query deploymentId",
            "description": "query form data for deployment ID",
            "location": "Application",
            "locationType": null,
            "app": "WorkFlowEngine",
            "displayName": "WorkFlowEngine",
            "type": "operation",
            "variables": {
              "incoming": {
                "pass_on_null": false,
                "query": "deploymentId",
                "obj": "$var.job.formData"
              },
              "outgoing": {
                "return_data": null
              },
              "error": ""
            },
            "deprecated": false,
            "matched": [
              {
                "key": "canvasName",
                "highlightString": "<span class='highlight-string'>query</span>"
              },
              {
                "key": "summary",
                "highlightString": "<span class='highlight-string'>Query</span> Data Using 'json-query' Format"
              },
              {
                "key": "description",
                "highlightString": "<span class='highlight-string'>Query</span> data using a dot/bracket notation string and a matching key/value pair."
              }
            ],
            "groups": [],
            "x": -0.2217453505007153,
            "y": 0.4914361001317523,
            "scheduled": false
          },
          "b3ba": {
            "name": "setObjectKey",
            "canvasName": "setObjectKey",
            "summary": "Construct Deployment Body",
            "description": "Set an object key to construct deployment body for cloudify",
            "location": "Application",
            "locationType": null,
            "app": "WorkFlowEngine",
            "type": "automatic",
            "displayName": "Object",
            "variables": {
              "incoming": {
                "obj": "$var.a4f4.output",
                "path": [
                  "inputs"
                ],
                "value": "$var.bda8.output"
              },
              "outgoing": {
                "object": null
              },
              "error": ""
            },
            "deprecated": false,
            "matched": [
              {
                "key": "canvasName",
                "highlightString": "<span class='highlight-string'>setObject</span>Key"
              }
            ],
            "groups": [],
            "actor": "Pronghorn",
            "x": -0.04409448818897638,
            "y": 0.4768856447688564,
            "scheduled": false
          },
          "fd4b": {
            "name": "ViewData",
            "canvasName": "ViewData",
            "summary": "View error response from createDeployment",
            "description": "View error response from createDeployment",
            "location": "Application",
            "app": "WorkFlowEngine",
            "displayName": "Tools",
            "type": "manual",
            "variables": {
              "incoming": {
                "header": "",
                "message": "",
                "body": "$var.5b61.return_data",
                "btn_success": "Terminate",
                "btn_failure": ""
              },
              "outgoing": {},
              "error": ""
            },
            "view": "/workflow_engine/task/ViewData",
            "deprecated": false,
            "matched": [
              {
                "key": "canvasName",
                "highlightString": "<span class='highlight-string'>ViewData</span>"
              }
            ],
            "groups": [],
            "x": 0.5015748031496063,
            "y": 0.9720194647201946,
            "scheduled": false
          },
          "5b61": {
            "name": "query",
            "canvasName": "query",
            "summary": "Query response from error object",
            "description": "Query response from error object",
            "location": "Application",
            "locationType": null,
            "app": "WorkFlowEngine",
            "type": "operation",
            "displayName": "WorkFlowEngine",
            "variables": {
              "incoming": {
                "pass_on_null": true,
                "query": "response",
                "obj": "$var.job.createDeploymentError"
              },
              "outgoing": {
                "return_data": null
              },
              "error": ""
            },
            "deprecated": false,
            "matched": [
              {
                "key": "canvasName",
                "highlightString": "<span class='highlight-string'>query</span>"
              },
              {
                "key": "summary",
                "highlightString": "<span class='highlight-string'>Query</span> Data Using 'json-query' Format"
              },
              {
                "key": "description",
                "highlightString": "<span class='highlight-string'>Query</span> data using a dot/bracket notation string and a matching key/value pair."
              }
            ],
            "groups": [],
            "x": 0.2409448818897638,
            "y": 0.7724687144482366,
            "scheduled": false
          }
        },
        "transitions": {
          "4956": {
            "workflow_end": {
              "type": "standard",
              "state": "success"
            }
          },
          "6360": {},
          "8508": {
            "b823": {
              "type": "standard",
              "state": "success"
            }
          },
          "workflow_start": {
            "fa10": {
              "type": "standard",
              "state": "success"
            },
            "a4f4": {
              "type": "standard",
              "state": "success"
            },
            "eb13": {
              "type": "standard",
              "state": "success"
            }
          },
          "workflow_end": {},
          "5e4a": {
            "8e0a": {
              "type": "standard",
              "state": "success"
            },
            "61f2": {
              "type": "standard",
              "state": "success"
            },
            "5b61": {
              "type": "standard",
              "state": "error"
            }
          },
          "a060": {
            "2da2": {
              "type": "standard",
              "state": "success"
            },
            "9cbd": {
              "type": "standard",
              "state": "error"
            }
          },
          "2da2": {
            "8508": {
              "type": "standard",
              "state": "success"
            }
          },
          "8e0a": {
            "a060": {
              "type": "standard",
              "state": "success"
            }
          },
          "cb03": {
            "4956": {
              "type": "standard",
              "state": "success"
            },
            "6c31": {
              "type": "standard",
              "state": "failure"
            }
          },
          "bab5": {},
          "9cbd": {
            "a060": {
              "type": "revert",
              "state": "success"
            },
            "ee77": {
              "type": "standard",
              "state": "error"
            }
          },
          "ee77": {
            "a060": {
              "type": "revert",
              "state": "success"
            }
          },
          "6c31": {
            "8508": {
              "type": "revert",
              "state": "success"
            },
            "ddbe": {
              "type": "standard",
              "state": "error"
            }
          },
          "ddbe": {
            "8508": {
              "type": "revert",
              "state": "success"
            },
            "workflow_end": {
              "type": "standard",
              "state": "failure"
            }
          },
          "61f2": {
            "a060": {
              "type": "standard",
              "state": "success"
            }
          },
          "b823": {
            "cb03": {
              "type": "standard",
              "state": "success"
            },
            "ddbe": {
              "type": "standard",
              "state": "failure"
            }
          },
          "bda8": {
            "b3ba": {
              "type": "standard",
              "state": "success"
            }
          },
          "fa10": {
            "bda8": {
              "type": "standard",
              "state": "success"
            }
          },
          "a4f4": {
            "b3ba": {
              "type": "standard",
              "state": "success"
            }
          },
          "eb13": {
            "b3ba": {
              "type": "standard",
              "state": "success"
            }
          },
          "b3ba": {
            "5e4a": {
              "type": "standard",
              "state": "success"
            }
          },
          "fd4b": {
            "workflow_end": {
              "type": "standard",
              "state": "success"
            }
          },
          "5b61": {
            "fd4b": {
              "type": "standard",
              "state": "success"
            }
          }
        },
        "font_size": 12,
        "created": "2020-12-29T15:12:39.957Z",
        "created_by": {
          "provenance": "Local AAA",
          "username": "admin@pronghorn",
          "firstname": "admin",
          "inactive": true,
          "email": ""
        },
        "createdVersion": "5.10.4-2020.1.32.0",
        "groups": [],
        "last_updated": "2021-01-04T15:25:26.456Z",
        "last_updated_by": {
          "provenance": "Itential AAA LDAP",
          "username": "mani.chekuri",
          "firstname": "Mani",
          "inactive": false
        },
        "lastUpdatedVersion": "5.8.0",
        "type": "automation",
        "description": null,
        "tags": []
      }
    },
    {
      "type": "workflow",
      "data": {
        "name": "Cloudify Delete Deployment",
        "tasks": {
          "776": {
            "name": "reattempt",
            "canvasName": "reattempt",
            "summary": "Re-attempt delete deployment task",
            "description": "Re-attempt delete deployment task",
            "location": "Application",
            "locationType": null,
            "app": "MOP",
            "type": "automatic",
            "displayName": "MOP",
            "variables": {
              "incoming": {
                "job_id": "2",
                "attemptID": "2",
                "minutes": 1,
                "attempts": 10
              },
              "outgoing": {
                "response": null
              },
              "error": ""
            },
            "deprecated": false,
            "matched": [
              {
                "key": "canvasName",
                "highlightString": "<span class='highlight-string'>reattempt</span>"
              }
            ],
            "groups": [],
            "actor": "Pronghorn",
            "x": 0.5307086614173229,
            "y": 0.161547212741752,
            "scheduled": false
          },
          "5698": {
            "name": "query",
            "canvasName": "query",
            "summary": "Query response from error object",
            "description": "Query response from error object",
            "location": "Application",
            "locationType": null,
            "app": "WorkFlowEngine",
            "type": "operation",
            "displayName": "WorkFlowEngine",
            "variables": {
              "incoming": {
                "pass_on_null": true,
                "query": "response",
                "obj": "$var.job.deleteExecutionError"
              },
              "outgoing": {
                "return_data": null
              },
              "error": ""
            },
            "deprecated": false,
            "matched": [
              {
                "key": "canvasName",
                "highlightString": "<span class='highlight-string'>query</span>"
              },
              {
                "key": "summary",
                "highlightString": "<span class='highlight-string'>Query</span> Data Using 'json-query' Format"
              },
              {
                "key": "description",
                "highlightString": "<span class='highlight-string'>Query</span> data using a dot/bracket notation string and a matching key/value pair."
              }
            ],
            "groups": [],
            "x": 0.27874015748031494,
            "y": 0.6325369738339022,
            "scheduled": false
          },
          "8539": {
            "name": "delay",
            "summary": "Delay a Job",
            "description": "Delay a Job for a duration by Job ID and number of seconds.",
            "location": "Application",
            "locationType": null,
            "app": "WorkFlowEngine",
            "displayName": "WorkFlowEngine",
            "type": "operation",
            "variables": {
              "incoming": {
                "time": 60
              },
              "outgoing": {
                "time_in_milliseconds": null
              },
              "error": ""
            },
            "deprecated": false,
            "matched": [
              {
                "key": "name",
                "highlightString": "<span class='highlight-string'>delay</span>"
              },
              {
                "key": "summary",
                "highlightString": "<span class='highlight-string'>Delay</span> a Job"
              },
              {
                "key": "description",
                "highlightString": "<span class='highlight-string'>Delay</span> a Job for a duration by Job ID and number of seconds."
              }
            ],
            "groups": [],
            "x": 0.32809952445652174,
            "y": 0.48940397350993375,
            "scheduled": false
          },
          "workflow_start": {
            "name": "workflow_start",
            "groups": [],
            "x": -0.02503576537911302,
            "y": 0.49407114624505927
          },
          "workflow_end": {
            "name": "workflow_end",
            "groups": [],
            "x": 0.8338582677165355,
            "y": 0.46757679180887374
          },
          "8e0a": {
            "name": "makeData",
            "summary": "Delete Payload",
            "description": "Make Data payload for Delete Payload",
            "location": "Application",
            "locationType": null,
            "app": "WorkFlowEngine",
            "displayName": "Tools",
            "type": "automatic",
            "variables": {
              "incoming": {
                "input": "{\"deployment_id\":\"<!deploymentId!>\",\"workflow_id\":\"uninstall\",\"ignore_failure\":\"true\"}",
                "outputType": "json",
                "variables": "$var.job.formData"
              },
              "outgoing": {
                "output": null
              },
              "error": ""
            },
            "deprecated": false,
            "matched": [
              {
                "key": "name",
                "highlightString": "<span class='highlight-string'>makeData</span>"
              }
            ],
            "groups": [],
            "actor": "Pronghorn",
            "x": 0.11811594202898551,
            "y": 0.49403973509933774,
            "scheduled": false
          },
          "c4a8": {
            "name": "deleteDeployment",
            "summary": "deleteDeployment",
            "description": "deleteDeployment",
            "location": "Adapter",
            "locationType": "Cloudify",
            "app": "Cloudify",
            "displayName": "Cloudify",
            "type": "automatic",
            "variables": {
              "incoming": {
                "include": "",
                "deleteLogs": "",
                "deploymentId": "$var.cd0e.return_data",
                "adapter_id": "adapter-cloudify"
              },
              "outgoing": {
                "result": null
              },
              "error": "$var.job.deleteDeploymentError"
            },
            "deprecated": false,
            "matched": [
              {
                "key": "name",
                "highlightString": "<span class='highlight-string'>deleteDepl</span>oyment"
              },
              {
                "key": "summary",
                "highlightString": "<span class='highlight-string'>deleteDepl</span>oyment"
              },
              {
                "key": "description",
                "highlightString": "<span class='highlight-string'>deleteDepl</span>oyment"
              }
            ],
            "groups": [],
            "actor": "Pronghorn",
            "x": 0.4623188405797101,
            "y": 0.48741721854304637,
            "scheduled": false
          },
          "bf65": {
            "name": "startExecution",
            "summary": "Delete Execution",
            "description": "startExecution for delete",
            "location": "Adapter",
            "locationType": "Cloudify",
            "app": "Cloudify",
            "displayName": "Cloudify",
            "type": "automatic",
            "variables": {
              "incoming": {
                "include": "",
                "body": "$var.8e0a.output",
                "adapter_id": "adapter-cloudify"
              },
              "outgoing": {
                "result": null
              },
              "error": "$var.job.deleteExecutionError"
            },
            "deprecated": false,
            "matched": [
              {
                "key": "name",
                "highlightString": "<span class='highlight-string'>startE</span>xecution"
              },
              {
                "key": "summary",
                "highlightString": "<span class='highlight-string'>startE</span>xecution"
              },
              {
                "key": "description",
                "highlightString": "<span class='highlight-string'>startE</span>xecution"
              }
            ],
            "groups": [],
            "actor": "Pronghorn",
            "x": 0.2246376811594203,
            "y": 0.4847682119205298,
            "scheduled": false
          },
          "cd0e": {
            "name": "query",
            "canvasName": "query",
            "summary": "Query DeploymentId",
            "description": "Query deploymentId from formData",
            "location": "Application",
            "locationType": null,
            "app": "WorkFlowEngine",
            "displayName": "WorkFlowEngine",
            "type": "operation",
            "variables": {
              "incoming": {
                "pass_on_null": false,
                "query": "deploymentId",
                "obj": "$var.job.formData"
              },
              "outgoing": {
                "return_data": null
              },
              "error": ""
            },
            "deprecated": false,
            "matched": [
              {
                "key": "canvasName",
                "highlightString": "<span class='highlight-string'>query</span>"
              },
              {
                "key": "summary",
                "highlightString": "<span class='highlight-string'>Query</span> Data Using 'json-query' Format"
              },
              {
                "key": "description",
                "highlightString": "<span class='highlight-string'>Query</span> data using a dot/bracket notation string and a matching key/value pair."
              }
            ],
            "groups": [],
            "x": 0.032904148783977114,
            "y": 0.49538866930171277,
            "scheduled": false
          },
          "3f4f": {
            "name": "ViewData",
            "canvasName": "ViewData",
            "summary": "View response from delete Execution",
            "description": "View response from delete Execution",
            "location": "Application",
            "app": "WorkFlowEngine",
            "displayName": "Tools",
            "type": "manual",
            "variables": {
              "incoming": {
                "header": "",
                "message": "",
                "body": "$var.5698.return_data",
                "btn_success": "Terminate",
                "btn_failure": ""
              },
              "outgoing": {},
              "error": ""
            },
            "view": "/workflow_engine/task/ViewData",
            "deprecated": false,
            "matched": [
              {
                "key": "canvasName",
                "highlightString": "<span class='highlight-string'>ViewData</span>"
              }
            ],
            "groups": [],
            "x": 0.4094488188976378,
            "y": 0.6837315130830489,
            "scheduled": false
          },
          "7c4f": {
            "name": "ViewData",
            "canvasName": "ViewData",
            "summary": "View Data",
            "description": "Displays a message and runtime data to an operator. This can be used to request a decision, or used for acknowledgement only.",
            "location": "Application",
            "app": "WorkFlowEngine",
            "displayName": "Tools",
            "type": "manual",
            "variables": {
              "incoming": {
                "header": "Cloudify delete deployment failure",
                "message": "Could not delete cloudify deployment.\nPlease review and retry.",
                "body": "$var.d2b2.return_data",
                "btn_success": "Retry",
                "btn_failure": "Terminate"
              },
              "outgoing": {},
              "error": ""
            },
            "view": "/workflow_engine/task/ViewData",
            "deprecated": false,
            "matched": [
              {
                "key": "canvasName",
                "highlightString": "<span class='highlight-string'>ViewData</span>"
              }
            ],
            "groups": [],
            "x": 0.7370078740157481,
            "y": 0.3503981797497156,
            "scheduled": false
          },
          "d2b2": {
            "name": "query",
            "canvasName": "query",
            "summary": "Query response from error object",
            "description": "Query response from error object from delete deployment",
            "location": "Application",
            "locationType": null,
            "app": "WorkFlowEngine",
            "type": "operation",
            "displayName": "WorkFlowEngine",
            "variables": {
              "incoming": {
                "pass_on_null": true,
                "query": "response",
                "obj": "$var.job.deleteDeploymentError"
              },
              "outgoing": {
                "return_data": null
              },
              "error": ""
            },
            "deprecated": false,
            "matched": [
              {
                "key": "canvasName",
                "highlightString": "<span class='highlight-string'>query</span>"
              },
              {
                "key": "summary",
                "highlightString": "<span class='highlight-string'>Query</span> Data Using 'json-query' Format"
              },
              {
                "key": "description",
                "highlightString": "<span class='highlight-string'>Query</span> data using a dot/bracket notation string and a matching key/value pair."
              }
            ],
            "groups": [],
            "x": 0.6653543307086615,
            "y": 0.24687144482366324,
            "scheduled": false
          }
        },
        "transitions": {
          "776": {
            "8539": {
              "type": "revert",
              "state": "success"
            },
            "d2b2": {
              "type": "standard",
              "state": "error"
            }
          },
          "5698": {
            "3f4f": {
              "type": "standard",
              "state": "success"
            }
          },
          "6360": {},
          "8539": {
            "c4a8": {
              "type": "standard",
              "state": "success"
            }
          },
          "workflow_start": {
            "cd0e": {
              "type": "standard",
              "state": "success"
            }
          },
          "workflow_end": {},
          "8e0a": {
            "bf65": {
              "type": "standard",
              "state": "success"
            }
          },
          "bab5": {},
          "c4a8": {
            "776": {
              "type": "standard",
              "state": "error"
            },
            "workflow_end": {
              "type": "standard",
              "state": "success"
            }
          },
          "bf65": {
            "5698": {
              "type": "standard",
              "state": "error"
            },
            "8539": {
              "type": "standard",
              "state": "success"
            }
          },
          "cd0e": {
            "8e0a": {
              "type": "standard",
              "state": "success"
            }
          },
          "3f4f": {
            "workflow_end": {
              "type": "standard",
              "state": "success"
            }
          },
          "7c4f": {
            "8539": {
              "type": "revert",
              "state": "success"
            },
            "workflow_end": {
              "type": "standard",
              "state": "failure"
            }
          },
          "d2b2": {
            "7c4f": {
              "type": "standard",
              "state": "success"
            }
          }
        },
        "font_size": 12,
        "created": "2020-01-29T21:19:45.078Z",
        "created_by": {
          "provenance": "Local AAA",
          "username": "admin@pronghorn",
          "firstname": "admin",
          "inactive": true,
          "email": ""
        },
        "createdVersion": "4.5.3-2019.2.9.0",
        "groups": [],
        "last_updated": "2021-01-04T15:49:32.021Z",
        "last_updated_by": {
          "provenance": "Itential AAA LDAP",
          "username": "mani.chekuri",
          "firstname": "Mani",
          "inactive": false
        },
        "lastUpdatedVersion": "5.10.4-2020.1.39.0",
        "type": "automation",
        "description": null,
        "tags": []
      }
    },
    {
      "type": "json-forms",
      "data": {
        "id": "5e7cc1749e503f07b099bf3c",
        "created": "2020-03-26T14:51:32.822Z",
        "createdBy": "mani.chekuri",
        "lastUpdated": "2020-12-31T21:58:05.793Z",
        "lastUpdatedBy": "mani.chekuri",
        "name": "Cloudify Create Deployment",
        "description": "Create a Cloudify Deployment",
        "struct": {
          "type": "object",
          "description": "",
          "items": [
            {
              "nodeId": "90ca4a48-ae8b-4738-982b-5dece00907c4",
              "type": "string",
              "title": "Deployment ID",
              "description": "Unique Deployment ID for instantiation. Must begin with a letter.",
              "placeholder": "",
              "required": true,
              "pattern": "^[a-zA-Z]"
            },
            {
              "nodeId": "e32a0a3a-cce6-45b2-8459-ed386461910d",
              "type": "string",
              "title": "Blueprint ID",
              "description": "ID for the Cloudify Blueprint",
              "placeholder": "",
              "required": true
            },
            {
              "nodeId": "08fe0575-3dd6-4d40-afe6-9da6c4ead6a0",
              "type": "string",
              "widget": "textarea",
              "title": "Inputs",
              "description": "JSON object of inputs for Cloudify blueprint. If no inputs enter an empty object {}",
              "placeholder": "",
              "required": false
            }
          ]
        },
        "schema": {
          "title": "Cloudify Create Deployment",
          "description": "Create a Cloudify Deployment",
          "type": "object",
          "required": [
            "deploymentId",
            "blueprintId"
          ],
          "properties": {
            "deploymentId": {
              "type": "string",
              "title": "Deployment ID",
              "description": "Unique Deployment ID for instantiation. Must begin with a letter.",
              "pattern": "^[a-zA-Z]"
            },
            "blueprintId": {
              "type": "string",
              "title": "Blueprint ID",
              "description": "ID for the Cloudify Blueprint"
            },
            "inputs": {
              "type": "string",
              "title": "Inputs",
              "description": "JSON object of inputs for Cloudify blueprint. If no inputs enter an empty object {}"
            }
          }
        },
        "uiSchema": {
          "inputs": {
            "ui:widget": "textarea",
            "ui:maxHeight": 500
          }
        },
        "bindingSchema": {},
        "validationSchema": {},
        "version": "2020.1"
      }
    },
    {
      "type": "json-forms",
      "data": {
        "id": "5e7a585530ee88247759a10c",
        "created": "2020-03-24T18:58:29.083Z",
        "createdBy": "mani.chekuri",
        "lastUpdated": "2020-12-31T21:58:36.840Z",
        "lastUpdatedBy": "mani.chekuri",
        "name": "Cloudify Delete Deployment",
        "description": "Delete a Cloudify deployment",
        "struct": {
          "type": "object",
          "description": "",
          "items": [
            {
              "nodeId": "231d1c5c-86c6-4c3b-b2c6-caf47bd1bcf8",
              "type": "string",
              "title": "Deployment ID",
              "description": "Deployment ID of Cloudify Deployment. Must begin with a letter.",
              "placeholder": "",
              "required": true,
              "pattern": "^[a-zA-Z]"
            }
          ]
        },
        "schema": {
          "title": "Cloudify Delete Deployment",
          "description": "Delete a Cloudify deployment",
          "type": "object",
          "required": [
            "deploymentId"
          ],
          "properties": {
            "deploymentId": {
              "type": "string",
              "title": "Deployment ID",
              "description": "Deployment ID of Cloudify Deployment. Must begin with a letter.",
              "pattern": "^[a-zA-Z]"
            }
          }
        },
        "uiSchema": {},
        "bindingSchema": {},
        "validationSchema": {},
        "version": "2020.1"
      }
    }
  ],
  "readme": "<!-- This is a comment in md (Markdown. format, it will not be visible to the end user -->\n\n<!-- Update the below line with your Pre-Built name -->\n# Cloudify Create Delete Deployment\n\n<!-- Leave TOC intact unless you've added or removed headers -->\n## Table of Contents\n\n* [Overview](#overview)\n* [Main Workflow](#main-workflow)\n* [Requirements](#requirements)\n* [How to Install](#how-to-install)\n* [How to Run](#how-to-run)\n* [Additional Information](#additional-information)\n\n## Overview\n\nThe **Cloudify Create Delete Deployment** pre-built consists of workflows to create and delete deployments on Cloudify Manager.\nThis pre-built was designed and tested using a Cloudify Manager instance downloaded as a Docker image with the created container running on an Itential DSUP server. Consequently, this pre-built should create and delete deployments on any Cloudify instance with little to no modification. The service configuration of the corresponding adapter instance must be verified on IAP if Cloudify Manager is served on a different host.\n\n_Estimated Run Time_: 3 minutes\n\n## Main Workflows\n\nPictured below are the main workflows for the creation and deletion of deployments on Cloudify Manager.\n\n**Create Deployment**\n\n<table><tr><td>\n  <img src=\"https://gitlab.com/itentialopensource/pre-built-automations/cloudify-create-delete-deployment/-/raw/master/images/create_deployment.png\" alt=\"Create Deployment\" width=\"600px\">\n</td></tr></table>\n\nBelow is an explanation for each of the numbered tasks in the create deployment workflow, respectively:\n\n1. Query form data from inputs.\n2. Query form data for deployment id.\n3. Set-up the input object from the form data to be provided to the tasks to perform a create deployment operation.\n4. Set-up data by converting inputs from form data to JSON.\n5. Set an object key to construct a deployment body for Cloudify.\n6. Create deployment task for Cloudify which creates the deployment in Cloudify Manager.\n7. Make data payload for the Cloudify start execution task.\n8. A delay of 30 seconds for Cloudify to get ready.\n9. Query response from the error object from the createDeployment task.\n10. Execute a workflow on a given deployment.\n11. Retry execution for a specific number of times if start execution errors out.\n12. Query execution id to be used in further tasks.\n13. Show response from start execution failure and an option to retry start execution task.\n14. Retrieve information for a specific execution.\n15. View error response from the create deployment task.\n16. Run an evaluation to check status for failure.\n17. Run an evaluation to check status for terminated.\n18. Retry the status check or get execution task.\n19. The status check or get execution task has not passed for the deployment.\n20. Get deployments outputs from Cloudify.\n\n**Delete Deployment**\n\n<table><tr><td>\n  <img src=\"https://gitlab.com/itentialopensource/pre-built-automations/cloudify-create-delete-deployment/-/raw/master/images/delete_deployment.png\" alt=\"Delete Deployment\" width=\"600px\">\n</td></tr></table>\n\nBelow is an explanation for each of the numbered tasks in the delete deployment workflow, respectively:\n\n1. Query deployment id from form data to be used in the workflow.\n2. Make data payload for the Cloudify delete execution task.\n3. Execute a workflow on a given deployment.\n4. A delay of 60 seconds for Cloudify to get ready.\n5. Query response from the error object from the delete execution task.\n6. Delete Cloudify deployment task which deletes the deployment in Cloudify Manager.\n7. Retry delete deployment task if it errors out.\n8. Query response from error object from the delete deployment.\n9. View response from Cloudify delete deployment failure.\n10. View response from error object from the delete execution task.\n\n\n## Requirements\nPre-requisites to use the Cloudify Create Delete Deployment include:\n\n- Itential Automation Platform\n  - ^2021.2\n\n- Cloudify Manager\n  - A Cloudify Manager instance running on a local machine or dedicated server.\n  - Service configuration to setup an adapter in IAP to connect to Cloudify Manager.\n  - A blueprint must be available on Cloudify Manager to be used in the form to create and delete deployments.\n\n\n## How to Install\nTo install the Pre-Built:\n\n* Verify you are running a supported version of the Itential Automation Platform (IAP) as listed above in the [Requirements](#requirements) section in order to install the Pre-Built.\n* The Pre-Built can be installed from within Pre-builts catalog. Simply search for the name of your desired Pre-Built and click the install button (as shown below).\n\n\n<table><tr><td>\n  <img src=\"https://gitlab.com/itentialopensource/pre-built-automations/cloudify-create-delete-deployment/-/raw/master/images/install.png\" alt=\"install\" width=\"600px\">\n</td></tr></table>\n\n* After the notification displays to inform you the Pre-built has been installed, you should be able to navigate to **Operations Mangager** and verify the **Cloudify Create Delete Deployment** item has been successfully installed.\n* Alternatively, you may clone this repository and run `npm pack` to create a tarball which can then be installed via the offline installer in **App-Artifacts**. Please consult the **App-Artifacts** documentation for further information.\n\n## How to Run\n\nUse of this Pre-Built assumes there is a Cloudify Manager instance running and available to perform create and delete deployment operations.\n\n* Once Cloudify Manager is up and running, an adapter instance of the same can be added from the **Settings→Services→Adapters** section in IAP.\n* Once the adapter instance is added and the adapter status and connection shows as green (active) under the **Settings→System→Adapters** menu in IAP, the create/delete deployment job can be started from Operations Manager. \n* A unique deployment id which starts with a letter must be given, and the name of the blueprint previously uploaded to Cloudify Manager must also be provided. \n* If no further input options are needed, an empty object {} must be provided in the inputs field. To explore further input options for Cloudify deployment, please refer to the official [Cloudify](https://docs.cloudify.co/latest/) documentation.\n* For the delete deployment operation, the deployment id that is already created and visible in your Cloudify Manager instance must be provided.\n\n***Run Automation Dialog***\n\n<table><tr><td>\n  <img src=\"https://gitlab.com/itentialopensource/pre-built-automations/cloudify-create-delete-deployment/-/raw/master/images/how_to_run.png\" alt=\"install\" width=\"600px\">\n</td></tr></table>\n\n***Cloudify Manager Console***\n\n<table><tr><td>\n  <img src=\"https://gitlab.com/itentialopensource/pre-built-automations/cloudify-create-delete-deployment/-/raw/master/images/cloudify_manager.png\" alt=\"install\" width=\"600px\">\n</td></tr></table>\n\n\n## Test Environment\nThis pre-built was tested on a Cloudify Manager instance running on Itential's internal server and respective adapter instance setup on the Itential's  Automation platform. \nAll testing was conducted using version 2020.2 of the Itential Automation Platform.\n\n## Additional Information\n\nPlease use your Itential Customer Success account if you need support when using this Pre-Built.\n"
}