{
  "name": "Perform Device Connection",
  "tasks": {
    "workflow_start": {
      "name": "workflow_start",
      "groups": [],
      "nodeLocation": {
        "x": -600,
        "y": -288
      },
      "x": 0,
      "y": 0.5
    },
    "workflow_end": {
      "name": "workflow_end",
      "groups": [],
      "nodeLocation": {
        "x": 552,
        "y": -288
      },
      "x": 1,
      "y": 0.5
    },
    "b412": {
      "name": "isAlive",
      "canvasName": "isAlive",
      "summary": "Test Device Connection",
      "description": "Test Device Connection",
      "location": "Application",
      "locationType": null,
      "app": "ConfigurationManager",
      "type": "automatic",
      "displayName": "ConfigurationManager",
      "variables": {
        "incoming": {
          "name": "$var.job.deviceName"
        },
        "outgoing": {
          "status": ""
        }
      },
      "actor": "Pronghorn",
      "groups": [],
      "nodeLocation": {
        "x": -24,
        "y": -288
      }
    },
    "f065": {
      "name": "reattempt",
      "canvasName": "reattempt",
      "summary": "Retry Device Connection Test",
      "description": "Reattempt to test device connection after waiting the specified number of minutes",
      "location": "Application",
      "locationType": null,
      "app": "MOP",
      "type": "automatic",
      "displayName": "MOP",
      "variables": {
        "incoming": {
          "job_id": "$var.job._id",
          "attemptID": "retry_test_connection",
          "minutes": 2,
          "attempts": 12
        },
        "outgoing": {
          "response": ""
        }
      },
      "actor": "Pronghorn",
      "groups": [],
      "nodeLocation": {
        "x": -24,
        "y": -180
      }
    },
    "7d17": {
      "name": "evaluation",
      "canvasName": "evaluation",
      "summary": "Check If Device Is Alive",
      "description": "Check If Device Is Alive",
      "location": "Application",
      "locationType": null,
      "app": "WorkFlowEngine",
      "type": "operation",
      "displayName": "WorkFlowEngine",
      "variables": {
        "incoming": {
          "all_true_flag": false,
          "evaluation_groups": [
            {
              "all_true_flag": false,
              "evaluations": [
                {
                  "operand_1": {
                    "task": "b412",
                    "variable": "status"
                  },
                  "operand_2": {
                    "task": "static",
                    "variable": true
                  },
                  "operator": "==",
                  "query": "response",
                  "rightQuery": ""
                },
                {
                  "operand_1": {
                    "task": "b412",
                    "variable": "status"
                  },
                  "operand_2": {
                    "task": "static",
                    "variable": true
                  },
                  "operator": "contains",
                  "query": "",
                  "rightQuery": ""
                }
              ]
            }
          ]
        },
        "outgoing": {
          "return_value": ""
        }
      },
      "actor": "Pronghorn",
      "groups": [],
      "nodeLocation": {
        "x": 300,
        "y": -288
      }
    },
    "f629": {
      "name": "delay",
      "canvasName": "delay",
      "summary": "Delay Device Connection Test",
      "description": "Delay device connection testing for a duration by Job ID and number of seconds.",
      "location": "Application",
      "locationType": null,
      "app": "WorkFlowEngine",
      "type": "operation",
      "displayName": "WorkFlowEngine",
      "variables": {
        "incoming": {
          "time": 400
        },
        "outgoing": {
          "time_in_milliseconds": ""
        }
      },
      "actor": "Pronghorn",
      "groups": [],
      "nodeLocation": {
        "x": -348,
        "y": -288
      }
    }
  },
  "transitions": {
    "workflow_start": {
      "f629": {
        "state": "success",
        "type": "standard"
      }
    },
    "workflow_end": {},
    "b412": {
      "f065": {
        "type": "standard",
        "state": "error"
      },
      "7d17": {
        "state": "success",
        "type": "standard"
      }
    },
    "f065": {
      "b412": {
        "state": "success",
        "type": "revert"
      }
    },
    "7d17": {
      "workflow_end": {
        "state": "success",
        "type": "standard"
      },
      "f065": {
        "type": "standard",
        "state": "failure"
      }
    },
    "f629": {
      "b412": {
        "state": "success",
        "type": "standard"
      }
    }
  },
  "inputSchema": {
    "type": "object",
    "properties": {
      "deviceName": {
        "type": [
          "array",
          "boolean",
          "null",
          "number",
          "object",
          "string"
        ]
      },
      "_id": {
        "title": "job_id",
        "type": "string",
        "examples": [
          "test"
        ]
      }
    },
    "required": [
      "deviceName",
      "_id"
    ]
  },
  "outputSchema": {
    "type": "object",
    "properties": {
      "deviceName": {
        "type": [
          "array",
          "boolean",
          "null",
          "number",
          "object",
          "string"
        ]
      },
      "_id": {
        "type": "string",
        "pattern": "^[0-9a-f]{24}$"
      },
      "initiator": {
        "type": "string"
      }
    }
  },
  "canvasVersion": 3,
  "type": "automation",
  "font_size": 12,
  "errorHandler": null,
  "preAutomationTime": 0,
  "sla": 0,
  "last_updated": "2024-02-06T17:01:19.599Z",
  "lastUpdatedVersion": "5.46.0-2023.1.19.0",
  "created": "2024-02-02T21:37:24.636Z",
  "created_by": {
    "provenance": "local_aaa",
    "username": "admin@pronghorn",
    "firstname": "admin",
    "inactive": false
  },
  "createdVersion": "5.46.0-2023.1.19.0",
  "last_updated_by": {
    "provenance": "local_aaa",
    "username": "admin@pronghorn",
    "firstname": "admin",
    "inactive": false
  },
  "tags": [],
  "groups": [],
  "migrationVersion": 2
}