{
  "tags": [],
  "name": "NXOS - Show Version",
  "os": "",
  "passRule": true,
  "ignoreWarnings": false,
  "commands": [
    {
      "command": "show version",
      "passRule": true,
      "rules": [
        {
          "rule": "<!version!>",
          "eval": "contains",
          "severity": "error"
        }
      ]
    }
  ],
  "created": 1661440272059,
  "createdBy": "mike.elrom@itential.com",
  "lastUpdated": 1706812946165,
  "lastUpdatedBy": "admin@pronghorn"
}