{
  "metadata": {
    "name": "@itentialopensource/cisco-nx-os-iag",
    "version": "2.0.6",
    "description": "This Pre-Built Automation bundle contains several example use cases that are applicable when the Itential Automation Platform is integrated with Cisco NX-OS using the device CLI. Because every environment is different, these use cases are fully functioning examples that can be easily modified to operate in your specific environment. These workflows have been written with modularity in mind to make them easy to understand and simple to modify to suit your needs.",
    "license": "Apache-2.0",
    "repository": {
      "type": "gitlab",
      "hostname": "gitlab.com",
      "path": "itentialopensource/pre-built-automations"
    },
    "keywords": [
      "Itential",
      "IAP"
    ],
    "author": "Itential",
    "IAPDependencies": {
      "@itential/adapter-automation_gateway": ""
    },
    "gitlabId": 18470293
  },
  "manifest": {
    "bundleName": "@local/nx-os-upgrade-consolidated",
    "fingerprint": "63b83ead14183f00f62227d3",
    "createdEpoch": "1673019053139",
    "artifacts": [
      {
        "id": "Software Upgrade - NX-OS",
        "name": "Software Upgrade - NX-OS",
        "type": "workflow",
        "location": "/bundles/workflows/Software Upgrade - NX-OS.json",
        "properties": {
          "entryPoint": false
        }
      },
      {
        "id": "Command Template Runner",
        "name": "Command Template Runner",
        "type": "workflow",
        "location": "/bundles/workflows/Command Template Runner.json",
        "properties": {
          "entryPoint": false
        }
      },
      {
        "id": "Perform Device Connection",
        "name": "Perform Device Connection",
        "type": "workflow",
        "location": "/bundles/workflows/Perform Device Connection.json",
        "properties": {
          "entryPoint": false
        }
      },
      {
        "id": "NXOS - File Verification",
        "name": "NXOS - File Verification",
        "type": "mop-template",
        "location": "/bundles/mop_templates/NXOS - File Verification.json",
        "properties": {
          "entryPoint": false
        }
      },
      {
        "id": "NXOS - Install",
        "name": "NXOS - Install",
        "type": "mop-template",
        "location": "/bundles/mop_templates/NXOS - Install.json",
        "properties": {
          "entryPoint": false
        }
      },
      {
        "id": "NXOS - Show Version",
        "name": "NXOS - Show Version",
        "type": "mop-template",
        "location": "/bundles/mop_templates/NXOS - Show Version.json",
        "properties": {
          "entryPoint": false
        }
      },
      {
        "id": "NXOS - Software Upgrade Checks",
        "name": "NXOS - Software Upgrade Checks",
        "type": "mop-template",
        "location": "/bundles/mop_templates/NXOS - Software Upgrade Checks.json",
        "properties": {
          "entryPoint": false
        }
      },
      {
        "id": "65bbf1901205fc02995dbf33",
        "name": "Software Upgrade - NX-OS",
        "type": "transformation",
        "location": "/bundles/transformations/Software Upgrade - NX-OS.json",
        "properties": {
          "entryPoint": false
        }
      },
      {
        "id": "6553e5b9fb4afe017442d30c",
        "name": "Create Command Template Runner Error Message",
        "type": "transformation",
        "location": "/bundles/transformations/Create Command Template Runner Error Message.json",
        "properties": {
          "entryPoint": false
        }
      }
    ]
  },
  "bundles": [
    {
      "type": "workflow",
      "data": {
        "name": "Software Upgrade - NX-OS",
        "tasks": {
          "3997": {
            "name": "transformation",
            "canvasName": "transformation",
            "summary": "Software Upgrade - NX-OS",
            "description": "Software Upgrade - NX-OS",
            "location": "Application",
            "locationType": null,
            "app": "WorkFlowEngine",
            "type": "operation",
            "displayName": "WorkFlowEngine",
            "variables": {
              "incoming": {
                "tr_id": "65bbf1901205fc02995dbf33",
                "variableMap": {
                  "version": "$var.job.version",
                  "flashMemory": "$var.job.flashMemory"
                },
                "options": {
                  "extractOutput": true,
                  "validateIncoming": true,
                  "revertToDefaultValue": true
                }
              },
              "outgoing": {
                "templateVariables": null
              },
              "decorators": []
            },
            "actor": "Pronghorn",
            "groups": [],
            "nodeLocation": {
              "x": -756,
              "y": 996
            }
          },
          "9531": {
            "name": "childJob",
            "canvasName": "childJob",
            "summary": "Verify File",
            "description": "Validate the integrity and compatibility of the software file",
            "location": "Application",
            "locationType": null,
            "app": "WorkFlowEngine",
            "type": "operation",
            "displayName": "WorkFlowEngine",
            "variables": {
              "incoming": {
                "task": "",
                "workflow": "Command Template Runner",
                "variables": {
                  "suppressSuccessMessage": {
                    "task": "job",
                    "value": "suppressSuccessMessage"
                  },
                  "suppressFailureMessage": {
                    "task": "job",
                    "value": "suppressFailureMessage"
                  },
                  "deviceName": {
                    "task": "job",
                    "value": "deviceName"
                  },
                  "templateName": {
                    "task": "static",
                    "value": "NXOS - File Verification"
                  },
                  "reattempt": {
                    "task": "static",
                    "value": false
                  },
                  "reattemptWaitTime": {
                    "task": "static",
                    "value": 0
                  },
                  "reattemptQuantity": {
                    "task": "static",
                    "value": 0
                  },
                  "_id": {
                    "task": "3997",
                    "value": "templateVariables"
                  },
                  "templateVariables": {
                    "task": "3997",
                    "value": "templateVariables"
                  }
                },
                "data_array": "",
                "transformation": "",
                "loopType": ""
              },
              "outgoing": {
                "job_details": ""
              }
            },
            "actor": "job",
            "groups": [],
            "nodeLocation": {
              "x": -432,
              "y": 996
            }
          },
          "workflow_start": {
            "name": "workflow_start",
            "groups": [],
            "x": -0.19900908340214699,
            "y": 0.5112219451371571,
            "nodeLocation": {
              "x": -996,
              "y": 996
            }
          },
          "workflow_end": {
            "name": "workflow_end",
            "groups": [],
            "x": 1.8959587274290628,
            "y": 0.46684350132625996,
            "nodeLocation": {
              "x": 2076,
              "y": 996
            }
          },
          "ed72": {
            "name": "childJob",
            "canvasName": "childJob",
            "summary": "Perform Pre-Checks",
            "description": "Perform pre-upgrade checks",
            "location": "Application",
            "locationType": null,
            "app": "WorkFlowEngine",
            "type": "operation",
            "displayName": "WorkFlowEngine",
            "variables": {
              "incoming": {
                "task": "",
                "workflow": "Command Template Runner",
                "variables": {
                  "suppressFailureMessage": {
                    "task": "job",
                    "value": "suppressFailureMessage"
                  },
                  "suppressSuccessMessage": {
                    "task": "job",
                    "value": "suppressSuccessMessage"
                  },
                  "deviceName": {
                    "task": "job",
                    "value": "deviceName"
                  },
                  "reattemptQuantity": {
                    "task": "static",
                    "value": 0
                  },
                  "reattemptWaitTime": {
                    "task": "static",
                    "value": 0
                  },
                  "reattempt": {
                    "task": "static",
                    "value": false
                  },
                  "templateVariables": {
                    "task": "3997",
                    "value": "templateVariables"
                  },
                  "templateName": {
                    "task": "static",
                    "value": "NXOS - Software Upgrade Checks"
                  },
                  "_id": {
                    "task": "9531",
                    "value": "job_details"
                  }
                },
                "data_array": "",
                "transformation": "",
                "loopType": ""
              },
              "outgoing": {
                "job_details": ""
              }
            },
            "actor": "job",
            "groups": [],
            "nodeLocation": {
              "x": -108,
              "y": 996
            }
          },
          "fc03": {
            "name": "childJob",
            "canvasName": "childJob",
            "summary": "Install",
            "description": "Execute the installation of the new software",
            "location": "Application",
            "locationType": null,
            "app": "WorkFlowEngine",
            "type": "operation",
            "displayName": "WorkFlowEngine",
            "variables": {
              "incoming": {
                "task": "",
                "workflow": "Command Template Runner",
                "variables": {
                  "suppressFailureMessage": {
                    "task": "job",
                    "value": "suppressFailureMessage"
                  },
                  "suppressSuccessMessage": {
                    "task": "job",
                    "value": "suppressSuccessMessage"
                  },
                  "templateName": {
                    "task": "static",
                    "value": "NXOS - Install"
                  },
                  "templateVariables": {
                    "task": "3997",
                    "value": "templateVariables"
                  },
                  "reattempt": {
                    "task": "static",
                    "value": false
                  },
                  "reattemptWaitTime": {
                    "task": "static",
                    "value": 0
                  },
                  "reattemptQuantity": {
                    "task": "static",
                    "value": 0
                  },
                  "deviceName": {
                    "task": "job",
                    "value": "deviceName"
                  },
                  "_id": {
                    "task": "ed72",
                    "value": "job_details"
                  }
                },
                "data_array": "",
                "transformation": "",
                "loopType": ""
              },
              "outgoing": {
                "job_details": ""
              }
            },
            "actor": "job",
            "groups": [],
            "nodeLocation": {
              "x": 216,
              "y": 996
            }
          },
          "0e7b": {
            "name": "childJob",
            "canvasName": "childJob",
            "summary": "Verify After Reload",
            "description": "Confirm the successful application of the upgraded software by performing version check",
            "location": "Application",
            "locationType": null,
            "app": "WorkFlowEngine",
            "type": "operation",
            "displayName": "WorkFlowEngine",
            "variables": {
              "incoming": {
                "task": "",
                "workflow": "Command Template Runner",
                "variables": {
                  "suppressFailureMessage": {
                    "task": "job",
                    "value": "suppressFailureMessage"
                  },
                  "suppressSuccessMessage": {
                    "task": "job",
                    "value": "suppressSuccessMessage"
                  },
                  "templateName": {
                    "task": "static",
                    "value": "NXOS - Show Version"
                  },
                  "templateVariables": {
                    "task": "3997",
                    "value": "templateVariables"
                  },
                  "reattempt": {
                    "task": "static",
                    "value": false
                  },
                  "reattemptWaitTime": {
                    "task": "static",
                    "value": 0
                  },
                  "reattemptQuantity": {
                    "task": "static",
                    "value": 0
                  },
                  "deviceName": {
                    "task": "job",
                    "value": "deviceName"
                  },
                  "_id": {
                    "task": "54c0",
                    "value": "job_details"
                  }
                },
                "data_array": "",
                "transformation": "",
                "loopType": ""
              },
              "outgoing": {
                "job_details": ""
              }
            },
            "actor": "job",
            "groups": [],
            "nodeLocation": {
              "x": 864,
              "y": 996
            }
          },
          "b0ff": {
            "name": "childJob",
            "canvasName": "childJob",
            "summary": "Perform Post-Checks",
            "description": "Perform post-upgrade checks",
            "location": "Application",
            "locationType": null,
            "app": "WorkFlowEngine",
            "type": "operation",
            "displayName": "WorkFlowEngine",
            "variables": {
              "incoming": {
                "task": "",
                "workflow": "Command Template Runner",
                "variables": {
                  "suppressFailureMessage": {
                    "task": "job",
                    "value": "suppressFailureMessage"
                  },
                  "suppressSuccessMessage": {
                    "task": "job",
                    "value": "suppressSuccessMessage"
                  },
                  "templateName": {
                    "task": "static",
                    "value": "NXOS - Software Upgrade Checks"
                  },
                  "templateVariables": {
                    "task": "3997",
                    "value": "templateVariables"
                  },
                  "reattempt": {
                    "task": "static",
                    "value": false
                  },
                  "reattemptWaitTime": {
                    "task": "static",
                    "value": 0
                  },
                  "reattemptQuantity": {
                    "task": "static",
                    "value": 0
                  },
                  "deviceName": {
                    "task": "job",
                    "value": "deviceName"
                  },
                  "_id": {
                    "task": "0e7b",
                    "value": "job_details"
                  }
                },
                "data_array": "",
                "transformation": "",
                "loopType": ""
              },
              "outgoing": {
                "job_details": ""
              }
            },
            "actor": "job",
            "groups": [],
            "nodeLocation": {
              "x": 1188,
              "y": 996
            }
          },
          "a2a3": {
            "name": "query",
            "canvasName": "query",
            "summary": "Query Pre-Checks",
            "description": "Query Pre Check",
            "location": "Application",
            "locationType": null,
            "app": "WorkFlowEngine",
            "type": "operation",
            "displayName": "WorkFlowEngine",
            "variables": {
              "incoming": {
                "pass_on_null": false,
                "query": "templateResults",
                "obj": "$var.ed72.job_details"
              },
              "outgoing": {
                "return_data": ""
              }
            },
            "actor": "Pronghorn",
            "groups": [],
            "nodeLocation": {
              "x": 1500,
              "y": 876
            }
          },
          "0f5d": {
            "name": "query",
            "canvasName": "query",
            "summary": "Query Post-Checks",
            "description": "Query Pre Check",
            "location": "Application",
            "locationType": null,
            "app": "WorkFlowEngine",
            "type": "operation",
            "displayName": "WorkFlowEngine",
            "variables": {
              "incoming": {
                "pass_on_null": false,
                "query": "templateResults",
                "obj": "$var.b0ff.job_details"
              },
              "outgoing": {
                "return_data": ""
              }
            },
            "actor": "Pronghorn",
            "groups": [],
            "nodeLocation": {
              "x": 1500,
              "y": 1104
            }
          },
          "5bd5": {
            "name": "evaluation",
            "canvasName": "evaluation",
            "summary": "Check If Suppressing Success Message",
            "description": "Check If Suppressing Success Message",
            "location": "Application",
            "locationType": null,
            "app": "WorkFlowEngine",
            "type": "operation",
            "displayName": "WorkFlowEngine",
            "variables": {
              "incoming": {
                "all_true_flag": false,
                "evaluation_groups": [
                  {
                    "all_true_flag": false,
                    "evaluations": [
                      {
                        "operand_1": {
                          "task": "job",
                          "variable": "suppressSuccessMessage"
                        },
                        "operand_2": {
                          "task": "static",
                          "variable": true
                        },
                        "operator": "==",
                        "query": "",
                        "rightQuery": ""
                      }
                    ]
                  }
                ]
              },
              "outgoing": {
                "return_value": ""
              }
            },
            "actor": "Pronghorn",
            "groups": [],
            "nodeLocation": {
              "x": 1812,
              "y": 996
            }
          },
          "d6b3": {
            "name": "runTemplatesDiff",
            "canvasName": "runTemplatesDiff",
            "summary": "Compare Pre-Post",
            "description": "Compare pre- and post-checks",
            "location": "Application",
            "app": "MOP",
            "displayName": "MOP",
            "type": "manual",
            "variables": {
              "incoming": {
                "pre": "$var.a2a3.return_data",
                "post": "$var.0f5d.return_data"
              },
              "outgoing": {}
            },
            "view": "/mop/task/runTemplatesDiff",
            "groups": [],
            "nodeLocation": {
              "x": 1812,
              "y": 876
            }
          },
          "54c0": {
            "name": "childJob",
            "canvasName": "childJob",
            "summary": "Run Device Connection",
            "description": "Test if device is alive",
            "location": "Application",
            "locationType": null,
            "app": "WorkFlowEngine",
            "type": "operation",
            "displayName": "WorkFlowEngine",
            "variables": {
              "incoming": {
                "task": "",
                "workflow": "Perform Device Connection",
                "variables": {
                  "_id": {
                    "task": "fc03",
                    "value": "job_details"
                  },
                  "deviceName": {
                    "task": "job",
                    "value": "deviceName"
                  }
                },
                "data_array": "",
                "transformation": "",
                "loopType": ""
              },
              "outgoing": {
                "job_details": ""
              }
            },
            "actor": "job",
            "groups": [],
            "nodeLocation": {
              "x": 540,
              "y": 996
            }
          }
        },
        "transitions": {
          "3997": {
            "9531": {
              "state": "success",
              "type": "standard"
            }
          },
          "9531": {
            "ed72": {
              "state": "success",
              "type": "standard"
            }
          },
          "workflow_start": {
            "3997": {
              "state": "success",
              "type": "standard"
            }
          },
          "workflow_end": {},
          "ed72": {
            "fc03": {
              "state": "success",
              "type": "standard"
            }
          },
          "fc03": {
            "54c0": {
              "state": "success",
              "type": "standard"
            }
          },
          "0e7b": {
            "b0ff": {
              "state": "success",
              "type": "standard"
            }
          },
          "b0ff": {
            "a2a3": {
              "state": "success",
              "type": "standard"
            },
            "0f5d": {
              "state": "success",
              "type": "standard"
            }
          },
          "a2a3": {
            "5bd5": {
              "state": "success",
              "type": "standard"
            }
          },
          "0f5d": {
            "5bd5": {
              "state": "success",
              "type": "standard"
            }
          },
          "5bd5": {
            "workflow_end": {
              "state": "success",
              "type": "standard"
            },
            "d6b3": {
              "type": "standard",
              "state": "failure"
            }
          },
          "d6b3": {
            "workflow_end": {
              "state": "success",
              "type": "standard"
            }
          },
          "54c0": {
            "0e7b": {
              "state": "success",
              "type": "standard"
            }
          },
          "eb55": {},
          "f92": {},
          "90d3": {},
          "5fa1": {}
        },
        "inputSchema": {
          "type": "object",
          "properties": {
            "version": {
              "$id": "version",
              "type": "string"
            },
            "flashMemory": {
              "$id": "flashMemory",
              "type": "string"
            },
            "suppressSuccessMessage": {
              "type": [
                "array",
                "boolean",
                "null",
                "number",
                "object",
                "string"
              ]
            },
            "suppressFailureMessage": {
              "type": [
                "array",
                "boolean",
                "null",
                "number",
                "object",
                "string"
              ]
            },
            "deviceName": {
              "type": [
                "array",
                "string",
                "boolean",
                "integer",
                "number",
                "object"
              ],
              "title": "elementN",
              "examples": [
                "Device3"
              ]
            }
          },
          "required": [
            "version",
            "flashMemory",
            "suppressSuccessMessage",
            "suppressFailureMessage",
            "deviceName"
          ]
        },
        "outputSchema": {
          "type": "object",
          "properties": {
            "version": {
              "$id": "version",
              "type": "string"
            },
            "flashMemory": {
              "$id": "flashMemory",
              "type": "string"
            },
            "suppressSuccessMessage": {
              "type": [
                "array",
                "boolean",
                "null",
                "number",
                "object",
                "string"
              ]
            },
            "suppressFailureMessage": {
              "type": [
                "array",
                "boolean",
                "null",
                "number",
                "object",
                "string"
              ]
            },
            "deviceName": {
              "type": [
                "array",
                "string",
                "boolean",
                "integer",
                "number",
                "object"
              ],
              "title": "elementN",
              "examples": [
                "Device3"
              ]
            },
            "_id": {
              "type": "string",
              "pattern": "^[0-9a-f]{24}$"
            },
            "initiator": {
              "type": "string"
            }
          }
        },
        "canvasVersion": 1.5,
        "createdVersion": "5.46.0-2023.1.19.0",
        "created_by": {
          "provenance": "local_aaa",
          "username": "admin@pronghorn",
          "firstname": "admin",
          "inactive": false
        },
        "font_size": 12,
        "lastUpdatedVersion": "5.46.0-2023.1.19.0",
        "preAutomationTime": 0,
        "sla": 0,
        "type": "automation",
        "last_updated": "2024-02-06T17:02:15.291Z",
        "created": "2024-02-02T20:39:14.038Z",
        "last_updated_by": {
          "provenance": "local_aaa",
          "username": "admin@pronghorn",
          "firstname": "admin",
          "inactive": false
        },
        "tags": [],
        "groups": [],
        "migrationVersion": 2
      }
    },
    {
      "type": "workflow",
      "data": {
        "name": "Command Template Runner",
        "tasks": {
          "525": {
            "name": "evaluation",
            "canvasName": "evaluation",
            "summary": "Check If Template Passed and If Suppressing Success Message",
            "description": "Check if template passed and if suppressing success message",
            "location": "Application",
            "locationType": null,
            "app": "WorkFlowEngine",
            "type": "operation",
            "displayName": "WorkFlowEngine",
            "variables": {
              "incoming": {
                "all_true_flag": false,
                "evaluation_groups": [
                  {
                    "all_true_flag": true,
                    "evaluations": [
                      {
                        "query": "",
                        "operand_1": {
                          "variable": "suppressSuccessMessage",
                          "task": "job",
                          "editable": true
                        },
                        "operator": "==",
                        "operand_2": {
                          "variable": false,
                          "task": "static"
                        }
                      },
                      {
                        "query": "result",
                        "operand_1": {
                          "variable": "mop_template_results",
                          "task": "8ce4"
                        },
                        "operator": "==",
                        "operand_2": {
                          "variable": true,
                          "task": "static"
                        }
                      }
                    ]
                  }
                ]
              },
              "outgoing": {
                "return_value": null
              }
            },
            "groups": [],
            "x": 0.353836784409257,
            "y": 0.5738188976377953,
            "nodeLocation": {
              "x": 1212,
              "y": 1152
            }
          },
          "workflow_start": {
            "name": "workflow_start",
            "groups": [],
            "x": -0.08670520231213873,
            "y": 0.4957983193277311,
            "nodeLocation": {
              "x": 324,
              "y": 1044
            }
          },
          "workflow_end": {
            "name": "workflow_end",
            "groups": [],
            "x": 0.5803897685749086,
            "y": 0.4891732283464567,
            "nodeLocation": {
              "x": 2496,
              "y": 1044
            }
          },
          "8ce4": {
            "name": "RunCommandTemplate",
            "canvasName": "RunCommandTemplate",
            "summary": "Run a Command Template against a device",
            "description": "Run a Command Template against a device",
            "location": "Application",
            "locationType": null,
            "app": "MOP",
            "type": "automatic",
            "displayName": "MOP",
            "variables": {
              "incoming": {
                "template": "$var.job.templateName",
                "variables": "$var.job.templateVariables",
                "devices": "$var.927c.pushedArray"
              },
              "outgoing": {
                "mop_template_results": "$var.job.templateResults"
              },
              "error": "$var.job.templateError",
              "decorators": []
            },
            "groups": [],
            "actor": "Pronghorn",
            "x": 0.1711092003439381,
            "y": 0.49601063829787234,
            "scheduled": false,
            "nodeLocation": {
              "x": 900,
              "y": 1044
            }
          },
          "81d8": {
            "name": "viewTemplateResults",
            "canvasName": "viewTemplateResults",
            "summary": "View Command Template Results",
            "description": "View the results of the command template",
            "location": "Application",
            "app": "MOP",
            "displayName": "MOP",
            "type": "manual",
            "variables": {
              "incoming": {
                "mop_template_results": "$var.8ce4.mop_template_results"
              },
              "outgoing": {},
              "error": "",
              "decorators": []
            },
            "view": "/mop/task/viewTemplateResults",
            "groups": [],
            "x": 0.35627283800243603,
            "y": 0.6988188976377953,
            "scheduled": false,
            "nodeLocation": {
              "x": 1212,
              "y": 1368
            }
          },
          "f1a7": {
            "name": "ViewData",
            "canvasName": "ViewData",
            "summary": "Template Error",
            "description": "Show the template failure message and decision options",
            "location": "Application",
            "app": "WorkFlowEngine",
            "displayName": "Tools",
            "type": "manual",
            "variables": {
              "incoming": {
                "header": "Template Errored",
                "message": "$var.a7f3.errorMessage",
                "body": "$var.8ce4.error",
                "variables": {},
                "btn_success": "Retry",
                "btn_failure": "Continue"
              },
              "outgoing": {},
              "error": "",
              "decorators": []
            },
            "view": "/workflow_engine/task/ViewData",
            "groups": [],
            "x": 0.48964677222898906,
            "y": 0.39960629921259844,
            "scheduled": false,
            "nodeLocation": {
              "x": 2496,
              "y": 684
            }
          },
          "543a": {
            "name": "evaluation",
            "canvasName": "evaluation",
            "summary": "Check If Template Errored and If Reattempting",
            "description": "Check if template errored and if reattempting template",
            "location": "Application",
            "locationType": null,
            "app": "WorkFlowEngine",
            "type": "operation",
            "displayName": "WorkFlowEngine",
            "variables": {
              "incoming": {
                "all_true_flag": false,
                "evaluation_groups": [
                  {
                    "all_true_flag": false,
                    "evaluations": [
                      {
                        "query": "",
                        "operand_1": {
                          "variable": "reattempt",
                          "task": "job",
                          "editable": true
                        },
                        "operator": "==",
                        "operand_2": {
                          "variable": true,
                          "task": "static"
                        }
                      }
                    ]
                  }
                ]
              },
              "outgoing": {
                "return_value": null
              }
            },
            "groups": [],
            "x": 0.3501827040194884,
            "y": 0.39960629921259844,
            "nodeLocation": {
              "x": 1212,
              "y": 876
            }
          },
          "849c": {
            "name": "reattempt",
            "canvasName": "reattempt",
            "summary": "Reattempt Template",
            "description": "Reattempt the template after waiting the specified number of minutes",
            "location": "Application",
            "locationType": null,
            "app": "MOP",
            "type": "automatic",
            "displayName": "MOP",
            "variables": {
              "incoming": {
                "job_id": "$var.job._id",
                "attemptID": "connection",
                "minutes": "$var.job.reattemptWaitTime",
                "attempts": "$var.job.reattemptQuantity"
              },
              "outgoing": {
                "response": null
              },
              "error": "",
              "decorators": []
            },
            "groups": [],
            "actor": "Pronghorn",
            "x": 0.3556638246041413,
            "y": 0.23917322834645668,
            "scheduled": false,
            "nodeLocation": {
              "x": 1212,
              "y": 684
            }
          },
          "f884": {
            "name": "evaluation",
            "canvasName": "evaluation",
            "summary": "Check If Template Failed and If Reattempting",
            "description": "Check if template failed and if reattempting template",
            "location": "Application",
            "locationType": null,
            "app": "WorkFlowEngine",
            "type": "operation",
            "displayName": "WorkFlowEngine",
            "variables": {
              "incoming": {
                "all_true_flag": false,
                "evaluation_groups": [
                  {
                    "all_true_flag": true,
                    "evaluations": [
                      {
                        "query": "result",
                        "operand_1": {
                          "variable": "mop_template_results",
                          "task": "8ce4"
                        },
                        "operator": "==",
                        "operand_2": {
                          "variable": false,
                          "task": "static"
                        }
                      },
                      {
                        "query": "",
                        "operand_1": {
                          "variable": "reattempt",
                          "task": "job",
                          "editable": true
                        },
                        "operator": "==",
                        "operand_2": {
                          "variable": true,
                          "task": "static"
                        }
                      }
                    ]
                  }
                ]
              },
              "outgoing": {
                "return_value": null
              }
            },
            "groups": [],
            "x": 0.1705237515225335,
            "y": 0.234251968503937,
            "nodeLocation": {
              "x": 900,
              "y": 684
            }
          },
          "b1a0": {
            "name": "evaluation",
            "canvasName": "evaluation",
            "summary": "Check If Template Passed and If Suppressing Success Message",
            "description": "Check if template passed and if suppressing success message",
            "location": "Application",
            "locationType": null,
            "app": "WorkFlowEngine",
            "type": "operation",
            "displayName": "WorkFlowEngine",
            "variables": {
              "incoming": {
                "all_true_flag": false,
                "evaluation_groups": [
                  {
                    "all_true_flag": true,
                    "evaluations": [
                      {
                        "query": "",
                        "operand_1": {
                          "variable": "suppressSuccessMessage",
                          "task": "job",
                          "editable": true
                        },
                        "operator": "==",
                        "operand_2": {
                          "variable": true,
                          "task": "static"
                        }
                      },
                      {
                        "query": "result",
                        "operand_1": {
                          "variable": "mop_template_results",
                          "task": "8ce4"
                        },
                        "operator": "==",
                        "operand_2": {
                          "variable": true,
                          "task": "static"
                        }
                      }
                    ]
                  }
                ]
              },
              "outgoing": {
                "return_value": null
              }
            },
            "groups": [],
            "x": 0.34995700773860705,
            "y": 0.4867021276595745,
            "nodeLocation": {
              "x": 1212,
              "y": 1044
            }
          },
          "927c": {
            "name": "arrayPush",
            "canvasName": "push",
            "summary": "Build Device Array",
            "description": "Put the device name into an array as required by the \"RunCommandTemplate\" task",
            "location": "Application",
            "locationType": null,
            "app": "WorkFlowEngine",
            "type": "automatic",
            "displayName": "Array",
            "variables": {
              "incoming": {
                "arr": [],
                "elementN": "$var.job.deviceName"
              },
              "outgoing": {
                "pushedArray": null
              },
              "error": "",
              "decorators": []
            },
            "groups": [],
            "actor": "Pronghorn",
            "x": 0.02064409578860446,
            "y": 0.49459783913565425,
            "scheduled": false,
            "nodeLocation": {
              "x": 576,
              "y": 1044
            }
          },
          "fe84": {
            "name": "evaluation",
            "canvasName": "evaluation",
            "summary": "Check If Suppressing Failure Message",
            "description": "Check if suppressing failure message",
            "location": "Application",
            "locationType": null,
            "app": "WorkFlowEngine",
            "type": "operation",
            "displayName": "WorkFlowEngine",
            "variables": {
              "incoming": {
                "all_true_flag": false,
                "evaluation_groups": [
                  {
                    "all_true_flag": true,
                    "evaluations": [
                      {
                        "operand_1": {
                          "task": "job",
                          "variable": "suppressFailureMessage"
                        },
                        "operand_2": {
                          "task": "static",
                          "variable": true
                        },
                        "operator": "==",
                        "query": "",
                        "rightQuery": ""
                      }
                    ]
                  }
                ]
              },
              "outgoing": {
                "return_value": null
              }
            },
            "groups": [],
            "x": 0.16991473812423874,
            "y": 0.6958661417322834,
            "nodeLocation": {
              "x": 900,
              "y": 1368
            }
          },
          "6bd2": {
            "name": "evaluation",
            "canvasName": "evaluation",
            "summary": "Check If Template Failed and If Not Reattempting",
            "description": "Check if template failed and if not reattempting template",
            "location": "Application",
            "locationType": null,
            "app": "WorkFlowEngine",
            "type": "operation",
            "displayName": "WorkFlowEngine",
            "variables": {
              "incoming": {
                "all_true_flag": false,
                "evaluation_groups": [
                  {
                    "all_true_flag": true,
                    "evaluations": [
                      {
                        "query": "result",
                        "operand_1": {
                          "variable": "mop_template_results",
                          "task": "8ce4"
                        },
                        "operator": "==",
                        "operand_2": {
                          "variable": false,
                          "task": "static"
                        }
                      },
                      {
                        "query": "",
                        "operand_1": {
                          "variable": "reattempt",
                          "task": "job",
                          "editable": true
                        },
                        "operator": "==",
                        "operand_2": {
                          "variable": false,
                          "task": "static"
                        }
                      }
                    ]
                  }
                ]
              },
              "outgoing": {
                "return_value": null
              }
            },
            "groups": [],
            "x": 0.16991473812423874,
            "y": 0.6958661417322834,
            "nodeLocation": {
              "x": 900,
              "y": 1152
            }
          },
          "9c18": {
            "name": "evaluation",
            "canvasName": "evaluation",
            "summary": "Check If Suppressing Failure Message",
            "description": "Check if suppressing failure message",
            "location": "Application",
            "locationType": null,
            "app": "WorkFlowEngine",
            "type": "operation",
            "displayName": "WorkFlowEngine",
            "variables": {
              "incoming": {
                "all_true_flag": false,
                "evaluation_groups": [
                  {
                    "all_true_flag": true,
                    "evaluations": [
                      {
                        "operand_1": {
                          "task": "job",
                          "variable": "suppressFailureMessage"
                        },
                        "operand_2": {
                          "task": "static",
                          "variable": true
                        },
                        "operator": "==",
                        "query": "",
                        "rightQuery": ""
                      }
                    ]
                  }
                ]
              },
              "outgoing": {
                "return_value": null
              }
            },
            "groups": [],
            "x": 0.16991473812423874,
            "y": 0.6958661417322834,
            "nodeLocation": {
              "x": 1536,
              "y": 876
            }
          },
          "955f": {
            "name": "evaluation",
            "canvasName": "evaluation",
            "summary": "Check If Suppressing Failure Message",
            "description": "Check if suppressing failure message",
            "location": "Application",
            "locationType": null,
            "app": "WorkFlowEngine",
            "type": "operation",
            "displayName": "WorkFlowEngine",
            "variables": {
              "incoming": {
                "all_true_flag": false,
                "evaluation_groups": [
                  {
                    "all_true_flag": true,
                    "evaluations": [
                      {
                        "operand_1": {
                          "task": "job",
                          "variable": "suppressFailureMessage"
                        },
                        "operand_2": {
                          "task": "static",
                          "variable": true
                        },
                        "operator": "==",
                        "query": "",
                        "rightQuery": ""
                      }
                    ]
                  }
                ]
              },
              "outgoing": {
                "return_value": null
              }
            },
            "groups": [],
            "x": 0.16991473812423874,
            "y": 0.6958661417322834,
            "nodeLocation": {
              "x": 1536,
              "y": 684
            }
          },
          "f36c": {
            "name": "viewTemplateResults",
            "canvasName": "viewTemplateResults",
            "summary": "View Command Template Results",
            "description": "View the results of the command template",
            "location": "Application",
            "app": "MOP",
            "displayName": "MOP",
            "type": "manual",
            "variables": {
              "incoming": {
                "mop_template_results": "$var.8ce4.mop_template_results"
              },
              "outgoing": {},
              "error": "",
              "decorators": []
            },
            "view": "/mop/task/viewTemplateResults",
            "groups": [],
            "x": 0.35627283800243603,
            "y": 0.6988188976377953,
            "scheduled": false,
            "nodeLocation": {
              "x": 1848,
              "y": 576
            }
          },
          "a7f3": {
            "name": "transformation",
            "canvasName": "transformation",
            "summary": "Create Command Template Runner Error Message",
            "description": "Create Command Template Runner error message",
            "location": "Application",
            "locationType": null,
            "app": "WorkFlowEngine",
            "type": "operation",
            "displayName": "WorkFlowEngine",
            "variables": {
              "incoming": {
                "tr_id": "6553e5b9fb4afe017442d30c",
                "variableMap": {
                  "templateName": "$var.job.templateName"
                },
                "options": {
                  "extractOutput": true,
                  "validateIncoming": true,
                  "revertToDefaultValue": true
                }
              },
              "outgoing": {
                "errorMessage": null
              },
              "decorators": []
            },
            "actor": "Pronghorn",
            "groups": [],
            "nodeLocation": {
              "x": 2172,
              "y": 684
            }
          },
          "580e": {
            "name": "evaluation",
            "canvasName": "evaluation",
            "summary": "Check if Template Errored",
            "description": "Check if template errored",
            "location": "Application",
            "locationType": null,
            "app": "WorkFlowEngine",
            "type": "operation",
            "displayName": "WorkFlowEngine",
            "variables": {
              "incoming": {
                "all_true_flag": false,
                "evaluation_groups": [
                  {
                    "all_true_flag": false,
                    "evaluations": [
                      {
                        "operand_1": {
                          "task": "8ce4",
                          "variable": "error"
                        },
                        "operand_2": {
                          "task": "static",
                          "variable": null
                        },
                        "operator": "!=",
                        "query": "",
                        "rightQuery": ""
                      }
                    ]
                  }
                ]
              },
              "outgoing": {
                "return_value": ""
              }
            },
            "actor": "Pronghorn",
            "groups": [],
            "nodeLocation": {
              "x": 1848,
              "y": 684
            }
          }
        },
        "transitions": {
          "525": {
            "81d8": {
              "type": "standard",
              "state": "success"
            }
          },
          "workflow_start": {
            "927c": {
              "type": "standard",
              "state": "success"
            }
          },
          "workflow_end": {},
          "8ce4": {
            "525": {
              "type": "standard",
              "state": "success"
            },
            "543a": {
              "type": "standard",
              "state": "error"
            },
            "f884": {
              "type": "standard",
              "state": "success"
            },
            "b1a0": {
              "type": "standard",
              "state": "success"
            },
            "6bd2": {
              "type": "standard",
              "state": "success"
            }
          },
          "81d8": {
            "8ce4": {
              "type": "revert",
              "state": "failure"
            },
            "workflow_end": {
              "state": "success",
              "type": "standard"
            }
          },
          "f1a7": {
            "workflow_end": {
              "type": "standard",
              "state": "failure"
            },
            "8ce4": {
              "type": "revert",
              "state": "success"
            }
          },
          "543a": {
            "849c": {
              "type": "standard",
              "state": "success"
            },
            "9c18": {
              "type": "standard",
              "state": "failure"
            }
          },
          "849c": {
            "8ce4": {
              "type": "revert",
              "state": "success"
            },
            "955f": {
              "state": "error",
              "type": "standard"
            }
          },
          "f884": {
            "849c": {
              "type": "standard",
              "state": "success"
            }
          },
          "b1a0": {
            "workflow_end": {
              "type": "standard",
              "state": "success"
            }
          },
          "927c": {
            "8ce4": {
              "type": "standard",
              "state": "success"
            }
          },
          "fe84": {
            "workflow_end": {
              "state": "success",
              "type": "standard"
            },
            "81d8": {
              "type": "standard",
              "state": "failure"
            }
          },
          "6bd2": {
            "fe84": {
              "state": "success",
              "type": "standard"
            }
          },
          "9c18": {
            "workflow_end": {
              "state": "success",
              "type": "standard"
            },
            "a7f3": {
              "type": "standard",
              "state": "failure"
            }
          },
          "955f": {
            "workflow_end": {
              "state": "success",
              "type": "standard"
            },
            "580e": {
              "state": "failure",
              "type": "standard"
            }
          },
          "f36c": {
            "8ce4": {
              "type": "revert",
              "state": "failure"
            },
            "workflow_end": {
              "state": "success",
              "type": "standard"
            }
          },
          "a7f3": {
            "f1a7": {
              "state": "success",
              "type": "standard"
            }
          },
          "580e": {
            "f36c": {
              "state": "failure",
              "type": "standard"
            },
            "a7f3": {
              "state": "success",
              "type": "standard"
            }
          }
        },
        "inputSchema": {
          "type": "object",
          "properties": {
            "suppressSuccessMessage": {
              "type": [
                "array",
                "boolean",
                "null",
                "number",
                "object",
                "string"
              ]
            },
            "templateName": {
              "title": "template",
              "type": "string",
              "examples": [
                "show version"
              ]
            },
            "templateVariables": {
              "type": [
                "array",
                "boolean",
                "null",
                "number",
                "object",
                "string"
              ]
            },
            "reattempt": {
              "type": [
                "array",
                "boolean",
                "null",
                "number",
                "object",
                "string"
              ]
            },
            "_id": {
              "title": "job_id",
              "type": "string",
              "examples": [
                "test"
              ]
            },
            "reattemptWaitTime": {
              "title": "minutes",
              "type": "integer",
              "examples": [
                1
              ]
            },
            "reattemptQuantity": {
              "title": "attempts",
              "type": "integer",
              "examples": [
                2
              ]
            },
            "deviceName": {
              "type": [
                "array",
                "string",
                "boolean",
                "integer",
                "number",
                "object"
              ],
              "title": "elementN",
              "examples": [
                "Device3"
              ]
            },
            "suppressFailureMessage": {
              "type": [
                "array",
                "boolean",
                "null",
                "number",
                "object",
                "string"
              ]
            }
          },
          "required": [
            "suppressSuccessMessage",
            "templateName",
            "templateVariables",
            "reattempt",
            "_id",
            "reattemptWaitTime",
            "reattemptQuantity",
            "deviceName",
            "suppressFailureMessage"
          ]
        },
        "outputSchema": {
          "type": "object",
          "properties": {
            "suppressSuccessMessage": {
              "type": [
                "array",
                "boolean",
                "null",
                "number",
                "object",
                "string"
              ]
            },
            "templateName": {
              "title": "template",
              "type": "string",
              "examples": [
                "show version"
              ]
            },
            "templateVariables": {
              "type": [
                "array",
                "boolean",
                "null",
                "number",
                "object",
                "string"
              ]
            },
            "reattempt": {
              "type": [
                "array",
                "boolean",
                "null",
                "number",
                "object",
                "string"
              ]
            },
            "_id": {
              "type": "string",
              "pattern": "^[0-9a-f]{24}$"
            },
            "reattemptWaitTime": {
              "title": "minutes",
              "type": "integer",
              "examples": [
                1
              ]
            },
            "reattemptQuantity": {
              "title": "attempts",
              "type": "integer",
              "examples": [
                2
              ]
            },
            "deviceName": {
              "type": [
                "array",
                "string",
                "boolean",
                "integer",
                "number",
                "object"
              ],
              "title": "elementN",
              "examples": [
                "Device3"
              ]
            },
            "suppressFailureMessage": {
              "type": [
                "array",
                "boolean",
                "null",
                "number",
                "object",
                "string"
              ]
            },
            "initiator": {
              "type": "string"
            },
            "templateResults": {
              "type": [
                "array",
                "boolean",
                "null",
                "number",
                "object",
                "string"
              ]
            },
            "templateError": {
              "type": [
                "array",
                "boolean",
                "null",
                "number",
                "object",
                "string"
              ]
            }
          }
        },
        "createdVersion": "5.46.0-2023.1.30.0",
        "created_by": {
          "provenance": "local_aaa",
          "username": "admin@pronghorn",
          "firstname": "admin",
          "inactive": false
        },
        "font_size": 12,
        "lastUpdatedVersion": "4.15.0-2023.1.123.0",
        "preAutomationTime": 0,
        "sla": 0,
        "type": "automation",
        "last_updated": "2024-02-01T19:22:15.817Z",
        "created": "2023-11-15T15:14:12.334Z",
        "last_updated_by": {
          "provenance": "local_aaa",
          "username": "admin@pronghorn",
          "firstname": "admin",
          "inactive": false
        },
        "canvasVersion": 1.5,
        "tags": [],
        "groups": [],
        "migrationVersion": 2
      }
    },
    {
      "type": "workflow",
      "data": {
        "name": "Perform Device Connection",
        "tasks": {
          "workflow_start": {
            "name": "workflow_start",
            "groups": [],
            "nodeLocation": {
              "x": -600,
              "y": -288
            },
            "x": 0,
            "y": 0.5
          },
          "workflow_end": {
            "name": "workflow_end",
            "groups": [],
            "nodeLocation": {
              "x": 552,
              "y": -288
            },
            "x": 1,
            "y": 0.5
          },
          "b412": {
            "name": "isAlive",
            "canvasName": "isAlive",
            "summary": "Test Device Connection",
            "description": "Test Device Connection",
            "location": "Application",
            "locationType": null,
            "app": "ConfigurationManager",
            "type": "automatic",
            "displayName": "ConfigurationManager",
            "variables": {
              "incoming": {
                "name": "$var.job.deviceName"
              },
              "outgoing": {
                "status": ""
              }
            },
            "actor": "Pronghorn",
            "groups": [],
            "nodeLocation": {
              "x": -24,
              "y": -288
            }
          },
          "f065": {
            "name": "reattempt",
            "canvasName": "reattempt",
            "summary": "Retry Device Connection Test",
            "description": "Reattempt to test device connection after waiting the specified number of minutes",
            "location": "Application",
            "locationType": null,
            "app": "MOP",
            "type": "automatic",
            "displayName": "MOP",
            "variables": {
              "incoming": {
                "job_id": "$var.job._id",
                "attemptID": "retry_test_connection",
                "minutes": 2,
                "attempts": 12
              },
              "outgoing": {
                "response": ""
              }
            },
            "actor": "Pronghorn",
            "groups": [],
            "nodeLocation": {
              "x": -24,
              "y": -180
            }
          },
          "7d17": {
            "name": "evaluation",
            "canvasName": "evaluation",
            "summary": "Check If Device Is Alive",
            "description": "Check If Device Is Alive",
            "location": "Application",
            "locationType": null,
            "app": "WorkFlowEngine",
            "type": "operation",
            "displayName": "WorkFlowEngine",
            "variables": {
              "incoming": {
                "all_true_flag": false,
                "evaluation_groups": [
                  {
                    "all_true_flag": false,
                    "evaluations": [
                      {
                        "operand_1": {
                          "task": "b412",
                          "variable": "status"
                        },
                        "operand_2": {
                          "task": "static",
                          "variable": true
                        },
                        "operator": "==",
                        "query": "response",
                        "rightQuery": ""
                      },
                      {
                        "operand_1": {
                          "task": "b412",
                          "variable": "status"
                        },
                        "operand_2": {
                          "task": "static",
                          "variable": true
                        },
                        "operator": "contains",
                        "query": "",
                        "rightQuery": ""
                      }
                    ]
                  }
                ]
              },
              "outgoing": {
                "return_value": ""
              }
            },
            "actor": "Pronghorn",
            "groups": [],
            "nodeLocation": {
              "x": 300,
              "y": -288
            }
          },
          "f629": {
            "name": "delay",
            "canvasName": "delay",
            "summary": "Delay Device Connection Test",
            "description": "Delay device connection testing for a duration by Job ID and number of seconds.",
            "location": "Application",
            "locationType": null,
            "app": "WorkFlowEngine",
            "type": "operation",
            "displayName": "WorkFlowEngine",
            "variables": {
              "incoming": {
                "time": 400
              },
              "outgoing": {
                "time_in_milliseconds": ""
              }
            },
            "actor": "Pronghorn",
            "groups": [],
            "nodeLocation": {
              "x": -348,
              "y": -288
            }
          }
        },
        "transitions": {
          "workflow_start": {
            "f629": {
              "state": "success",
              "type": "standard"
            }
          },
          "workflow_end": {},
          "b412": {
            "f065": {
              "type": "standard",
              "state": "error"
            },
            "7d17": {
              "state": "success",
              "type": "standard"
            }
          },
          "f065": {
            "b412": {
              "state": "success",
              "type": "revert"
            }
          },
          "7d17": {
            "workflow_end": {
              "state": "success",
              "type": "standard"
            },
            "f065": {
              "type": "standard",
              "state": "failure"
            }
          },
          "f629": {
            "b412": {
              "state": "success",
              "type": "standard"
            }
          }
        },
        "inputSchema": {
          "type": "object",
          "properties": {
            "deviceName": {
              "type": [
                "array",
                "boolean",
                "null",
                "number",
                "object",
                "string"
              ]
            },
            "_id": {
              "title": "job_id",
              "type": "string",
              "examples": [
                "test"
              ]
            }
          },
          "required": [
            "deviceName",
            "_id"
          ]
        },
        "outputSchema": {
          "type": "object",
          "properties": {
            "deviceName": {
              "type": [
                "array",
                "boolean",
                "null",
                "number",
                "object",
                "string"
              ]
            },
            "_id": {
              "type": "string",
              "pattern": "^[0-9a-f]{24}$"
            },
            "initiator": {
              "type": "string"
            }
          }
        },
        "canvasVersion": 3,
        "type": "automation",
        "font_size": 12,
        "errorHandler": null,
        "preAutomationTime": 0,
        "sla": 0,
        "last_updated": "2024-02-06T17:01:19.599Z",
        "lastUpdatedVersion": "5.46.0-2023.1.19.0",
        "created": "2024-02-02T21:37:24.636Z",
        "created_by": {
          "provenance": "local_aaa",
          "username": "admin@pronghorn",
          "firstname": "admin",
          "inactive": false
        },
        "createdVersion": "5.46.0-2023.1.19.0",
        "last_updated_by": {
          "provenance": "local_aaa",
          "username": "admin@pronghorn",
          "firstname": "admin",
          "inactive": false
        },
        "tags": [],
        "groups": [],
        "migrationVersion": 2
      }
    },
    {
      "type": "mop-template",
      "data": {
        "tags": [],
        "name": "NXOS - File Verification",
        "os": "",
        "passRule": true,
        "ignoreWarnings": false,
        "commands": [
          {
            "command": "show version",
            "passRule": true,
            "rules": [
              {
                "rule": "<!version!>",
                "eval": "!contains",
                "severity": "error",
                "flags": {
                  "case": true
                },
                "evaluation": "error"
              }
            ]
          },
          {
            "command": "dir <!flashMemory!><!version!>",
            "passRule": true,
            "rules": [
              {
                "rule": "No such file or directory",
                "eval": "!contains",
                "severity": "error",
                "evaluation": "pass"
              }
            ]
          },
          {
            "command": "show running | include boot",
            "passRule": true,
            "rules": [
              {
                "rule": "<!version!>",
                "eval": "!contains",
                "severity": "error",
                "evaluation": "error"
              }
            ]
          }
        ],
        "created": 1661436863842,
        "createdBy": "mike.elrom@itential.com",
        "lastUpdated": 1707169599527,
        "lastUpdatedBy": "admin@pronghorn"
      }
    },
    {
      "type": "mop-template",
      "data": {
        "tags": [],
        "name": "NXOS - Install",
        "os": "",
        "passRule": true,
        "ignoreWarnings": false,
        "commands": [
          {
            "command": "install all nxos <!flashMemory!><!version!> non-interruptive",
            "passRule": false,
            "rules": [
              {
                "rule": "Do you want to continue with the installation",
                "eval": "contains",
                "severity": "error"
              },
              {
                "rule": "Another install procedure may be in progress.",
                "eval": "contains",
                "severity": "error"
              }
            ]
          }
        ],
        "created": 1661436998388,
        "createdBy": "mike.elrom@itential.com",
        "lastUpdated": 1707179125710,
        "lastUpdatedBy": "admin@pronghorn"
      }
    },
    {
      "type": "mop-template",
      "data": {
        "tags": [],
        "name": "NXOS - Show Version",
        "os": "",
        "passRule": true,
        "ignoreWarnings": false,
        "commands": [
          {
            "command": "show version",
            "passRule": true,
            "rules": [
              {
                "rule": "<!version!>",
                "eval": "contains",
                "severity": "error"
              }
            ]
          }
        ],
        "created": 1661440272059,
        "createdBy": "mike.elrom@itential.com",
        "lastUpdated": 1706812946165,
        "lastUpdatedBy": "admin@pronghorn"
      }
    },
    {
      "type": "mop-template",
      "data": {
        "tags": [],
        "name": "NXOS - Software Upgrade Checks",
        "os": "",
        "passRule": true,
        "ignoreWarnings": true,
        "commands": [
          {
            "command": "show ver",
            "passRule": false,
            "rules": [
              {
                "rule": "",
                "eval": "contains",
                "severity": "error"
              }
            ],
            "tempCommand": "show ver",
            "ruleValues": [
              {
                "rule": "Configuration register is 0x2102",
                "eval": "contains",
                "severity": "error"
              }
            ]
          },
          {
            "command": "show running",
            "passRule": true,
            "rules": [
              {
                "rule": "",
                "eval": "contains",
                "severity": "error",
                "flags": {
                  "case": false
                }
              }
            ],
            "tempCommand": "show running",
            "ruleValues": [
              {
                "rule": "",
                "eval": "contains",
                "severity": "error",
                "flags": {
                  "case": false
                }
              }
            ]
          },
          {
            "command": "show ip int br",
            "passRule": true,
            "rules": [
              {
                "rule": "",
                "eval": "contains",
                "severity": "error"
              }
            ],
            "tempCommand": "show ip int br",
            "ruleValues": [
              {
                "rule": "",
                "eval": "contains",
                "severity": "error"
              }
            ]
          },
          {
            "command": "show license",
            "passRule": true,
            "rules": [
              {
                "rule": "",
                "eval": "contains",
                "severity": "error"
              }
            ],
            "tempCommand": "show license",
            "ruleValues": [
              {
                "rule": "",
                "eval": "contains",
                "severity": "error"
              }
            ]
          },
          {
            "command": "show clock",
            "passRule": true,
            "rules": [
              {
                "rule": "",
                "eval": "contains",
                "severity": "error"
              }
            ],
            "tempCommand": "show clock",
            "ruleValues": [
              {
                "rule": "",
                "eval": "contains",
                "severity": "error"
              }
            ]
          },
          {
            "command": "show logging",
            "passRule": true,
            "rules": [
              {
                "rule": "Fatal",
                "eval": "!contains",
                "severity": "error",
                "flags": {
                  "case": true
                }
              }
            ],
            "tempCommand": "show logging",
            "ruleValues": [
              {
                "rule": "",
                "eval": "contains",
                "severity": "error"
              }
            ]
          },
          {
            "command": "show boot",
            "passRule": true,
            "rules": [
              {
                "rule": "",
                "eval": "contains",
                "severity": "error"
              }
            ]
          }
        ],
        "created": 1661436907821,
        "createdBy": "mike.elrom@itential.com",
        "lastUpdated": 1706812946142,
        "lastUpdatedBy": "admin@pronghorn"
      }
    },
    {
      "type": "transformation",
      "data": {
        "_id": "65bbf1901205fc02995dbf33",
        "name": "Software Upgrade - NX-OS",
        "description": "",
        "incoming": [
          {
            "$id": "version",
            "type": "string"
          },
          {
            "$id": "flashMemory",
            "type": "string"
          }
        ],
        "outgoing": [
          {
            "$id": "templateVariables",
            "type": "object",
            "properties": {
              "version": {
                "type": "string",
                "examples": [
                  "14%2E4"
                ]
              },
              "flashMemory": {
                "type": "string",
                "examples": [
                  "flash:"
                ]
              }
            },
            "required": []
          }
        ],
        "steps": [
          {
            "id": 1,
            "type": "assign",
            "from": {
              "location": "incoming",
              "name": "version",
              "ptr": ""
            },
            "to": {
              "location": "outgoing",
              "name": "templateVariables",
              "ptr": "/version"
            },
            "context": "#"
          },
          {
            "id": 2,
            "type": "assign",
            "from": {
              "location": "incoming",
              "name": "flashMemory",
              "ptr": ""
            },
            "to": {
              "location": "outgoing",
              "name": "templateVariables",
              "ptr": "/flashMemory"
            },
            "context": "#"
          }
        ],
        "functions": [],
        "comments": [],
        "view": {
          "col": 1,
          "row": 5
        },
        "created": "2024-02-01T19:31:28.192Z",
        "createdBy": {
          "_id": "652054b92c281c82e5b4c8b4",
          "provenance": "local_aaa",
          "username": "admin@pronghorn"
        },
        "lastUpdated": "2024-02-02T17:30:41.570Z",
        "lastUpdatedBy": {
          "_id": "652054b92c281c82e5b4c8b4",
          "provenance": "local_aaa",
          "username": "admin@pronghorn"
        },
        "version": "4.1.2-2023.1.10",
        "tags": []
      }
    },
    {
      "type": "transformation",
      "data": {
        "_id": "6553e5b9fb4afe017442d30c",
        "name": "Create Command Template Runner Error Message",
        "description": "Create Command Template Runner error message",
        "incoming": [
          {
            "$id": "templateName",
            "type": "string",
            "examples": [
              "Template A"
            ]
          }
        ],
        "outgoing": [
          {
            "$id": "errorMessage",
            "type": "string"
          }
        ],
        "steps": [
          {
            "id": 2,
            "type": "assign",
            "from": {
              "location": "incoming",
              "name": "templateName",
              "ptr": ""
            },
            "to": {
              "location": "template",
              "name": 1,
              "ptr": "/args/0/value"
            },
            "context": "#"
          },
          {
            "id": 1,
            "type": "template",
            "library": "String",
            "method": "templateLiteral",
            "template": "The Command Template ${templateName} has errored. See details below. Select \"Retry\" to retry Command Template or select \"Continue\" to continue to end of job.",
            "args": [
              null
            ],
            "view": {
              "row": 1,
              "col": 1
            },
            "context": "#"
          },
          {
            "id": 3,
            "type": "assign",
            "from": {
              "location": "template",
              "name": 1,
              "ptr": "/return"
            },
            "to": {
              "location": "outgoing",
              "name": "errorMessage",
              "ptr": ""
            },
            "context": "#"
          }
        ],
        "functions": [],
        "comments": [],
        "view": {
          "col": 1,
          "row": 5
        },
        "created": "2024-02-01T19:22:15.627Z",
        "createdBy": {
          "_id": "652054b92c281c82e5b4c8b4",
          "provenance": "local_aaa",
          "username": "admin@pronghorn"
        },
        "lastUpdated": "2024-02-01T19:22:15.627Z",
        "lastUpdatedBy": {
          "_id": "652054b92c281c82e5b4c8b4",
          "provenance": "local_aaa",
          "username": "admin@pronghorn"
        },
        "version": "4.1.2-2023.1.10",
        "tags": []
      }
    }
  ],
  "readme": "# Cisco - NX-OS - IAG\n\n## Overview\n\nThis Pre-Built Automation bundle contains several example use cases that are applicable when the Itential Automation Platform is integrated with Cisco NX-OS using the device CLI. Because every environment is different, these use cases are fully functioning examples that can be easily modified to operate in your specific environment. These workflows have been written with modularity in mind to make them easy to understand and simple to modify to suit your needs.\n\n\n## Workflows\n\n\n<table>\n  <thead>\n    <tr>\n      <th>Name</th>\n      <th>Overview</th>\n    </tr>\n  </thead>\n  <tbody>\n    <tr>\n      <td><a href='https://gitlab.com/itentialopensource/pre-built-automations/cisco-nx-os-iag/-/blob/master/documentation/Software Upgrade - NX-OS.md' target='_blank'>Software Upgrade - NX-OS</a></td>\n      <td>This example use case automates the procedure of upgrading the software on a Cisco NX-OS network device.</td>\n    </tr>\n  </tbody>\n</table>\n\n\n## External Dependencies\n\n<table>\n  <thead>\n    <tr>\n      <th>Name</th>\n      <th>OS Version</th>\n      <th>API Version</th>\n    </tr>\n  </thead>\n  <tbody>\n    <tr>\n      <td>Itential Automation Gateway (IAG)</td>\n      <td>^3.227.0+2023.1.33</td>\n      <td></td>\n    </tr>\n  </tbody>\n</table>\n\n## Adapters\n\n<table>\n  <thead>\n    <tr>\n      <th>Name</th>\n      <th>Version</th>\n      <th>Configuration Notes</th>\n    </tr>\n  </thead>\n  <tbody>\n    <tr>\n      <td>adapter-automation_gateway</td>\n      <td>4.29.0-2023.1.12.0</td>\n      <td></td>\n    </tr>\n  </tbody>\n</table>"
}