{
  "tags": [],
  "name": "NXOS - Install",
  "os": "",
  "passRule": true,
  "ignoreWarnings": false,
  "commands": [
    {
      "command": "install all nxos <!flashMemory!><!version!> non-interruptive",
      "passRule": false,
      "rules": [
        {
          "rule": "Do you want to continue with the installation",
          "eval": "contains",
          "severity": "error"
        },
        {
          "rule": "Another install procedure may be in progress.",
          "eval": "contains",
          "severity": "error"
        }
      ]
    }
  ],
  "created": 1661436998388,
  "createdBy": "mike.elrom@itential.com",
  "lastUpdated": 1707179125710,
  "lastUpdatedBy": "admin@pronghorn"
}