{
  "tags": [],
  "name": "NXOS - File Verification",
  "os": "",
  "passRule": true,
  "ignoreWarnings": false,
  "commands": [
    {
      "command": "show version",
      "passRule": true,
      "rules": [
        {
          "rule": "<!version!>",
          "eval": "!contains",
          "severity": "error",
          "flags": {
            "case": true
          },
          "evaluation": "error"
        }
      ]
    },
    {
      "command": "dir <!flashMemory!><!version!>",
      "passRule": true,
      "rules": [
        {
          "rule": "No such file or directory",
          "eval": "!contains",
          "severity": "error",
          "evaluation": "pass"
        }
      ]
    },
    {
      "command": "show running | include boot",
      "passRule": true,
      "rules": [
        {
          "rule": "<!version!>",
          "eval": "!contains",
          "severity": "error",
          "evaluation": "error"
        }
      ]
    }
  ],
  "created": 1661436863842,
  "createdBy": "mike.elrom@itential.com",
  "lastUpdated": 1707169599527,
  "lastUpdatedBy": "admin@pronghorn"
}