{
  "name": "Software Upgrade - NX-OS",
  "tasks": {
    "3997": {
      "name": "transformation",
      "canvasName": "transformation",
      "summary": "Software Upgrade - NX-OS",
      "description": "Software Upgrade - NX-OS",
      "location": "Application",
      "locationType": null,
      "app": "WorkFlowEngine",
      "type": "operation",
      "displayName": "WorkFlowEngine",
      "variables": {
        "incoming": {
          "tr_id": "65bbf1901205fc02995dbf33",
          "variableMap": {
            "version": "$var.job.version",
            "flashMemory": "$var.job.flashMemory"
          },
          "options": {
            "extractOutput": true,
            "validateIncoming": true,
            "revertToDefaultValue": true
          }
        },
        "outgoing": {
          "templateVariables": null
        },
        "decorators": []
      },
      "actor": "Pronghorn",
      "groups": [],
      "nodeLocation": {
        "x": -756,
        "y": 996
      }
    },
    "9531": {
      "name": "childJob",
      "canvasName": "childJob",
      "summary": "Verify File",
      "description": "Validate the integrity and compatibility of the software file",
      "location": "Application",
      "locationType": null,
      "app": "WorkFlowEngine",
      "type": "operation",
      "displayName": "WorkFlowEngine",
      "variables": {
        "incoming": {
          "task": "",
          "workflow": "Command Template Runner",
          "variables": {
            "suppressSuccessMessage": {
              "task": "job",
              "value": "suppressSuccessMessage"
            },
            "suppressFailureMessage": {
              "task": "job",
              "value": "suppressFailureMessage"
            },
            "deviceName": {
              "task": "job",
              "value": "deviceName"
            },
            "templateName": {
              "task": "static",
              "value": "NXOS - File Verification"
            },
            "reattempt": {
              "task": "static",
              "value": false
            },
            "reattemptWaitTime": {
              "task": "static",
              "value": 0
            },
            "reattemptQuantity": {
              "task": "static",
              "value": 0
            },
            "_id": {
              "task": "3997",
              "value": "templateVariables"
            },
            "templateVariables": {
              "task": "3997",
              "value": "templateVariables"
            }
          },
          "data_array": "",
          "transformation": "",
          "loopType": ""
        },
        "outgoing": {
          "job_details": ""
        }
      },
      "actor": "job",
      "groups": [],
      "nodeLocation": {
        "x": -432,
        "y": 996
      }
    },
    "workflow_start": {
      "name": "workflow_start",
      "groups": [],
      "x": -0.19900908340214699,
      "y": 0.5112219451371571,
      "nodeLocation": {
        "x": -996,
        "y": 996
      }
    },
    "workflow_end": {
      "name": "workflow_end",
      "groups": [],
      "x": 1.8959587274290628,
      "y": 0.46684350132625996,
      "nodeLocation": {
        "x": 2076,
        "y": 996
      }
    },
    "ed72": {
      "name": "childJob",
      "canvasName": "childJob",
      "summary": "Perform Pre-Checks",
      "description": "Perform pre-upgrade checks",
      "location": "Application",
      "locationType": null,
      "app": "WorkFlowEngine",
      "type": "operation",
      "displayName": "WorkFlowEngine",
      "variables": {
        "incoming": {
          "task": "",
          "workflow": "Command Template Runner",
          "variables": {
            "suppressFailureMessage": {
              "task": "job",
              "value": "suppressFailureMessage"
            },
            "suppressSuccessMessage": {
              "task": "job",
              "value": "suppressSuccessMessage"
            },
            "deviceName": {
              "task": "job",
              "value": "deviceName"
            },
            "reattemptQuantity": {
              "task": "static",
              "value": 0
            },
            "reattemptWaitTime": {
              "task": "static",
              "value": 0
            },
            "reattempt": {
              "task": "static",
              "value": false
            },
            "templateVariables": {
              "task": "3997",
              "value": "templateVariables"
            },
            "templateName": {
              "task": "static",
              "value": "NXOS - Software Upgrade Checks"
            },
            "_id": {
              "task": "9531",
              "value": "job_details"
            }
          },
          "data_array": "",
          "transformation": "",
          "loopType": ""
        },
        "outgoing": {
          "job_details": ""
        }
      },
      "actor": "job",
      "groups": [],
      "nodeLocation": {
        "x": -108,
        "y": 996
      }
    },
    "fc03": {
      "name": "childJob",
      "canvasName": "childJob",
      "summary": "Install",
      "description": "Execute the installation of the new software",
      "location": "Application",
      "locationType": null,
      "app": "WorkFlowEngine",
      "type": "operation",
      "displayName": "WorkFlowEngine",
      "variables": {
        "incoming": {
          "task": "",
          "workflow": "Command Template Runner",
          "variables": {
            "suppressFailureMessage": {
              "task": "job",
              "value": "suppressFailureMessage"
            },
            "suppressSuccessMessage": {
              "task": "job",
              "value": "suppressSuccessMessage"
            },
            "templateName": {
              "task": "static",
              "value": "NXOS - Install"
            },
            "templateVariables": {
              "task": "3997",
              "value": "templateVariables"
            },
            "reattempt": {
              "task": "static",
              "value": false
            },
            "reattemptWaitTime": {
              "task": "static",
              "value": 0
            },
            "reattemptQuantity": {
              "task": "static",
              "value": 0
            },
            "deviceName": {
              "task": "job",
              "value": "deviceName"
            },
            "_id": {
              "task": "ed72",
              "value": "job_details"
            }
          },
          "data_array": "",
          "transformation": "",
          "loopType": ""
        },
        "outgoing": {
          "job_details": ""
        }
      },
      "actor": "job",
      "groups": [],
      "nodeLocation": {
        "x": 216,
        "y": 996
      }
    },
    "0e7b": {
      "name": "childJob",
      "canvasName": "childJob",
      "summary": "Verify After Reload",
      "description": "Confirm the successful application of the upgraded software by performing version check",
      "location": "Application",
      "locationType": null,
      "app": "WorkFlowEngine",
      "type": "operation",
      "displayName": "WorkFlowEngine",
      "variables": {
        "incoming": {
          "task": "",
          "workflow": "Command Template Runner",
          "variables": {
            "suppressFailureMessage": {
              "task": "job",
              "value": "suppressFailureMessage"
            },
            "suppressSuccessMessage": {
              "task": "job",
              "value": "suppressSuccessMessage"
            },
            "templateName": {
              "task": "static",
              "value": "NXOS - Show Version"
            },
            "templateVariables": {
              "task": "3997",
              "value": "templateVariables"
            },
            "reattempt": {
              "task": "static",
              "value": false
            },
            "reattemptWaitTime": {
              "task": "static",
              "value": 0
            },
            "reattemptQuantity": {
              "task": "static",
              "value": 0
            },
            "deviceName": {
              "task": "job",
              "value": "deviceName"
            },
            "_id": {
              "task": "54c0",
              "value": "job_details"
            }
          },
          "data_array": "",
          "transformation": "",
          "loopType": ""
        },
        "outgoing": {
          "job_details": ""
        }
      },
      "actor": "job",
      "groups": [],
      "nodeLocation": {
        "x": 864,
        "y": 996
      }
    },
    "b0ff": {
      "name": "childJob",
      "canvasName": "childJob",
      "summary": "Perform Post-Checks",
      "description": "Perform post-upgrade checks",
      "location": "Application",
      "locationType": null,
      "app": "WorkFlowEngine",
      "type": "operation",
      "displayName": "WorkFlowEngine",
      "variables": {
        "incoming": {
          "task": "",
          "workflow": "Command Template Runner",
          "variables": {
            "suppressFailureMessage": {
              "task": "job",
              "value": "suppressFailureMessage"
            },
            "suppressSuccessMessage": {
              "task": "job",
              "value": "suppressSuccessMessage"
            },
            "templateName": {
              "task": "static",
              "value": "NXOS - Software Upgrade Checks"
            },
            "templateVariables": {
              "task": "3997",
              "value": "templateVariables"
            },
            "reattempt": {
              "task": "static",
              "value": false
            },
            "reattemptWaitTime": {
              "task": "static",
              "value": 0
            },
            "reattemptQuantity": {
              "task": "static",
              "value": 0
            },
            "deviceName": {
              "task": "job",
              "value": "deviceName"
            },
            "_id": {
              "task": "0e7b",
              "value": "job_details"
            }
          },
          "data_array": "",
          "transformation": "",
          "loopType": ""
        },
        "outgoing": {
          "job_details": ""
        }
      },
      "actor": "job",
      "groups": [],
      "nodeLocation": {
        "x": 1188,
        "y": 996
      }
    },
    "a2a3": {
      "name": "query",
      "canvasName": "query",
      "summary": "Query Pre-Checks",
      "description": "Query Pre Check",
      "location": "Application",
      "locationType": null,
      "app": "WorkFlowEngine",
      "type": "operation",
      "displayName": "WorkFlowEngine",
      "variables": {
        "incoming": {
          "pass_on_null": false,
          "query": "templateResults",
          "obj": "$var.ed72.job_details"
        },
        "outgoing": {
          "return_data": ""
        }
      },
      "actor": "Pronghorn",
      "groups": [],
      "nodeLocation": {
        "x": 1500,
        "y": 876
      }
    },
    "0f5d": {
      "name": "query",
      "canvasName": "query",
      "summary": "Query Post-Checks",
      "description": "Query Pre Check",
      "location": "Application",
      "locationType": null,
      "app": "WorkFlowEngine",
      "type": "operation",
      "displayName": "WorkFlowEngine",
      "variables": {
        "incoming": {
          "pass_on_null": false,
          "query": "templateResults",
          "obj": "$var.b0ff.job_details"
        },
        "outgoing": {
          "return_data": ""
        }
      },
      "actor": "Pronghorn",
      "groups": [],
      "nodeLocation": {
        "x": 1500,
        "y": 1104
      }
    },
    "5bd5": {
      "name": "evaluation",
      "canvasName": "evaluation",
      "summary": "Check If Suppressing Success Message",
      "description": "Check If Suppressing Success Message",
      "location": "Application",
      "locationType": null,
      "app": "WorkFlowEngine",
      "type": "operation",
      "displayName": "WorkFlowEngine",
      "variables": {
        "incoming": {
          "all_true_flag": false,
          "evaluation_groups": [
            {
              "all_true_flag": false,
              "evaluations": [
                {
                  "operand_1": {
                    "task": "job",
                    "variable": "suppressSuccessMessage"
                  },
                  "operand_2": {
                    "task": "static",
                    "variable": true
                  },
                  "operator": "==",
                  "query": "",
                  "rightQuery": ""
                }
              ]
            }
          ]
        },
        "outgoing": {
          "return_value": ""
        }
      },
      "actor": "Pronghorn",
      "groups": [],
      "nodeLocation": {
        "x": 1812,
        "y": 996
      }
    },
    "d6b3": {
      "name": "runTemplatesDiff",
      "canvasName": "runTemplatesDiff",
      "summary": "Compare Pre-Post",
      "description": "Compare pre- and post-checks",
      "location": "Application",
      "app": "MOP",
      "displayName": "MOP",
      "type": "manual",
      "variables": {
        "incoming": {
          "pre": "$var.a2a3.return_data",
          "post": "$var.0f5d.return_data"
        },
        "outgoing": {}
      },
      "view": "/mop/task/runTemplatesDiff",
      "groups": [],
      "nodeLocation": {
        "x": 1812,
        "y": 876
      }
    },
    "54c0": {
      "name": "childJob",
      "canvasName": "childJob",
      "summary": "Run Device Connection",
      "description": "Test if device is alive",
      "location": "Application",
      "locationType": null,
      "app": "WorkFlowEngine",
      "type": "operation",
      "displayName": "WorkFlowEngine",
      "variables": {
        "incoming": {
          "task": "",
          "workflow": "Perform Device Connection",
          "variables": {
            "_id": {
              "task": "fc03",
              "value": "job_details"
            },
            "deviceName": {
              "task": "job",
              "value": "deviceName"
            }
          },
          "data_array": "",
          "transformation": "",
          "loopType": ""
        },
        "outgoing": {
          "job_details": ""
        }
      },
      "actor": "job",
      "groups": [],
      "nodeLocation": {
        "x": 540,
        "y": 996
      }
    }
  },
  "transitions": {
    "3997": {
      "9531": {
        "state": "success",
        "type": "standard"
      }
    },
    "9531": {
      "ed72": {
        "state": "success",
        "type": "standard"
      }
    },
    "workflow_start": {
      "3997": {
        "state": "success",
        "type": "standard"
      }
    },
    "workflow_end": {},
    "ed72": {
      "fc03": {
        "state": "success",
        "type": "standard"
      }
    },
    "fc03": {
      "54c0": {
        "state": "success",
        "type": "standard"
      }
    },
    "0e7b": {
      "b0ff": {
        "state": "success",
        "type": "standard"
      }
    },
    "b0ff": {
      "a2a3": {
        "state": "success",
        "type": "standard"
      },
      "0f5d": {
        "state": "success",
        "type": "standard"
      }
    },
    "a2a3": {
      "5bd5": {
        "state": "success",
        "type": "standard"
      }
    },
    "0f5d": {
      "5bd5": {
        "state": "success",
        "type": "standard"
      }
    },
    "5bd5": {
      "workflow_end": {
        "state": "success",
        "type": "standard"
      },
      "d6b3": {
        "type": "standard",
        "state": "failure"
      }
    },
    "d6b3": {
      "workflow_end": {
        "state": "success",
        "type": "standard"
      }
    },
    "54c0": {
      "0e7b": {
        "state": "success",
        "type": "standard"
      }
    },
    "eb55": {},
    "f92": {},
    "90d3": {},
    "5fa1": {}
  },
  "inputSchema": {
    "type": "object",
    "properties": {
      "version": {
        "$id": "version",
        "type": "string"
      },
      "flashMemory": {
        "$id": "flashMemory",
        "type": "string"
      },
      "suppressSuccessMessage": {
        "type": [
          "array",
          "boolean",
          "null",
          "number",
          "object",
          "string"
        ]
      },
      "suppressFailureMessage": {
        "type": [
          "array",
          "boolean",
          "null",
          "number",
          "object",
          "string"
        ]
      },
      "deviceName": {
        "type": [
          "array",
          "string",
          "boolean",
          "integer",
          "number",
          "object"
        ],
        "title": "elementN",
        "examples": [
          "Device3"
        ]
      }
    },
    "required": [
      "version",
      "flashMemory",
      "suppressSuccessMessage",
      "suppressFailureMessage",
      "deviceName"
    ]
  },
  "outputSchema": {
    "type": "object",
    "properties": {
      "version": {
        "$id": "version",
        "type": "string"
      },
      "flashMemory": {
        "$id": "flashMemory",
        "type": "string"
      },
      "suppressSuccessMessage": {
        "type": [
          "array",
          "boolean",
          "null",
          "number",
          "object",
          "string"
        ]
      },
      "suppressFailureMessage": {
        "type": [
          "array",
          "boolean",
          "null",
          "number",
          "object",
          "string"
        ]
      },
      "deviceName": {
        "type": [
          "array",
          "string",
          "boolean",
          "integer",
          "number",
          "object"
        ],
        "title": "elementN",
        "examples": [
          "Device3"
        ]
      },
      "_id": {
        "type": "string",
        "pattern": "^[0-9a-f]{24}$"
      },
      "initiator": {
        "type": "string"
      }
    }
  },
  "canvasVersion": 1.5,
  "createdVersion": "5.46.0-2023.1.19.0",
  "created_by": {
    "provenance": "local_aaa",
    "username": "admin@pronghorn",
    "firstname": "admin",
    "inactive": false
  },
  "font_size": 12,
  "lastUpdatedVersion": "5.46.0-2023.1.19.0",
  "preAutomationTime": 0,
  "sla": 0,
  "type": "automation",
  "last_updated": "2024-02-06T17:02:15.291Z",
  "created": "2024-02-02T20:39:14.038Z",
  "last_updated_by": {
    "provenance": "local_aaa",
    "username": "admin@pronghorn",
    "firstname": "admin",
    "inactive": false
  },
  "tags": [],
  "groups": [],
  "migrationVersion": 2
}