{
  "vendor": "Cisco Systems",
  "product": "NX-OS",
  "method": "IAG",
  "domains": [
    "Data Center"
  ],
  "tags": [
    "Configuration Management"
  ],
  "useCases": [
    "Software Upgrades"
  ],
  "apiLinks": [],
  "deprecated": {
    "isDeprecated": false
  },
  "name": "Cisco - NX-OS - IAG",
  "overview": "This Pre-Built Automation bundle contains several example use cases that are applicable when the Itential Automation Platform is integrated with Cisco NX-OS using the device CLI. Because every environment is different, these use cases are fully functioning examples that can be easily modified to operate in your specific environment. These workflows have been written with modularity in mind to make them easy to understand and simple to modify to suit your needs.",
  "productLink": "",
  "storeLink": "",
  "docLink": "",
  "issueLink": "",
  "type": "Workflow Project",
  "vendorLink": "https://www.cisco.com/",
  "faqLink": "",
  "contributeLink": "",
  "webName": "Cisco NX-OS Device - Example Use Cases - Managed by CLI in IAG",
  "webLink": "",
  "demoLinks": []
}
