{
  "name": "Cisco IOS XR Upgrade Perform Upgrade",
  "tasks": {
    "247": {
      "name": "merge",
      "summary": "Install add source operation ID",
      "description": "Merge data into a single object",
      "location": "Application",
      "locationType": null,
      "app": "WorkFlowEngine",
      "displayName": "WorkFlowEngine",
      "type": "operation",
      "variables": {
        "incoming": {
          "data_to_merge": [
            {
              "key": "id",
              "value": {
                "task": "db81",
                "variable": "return_data"
              }
            }
          ]
        },
        "outgoing": {
          "merged_object": null
        }
      },
      "deprecated": false,
      "matched": [
        {
          "key": "name",
          "highlightString": "<span class='highlight-string'>merge</span>"
        },
        {
          "key": "summary",
          "highlightString": "<span class='highlight-string'>Merge</span> Data"
        },
        {
          "key": "description",
          "highlightString": "<span class='highlight-string'>Merge</span> data into a single object"
        }
      ],
      "groups": [],
      "x": 0.4449275362318841,
      "y": 0.4871060171919771
    },
    "2092": {
      "name": "childJob",
      "summary": "Async Activate Install",
      "description": "Run a child Job inside a Workflow",
      "location": "Application",
      "locationType": null,
      "app": "WorkFlowEngine",
      "displayName": "WorkFlowEngine",
      "type": "operation",
      "variables": {
        "incoming": {
          "task": "",
          "workflow": "Cisco IOS XR Upgrade Async Install Op",
          "variables": {
            "mop_template_results": {
              "variable": "",
              "task": "b472",
              "value": "mop_template_results"
            },
            "device": {
              "variable": "",
              "task": "job",
              "value": "device"
            },
            "mode": {
              "variable": "",
              "task": "job",
              "editable": true,
              "value": "mode"
            }
          },
          "data_array": "",
          "transformation": "",
          "loopType": ""
        },
        "outgoing": {
          "job_details": null
        }
      },
      "deprecated": false,
      "matched": [
        {
          "key": "name",
          "highlightString": "<span class='highlight-string'>childJob</span>"
        }
      ],
      "groups": [],
      "actor": "job",
      "x": 1.423913043478261,
      "y": 0.4785100286532951
    },
    "workflow_start": {
      "name": "workflow_start",
      "groups": [],
      "x": -0.13260869565217392,
      "y": 0.49283667621776506,
      "summary": "workflow_start",
      "description": "workflow_start"
    },
    "workflow_end": {
      "name": "workflow_end",
      "groups": [],
      "x": 1.4297101449275362,
      "y": 1.180515759312321,
      "summary": "workflow_end",
      "description": "workflow_end"
    },
    "167f": {
      "name": "RunCommandTemplate",
      "summary": "Add Image(s)",
      "description": "Run a Command Template against devices.",
      "location": "Application",
      "locationType": null,
      "app": "MOP",
      "displayName": "Command Templates",
      "type": "automatic",
      "variables": {
        "incoming": {
          "template": "Cisco IOS XR Upgrade Add Source",
          "variables": "$var.870d.merged_object",
          "devices": "$var.job.device"
        },
        "outgoing": {
          "mop_template_results": null
        },
        "error": ""
      },
      "deprecated": false,
      "matched": [
        {
          "key": "name",
          "highlightString": "<span class='highlight-string'>RunComman</span>dTemplate"
        }
      ],
      "groups": [],
      "actor": "Pronghorn",
      "x": 0.08115942028985507,
      "y": 0.49426934097421205,
      "scheduled": false
    },
    "ca97": {
      "name": "childJob",
      "summary": "Async Add Install Source",
      "description": "Run a child Job inside a Workflow",
      "location": "Application",
      "locationType": null,
      "app": "WorkFlowEngine",
      "displayName": "WorkFlowEngine",
      "type": "operation",
      "variables": {
        "incoming": {
          "task": "",
          "workflow": "Cisco IOS XR Upgrade Async Install Op",
          "variables": {
            "mop_template_results": {
              "variable": "",
              "task": "167f",
              "value": "mop_template_results"
            },
            "device": {
              "variable": "",
              "task": "job",
              "value": "device"
            },
            "mode": {
              "variable": "",
              "task": "job",
              "editable": true,
              "value": "mode"
            }
          },
          "data_array": "",
          "transformation": "",
          "loopType": ""
        },
        "outgoing": {
          "job_details": null
        }
      },
      "deprecated": false,
      "matched": [
        {
          "key": "name",
          "highlightString": "<span class='highlight-string'>childJob</span>"
        }
      ],
      "groups": [],
      "actor": "job",
      "x": 0.2543478260869565,
      "y": 0.49140401146131807
    },
    "b9d2": {
      "name": "RunCommandTemplate",
      "summary": "Verify Packages",
      "description": "Run a Command Template against devices.",
      "location": "Application",
      "locationType": null,
      "app": "MOP",
      "displayName": "Command Templates",
      "type": "automatic",
      "variables": {
        "incoming": {
          "template": "Cisco IOS XR Upgrade Verify Packages",
          "variables": "$var.fa98.merged_object",
          "devices": "$var.job.device"
        },
        "outgoing": {
          "mop_template_results": null
        },
        "error": ""
      },
      "deprecated": false,
      "matched": [
        {
          "key": "name",
          "highlightString": "<span class='highlight-string'>RunComman</span>dTemplate"
        }
      ],
      "groups": [],
      "actor": "Pronghorn",
      "x": 0.5282608695652173,
      "y": 0.48567335243553006,
      "scheduled": false
    },
    "88e0": {
      "name": "childJob",
      "summary": "Async Verify Packages",
      "description": "Run a child Job inside a Workflow",
      "location": "Application",
      "locationType": null,
      "app": "WorkFlowEngine",
      "displayName": "WorkFlowEngine",
      "type": "operation",
      "variables": {
        "incoming": {
          "task": "",
          "workflow": "Cisco IOS XR Upgrade Async Install Op",
          "variables": {
            "mop_template_results": {
              "variable": "",
              "task": "b9d2",
              "value": "mop_template_results"
            },
            "device": {
              "variable": "",
              "task": "job",
              "value": "device"
            },
            "mode": {
              "variable": "",
              "task": "job",
              "editable": true,
              "value": "mode"
            }
          },
          "data_array": "",
          "transformation": "",
          "loopType": ""
        },
        "outgoing": {
          "job_details": null
        }
      },
      "deprecated": false,
      "matched": [
        {
          "key": "name",
          "highlightString": "<span class='highlight-string'>childJob</span>"
        }
      ],
      "groups": [],
      "actor": "job",
      "x": 0.7043478260869566,
      "y": 0.4828080229226361
    },
    "db81": {
      "name": "query",
      "summary": "Query install add source operation ID",
      "description": "Query data using a dot/bracket notation string and a matching key/value pair.",
      "location": "Application",
      "locationType": null,
      "app": "WorkFlowEngine",
      "displayName": "WorkFlowEngine",
      "type": "operation",
      "variables": {
        "incoming": {
          "pass_on_null": false,
          "query": "operation_id",
          "obj": "$var.ca97.job_details"
        },
        "outgoing": {
          "return_data": null
        },
        "error": ""
      },
      "deprecated": false,
      "matched": [
        {
          "key": "name",
          "highlightString": "<span class='highlight-string'>query</span>"
        },
        {
          "key": "summary",
          "highlightString": "<span class='highlight-string'>Query</span> Data Using 'json-query' Format"
        },
        {
          "key": "description",
          "highlightString": "<span class='highlight-string'>Query</span> data using a dot/bracket notation string and a matching key/value pair."
        }
      ],
      "groups": [],
      "x": 0.3934782608695652,
      "y": 0.49426934097421205,
      "scheduled": false
    },
    "9b51": {
      "name": "RunCommandTemplate",
      "summary": "Prepare Install",
      "description": "Run a Command Template against devices.",
      "location": "Application",
      "locationType": null,
      "app": "MOP",
      "displayName": "Command Templates",
      "type": "automatic",
      "variables": {
        "incoming": {
          "template": "Cisco IOS XR Upgrade Prepare Install",
          "variables": "$var.381b.merged_object",
          "devices": "$var.job.device"
        },
        "outgoing": {
          "mop_template_results": null
        },
        "error": ""
      },
      "deprecated": false,
      "matched": [
        {
          "key": "name",
          "highlightString": "<span class='highlight-string'>RunComman</span>dTemplate"
        }
      ],
      "groups": [],
      "actor": "Pronghorn",
      "x": 0.9231884057971015,
      "y": 0.4813753581661891,
      "scheduled": false
    },
    "76df": {
      "name": "childJob",
      "summary": "Async Prepare Install",
      "description": "Run a child Job inside a Workflow",
      "location": "Application",
      "locationType": null,
      "app": "WorkFlowEngine",
      "displayName": "WorkFlowEngine",
      "type": "operation",
      "variables": {
        "incoming": {
          "task": "",
          "workflow": "Cisco IOS XR Upgrade Async Install Op",
          "variables": {
            "mop_template_results": {
              "variable": "",
              "task": "9b51",
              "value": "mop_template_results"
            },
            "device": {
              "variable": "",
              "task": "job",
              "value": "device"
            },
            "mode": {
              "variable": "",
              "task": "job",
              "editable": true,
              "value": "mode"
            }
          },
          "data_array": "",
          "transformation": "",
          "loopType": ""
        },
        "outgoing": {
          "job_details": null
        }
      },
      "deprecated": false,
      "matched": [
        {
          "key": "name",
          "highlightString": "<span class='highlight-string'>childJob</span>"
        }
      ],
      "groups": [],
      "actor": "job",
      "x": 1.0905797101449275,
      "y": 0.4813753581661891
    },
    "b472": {
      "name": "RunCommandTemplate",
      "summary": "Activate Install",
      "description": "Run a Command Template against devices.",
      "location": "Application",
      "locationType": null,
      "app": "MOP",
      "displayName": "Command Templates",
      "type": "automatic",
      "variables": {
        "incoming": {
          "template": "Cisco IOS XR Upgrade Activate Install",
          "variables": "$var.fa98.merged_object",
          "devices": "$var.job.device"
        },
        "outgoing": {
          "mop_template_results": null
        },
        "error": ""
      },
      "deprecated": false,
      "matched": [
        {
          "key": "name",
          "highlightString": "<span class='highlight-string'>RunComman</span>dTemplate"
        }
      ],
      "groups": [],
      "actor": "Pronghorn",
      "x": 1.2594202898550724,
      "y": 0.4813753581661891,
      "scheduled": false
    },
    "21c7": {
      "name": "evaluation",
      "summary": "Run Evaluation Task",
      "description": "Run an evaluation",
      "location": "Application",
      "locationType": null,
      "app": "WorkFlowEngine",
      "displayName": "WorkFlowEngine",
      "type": "operation",
      "variables": {
        "incoming": {
          "all_true_flag": false,
          "evaluation_groups": [
            {
              "all_true_flag": false,
              "evaluations": [
                {
                  "query": "response",
                  "operand_1": {
                    "variable": "job_details",
                    "task": "ca97"
                  },
                  "operator": "==",
                  "operand_2": {
                    "variable": "success",
                    "task": "static"
                  }
                }
              ]
            }
          ]
        },
        "outgoing": {
          "return_value": null
        }
      },
      "deprecated": false,
      "matched": [
        {
          "key": "name",
          "highlightString": "<span class='highlight-string'>eval</span>uation"
        },
        {
          "key": "summary",
          "highlightString": "Run <span class='highlight-string'>Eval</span>uation Task"
        },
        {
          "key": "description",
          "highlightString": "Run an <span class='highlight-string'>eval</span>uation"
        }
      ],
      "groups": [],
      "x": 0.3681159420289855,
      "y": 0.6891117478510028
    },
    "e1b0": {
      "name": "evaluation",
      "summary": "Run Evaluation Task",
      "description": "Run an evaluation",
      "location": "Application",
      "locationType": null,
      "app": "WorkFlowEngine",
      "displayName": "WorkFlowEngine",
      "type": "operation",
      "variables": {
        "incoming": {
          "all_true_flag": false,
          "evaluation_groups": [
            {
              "all_true_flag": false,
              "evaluations": [
                {
                  "query": "response",
                  "operand_1": {
                    "variable": "job_details",
                    "task": "88e0"
                  },
                  "operator": "==",
                  "operand_2": {
                    "variable": "success",
                    "task": "static"
                  }
                }
              ]
            }
          ]
        },
        "outgoing": {
          "return_value": null
        }
      },
      "deprecated": false,
      "matched": [
        {
          "key": "name",
          "highlightString": "<span class='highlight-string'>eval</span>uation"
        },
        {
          "key": "summary",
          "highlightString": "Run <span class='highlight-string'>Eval</span>uation Task"
        },
        {
          "key": "description",
          "highlightString": "Run an <span class='highlight-string'>eval</span>uation"
        }
      ],
      "groups": [],
      "x": 0.8427536231884057,
      "y": 0.6790830945558739
    },
    "5a57": {
      "name": "evaluation",
      "summary": "Run Evaluation Task",
      "description": "Run an evaluation",
      "location": "Application",
      "locationType": null,
      "app": "WorkFlowEngine",
      "displayName": "WorkFlowEngine",
      "type": "operation",
      "variables": {
        "incoming": {
          "all_true_flag": false,
          "evaluation_groups": [
            {
              "all_true_flag": false,
              "evaluations": [
                {
                  "query": "response",
                  "operand_1": {
                    "variable": "job_details",
                    "task": "76df"
                  },
                  "operator": "==",
                  "operand_2": {
                    "variable": "success",
                    "task": "static"
                  }
                }
              ]
            }
          ]
        },
        "outgoing": {
          "return_value": null
        }
      },
      "deprecated": false,
      "matched": [
        {
          "key": "name",
          "highlightString": "<span class='highlight-string'>eval</span>uation"
        },
        {
          "key": "summary",
          "highlightString": "Run <span class='highlight-string'>Eval</span>uation Task"
        },
        {
          "key": "description",
          "highlightString": "Run an <span class='highlight-string'>eval</span>uation"
        }
      ],
      "groups": [],
      "x": 1.191304347826087,
      "y": 0.6848137535816619
    },
    "e7d9": {
      "name": "evaluation",
      "summary": "Run Evaluation Task",
      "description": "Run an evaluation",
      "location": "Application",
      "locationType": null,
      "app": "WorkFlowEngine",
      "displayName": "WorkFlowEngine",
      "type": "operation",
      "variables": {
        "incoming": {
          "all_true_flag": false,
          "evaluation_groups": [
            {
              "all_true_flag": false,
              "evaluations": [
                {
                  "query": "response",
                  "operand_1": {
                    "variable": "job_details",
                    "task": "2092"
                  },
                  "operator": "==",
                  "operand_2": {
                    "variable": "success",
                    "task": "static"
                  }
                }
              ]
            }
          ]
        },
        "outgoing": {
          "return_value": null
        }
      },
      "deprecated": false,
      "matched": [
        {
          "key": "name",
          "highlightString": "<span class='highlight-string'>eval</span>uation"
        },
        {
          "key": "summary",
          "highlightString": "Run <span class='highlight-string'>Eval</span>uation Task"
        },
        {
          "key": "description",
          "highlightString": "Run an <span class='highlight-string'>eval</span>uation"
        }
      ],
      "groups": [],
      "x": 1.423913043478261,
      "y": 0.7077363896848138
    },
    "b017": {
      "name": "newVariable",
      "summary": "Create a Job Variable",
      "description": "Create a new Job variable by Job ID and assign it a value.",
      "location": "Application",
      "locationType": null,
      "app": "WorkFlowEngine",
      "displayName": "WorkFlowEngine",
      "type": "operation",
      "variables": {
        "incoming": {
          "name": "response",
          "value": "failure"
        },
        "outgoing": {
          "value": null
        }
      },
      "deprecated": false,
      "matched": [
        {
          "key": "summary",
          "highlightString": "Create a <span class='highlight-string'>Job</span> Variable"
        },
        {
          "key": "description",
          "highlightString": "Create a new <span class='highlight-string'>Job</span> variable by Job ID and assign it a value."
        }
      ],
      "groups": [],
      "x": 1.0130434782608695,
      "y": 1.1848137535816619
    },
    "d117": {
      "name": "newVariable",
      "summary": "Create a Job Variable",
      "description": "Create a new Job variable by Job ID and assign it a value.",
      "location": "Application",
      "locationType": null,
      "app": "WorkFlowEngine",
      "displayName": "WorkFlowEngine",
      "type": "operation",
      "variables": {
        "incoming": {
          "name": "response",
          "value": "success"
        },
        "outgoing": {
          "value": null
        }
      },
      "deprecated": false,
      "matched": [
        {
          "key": "summary",
          "highlightString": "Create a <span class='highlight-string'>Job</span> Variable"
        },
        {
          "key": "description",
          "highlightString": "Create a new <span class='highlight-string'>Job</span> variable by Job ID and assign it a value."
        }
      ],
      "groups": [],
      "x": 1.4268115942028985,
      "y": 0.9498567335243553
    },
    "fa98": {
      "name": "merge",
      "summary": "Create admin template var",
      "description": "Merge data into a single object",
      "location": "Application",
      "locationType": null,
      "app": "WorkFlowEngine",
      "displayName": "WorkFlowEngine",
      "type": "operation",
      "variables": {
        "incoming": {
          "data_to_merge": [
            {
              "key": "admin",
              "value": {
                "task": "job",
                "variable": "admin",
                "editable": true
              }
            }
          ]
        },
        "outgoing": {
          "merged_object": null
        }
      },
      "deprecated": false,
      "matched": [
        {
          "key": "name",
          "highlightString": "<span class='highlight-string'>merge</span>"
        },
        {
          "key": "summary",
          "highlightString": "<span class='highlight-string'>Merge</span> Data"
        },
        {
          "key": "description",
          "highlightString": "<span class='highlight-string'>Merge</span> data into a single object"
        }
      ],
      "groups": [],
      "x": -0.06739130434782609,
      "y": 0.4899713467048711
    },
    "870d": {
      "name": "deepmerge",
      "summary": "Merge install add vars",
      "description": "Merge data using extend",
      "location": "Application",
      "locationType": null,
      "app": "WorkFlowEngine",
      "displayName": "WorkFlowEngine",
      "type": "operation",
      "variables": {
        "incoming": {
          "data_to_merge": [
            {
              "key": "",
              "value": {
                "task": "job",
                "variable": "image",
                "editable": true
              }
            },
            {
              "key": "",
              "value": {
                "task": "fa98",
                "variable": "merged_object"
              }
            }
          ]
        },
        "outgoing": {
          "merged_object": null
        }
      },
      "deprecated": false,
      "matched": [
        {
          "key": "name",
          "highlightString": "<span class='highlight-string'>deep</span>merge"
        },
        {
          "key": "summary",
          "highlightString": "<span class='highlight-string'>Deep</span> Merge Data"
        }
      ],
      "groups": [],
      "x": -0.005797101449275362,
      "y": 0.49140401146131807
    },
    "381b": {
      "name": "deepmerge",
      "summary": "Create install prepare template vars",
      "description": "Merge data using extend",
      "location": "Application",
      "locationType": null,
      "app": "WorkFlowEngine",
      "displayName": "WorkFlowEngine",
      "type": "operation",
      "variables": {
        "incoming": {
          "data_to_merge": [
            {
              "key": "",
              "value": {
                "task": "fa98",
                "variable": "merged_object"
              }
            },
            {
              "key": "",
              "value": {
                "task": "247",
                "variable": "merged_object"
              }
            }
          ]
        },
        "outgoing": {
          "merged_object": null
        }
      },
      "deprecated": false,
      "matched": [
        {
          "key": "name",
          "highlightString": "<span class='highlight-string'>deep</span>merge"
        },
        {
          "key": "summary",
          "highlightString": "<span class='highlight-string'>Deep</span> Merge Data"
        }
      ],
      "groups": [],
      "x": 0.8391304347826087,
      "y": 0.48567335243553006
    }
  },
  "transitions": {
    "247": {
      "b9d2": {
        "type": "standard",
        "state": "success"
      }
    },
    "2092": {
      "e7d9": {
        "type": "standard",
        "state": "success"
      }
    },
    "workflow_start": {
      "fa98": {
        "type": "standard",
        "state": "success"
      }
    },
    "workflow_end": {},
    "167f": {
      "ca97": {
        "type": "standard",
        "state": "success"
      }
    },
    "ca97": {
      "21c7": {
        "type": "standard",
        "state": "success"
      }
    },
    "b9d2": {
      "88e0": {
        "type": "standard",
        "state": "success"
      }
    },
    "88e0": {
      "e1b0": {
        "type": "standard",
        "state": "success"
      }
    },
    "db81": {
      "247": {
        "type": "standard",
        "state": "success"
      }
    },
    "8fff": {},
    "9b51": {
      "76df": {
        "type": "standard",
        "state": "success"
      }
    },
    "76df": {
      "5a57": {
        "type": "standard",
        "state": "success"
      }
    },
    "b472": {
      "2092": {
        "type": "standard",
        "state": "success"
      }
    },
    "21c7": {
      "db81": {
        "type": "standard",
        "state": "success"
      },
      "b017": {
        "type": "standard",
        "state": "failure"
      }
    },
    "e1b0": {
      "381b": {
        "type": "standard",
        "state": "success"
      },
      "b017": {
        "type": "standard",
        "state": "failure"
      }
    },
    "5a57": {
      "b472": {
        "type": "standard",
        "state": "success"
      },
      "b017": {
        "type": "standard",
        "state": "failure"
      }
    },
    "e7d9": {
      "d117": {
        "type": "standard",
        "state": "success"
      },
      "b017": {
        "type": "standard",
        "state": "failure"
      }
    },
    "b017": {
      "workflow_end": {
        "type": "standard",
        "state": "success"
      }
    },
    "d117": {
      "workflow_end": {
        "type": "standard",
        "state": "success"
      }
    },
    "80ed": {},
    "fa98": {
      "870d": {
        "type": "standard",
        "state": "success"
      }
    },
    "870d": {
      "167f": {
        "type": "standard",
        "state": "success"
      }
    },
    "381b": {
      "9b51": {
        "type": "standard",
        "state": "success"
      }
    }
  },
  "font_size": 12,
  "created": "2020-01-20T15:46:08.911Z",
  "created_by": {
    "provenance": "Local AAA",
    "username": "Itential Artifacts",
    "firstname": "admin",
    "inactive": true,
    "email": ""
  },
  "createdVersion": "4.5.3-2019.2.9.0",
  "last_updated": "2021-02-18T15:29:49.289Z",
  "last_updated_by": {
    "provenance": "local_aaa",
    "username": "admin@pronghorn",
    "firstname": "admin",
    "inactive": false,
    "email": "rahul.chakraborty@itential.com"
  },
  "lastUpdatedVersion": "5.29.14-2020.2.9",
  "type": "automation",
  "description": null,
  "inputSchema": {
    "type": "object",
    "properties": {
      "device": {
        "type": [
          "array",
          "boolean",
          "null",
          "number",
          "object",
          "string"
        ]
      },
      "mode": {
        "type": [
          "array",
          "boolean",
          "null",
          "number",
          "object",
          "string"
        ]
      },
      "admin": {
        "type": [
          "array",
          "boolean",
          "null",
          "number",
          "object",
          "string"
        ]
      },
      "image": {
        "type": [
          "array",
          "boolean",
          "null",
          "number",
          "object",
          "string"
        ]
      }
    },
    "required": [
      "device",
      "mode",
      "admin",
      "image"
    ]
  },
  "outputSchema": {
    "type": "object",
    "properties": {
      "device": {
        "type": [
          "array",
          "boolean",
          "null",
          "number",
          "object",
          "string"
        ]
      },
      "mode": {
        "type": [
          "array",
          "boolean",
          "null",
          "number",
          "object",
          "string"
        ]
      },
      "admin": {
        "type": [
          "array",
          "boolean",
          "null",
          "number",
          "object",
          "string"
        ]
      },
      "image": {
        "type": [
          "array",
          "boolean",
          "null",
          "number",
          "object",
          "string"
        ]
      },
      "_id": {
        "type": "string",
        "pattern": "^[0-9a-f]{24}$"
      },
      "initiator": {
        "type": "string"
      },
      "response": {
        "type": "string"
      }
    }
  },
  "tags": [],
  "groups": []
}
