{
  "name": "Cisco IOS XR Upgrade Commit Install",
  "tasks": {
    "2803": {
      "name": "newVariable",
      "summary": "Create a Job Variable",
      "description": "Create a new Job variable by Job ID and assign it a value.",
      "location": "Application",
      "locationType": null,
      "app": "WorkFlowEngine",
      "displayName": "WorkFlowEngine",
      "type": "operation",
      "variables": {
        "incoming": {
          "name": "response",
          "value": "failure"
        },
        "outgoing": {
          "value": null
        }
      },
      "deprecated": false,
      "matched": [
        {
          "key": "summary",
          "highlightString": "Create a <span class='highlight-string'>Job</span> Variable"
        },
        {
          "key": "description",
          "highlightString": "Create a new <span class='highlight-string'>Job</span> variable by Job ID and assign it a value."
        }
      ],
      "groups": [],
      "x": 0.5942028985507246,
      "y": 1
    },
    "8264": {
      "name": "RunCommandTemplate",
      "summary": "Remove Inactive Packages",
      "description": "Run a Command Template against devices.",
      "location": "Application",
      "locationType": null,
      "app": "MOP",
      "displayName": "Command Templates",
      "type": "automatic",
      "variables": {
        "incoming": {
          "template": "Cisco IOS XR Upgrade Remove Packages",
          "variables": "$var.7a4a.merged_object",
          "devices": "$var.job.device"
        },
        "outgoing": {
          "mop_template_results": null
        },
        "error": ""
      },
      "deprecated": false,
      "matched": [
        {
          "key": "name",
          "highlightString": "<span class='highlight-string'>RunComman</span>dTemplate"
        }
      ],
      "groups": [],
      "actor": "Pronghorn",
      "x": 0.4976647418478261,
      "y": 0.5093123209169055,
      "scheduled": false
    },
    "workflow_start": {
      "name": "workflow_start",
      "groups": [],
      "x": -0.13333333333333333,
      "y": 0.504297994269341,
      "summary": "workflow_start",
      "description": "workflow_start"
    },
    "workflow_end": {
      "name": "workflow_end",
      "groups": [],
      "x": 0.9289855072463769,
      "y": 0.9928366762177651,
      "summary": "workflow_end",
      "description": "workflow_end"
    },
    "b45d": {
      "name": "childJob",
      "summary": "Async Commit Install",
      "description": "Run a child Job inside a Workflow",
      "location": "Application",
      "locationType": null,
      "app": "WorkFlowEngine",
      "displayName": "WorkFlowEngine",
      "type": "operation",
      "variables": {
        "incoming": {
          "task": "",
          "workflow": "Cisco IOS XR Upgrade Async Install Op",
          "variables": {
            "mop_template_results": {
              "variable": "",
              "task": "652d",
              "value": "mop_template_results"
            },
            "device": {
              "variable": "",
              "task": "job",
              "value": "device"
            },
            "mode": {
              "variable": "",
              "task": "job",
              "editable": true,
              "value": "mode"
            }
          },
          "data_array": "",
          "transformation": "",
          "loopType": ""
        },
        "outgoing": {
          "job_details": null
        }
      },
      "deprecated": false,
      "matched": [
        {
          "key": "name",
          "highlightString": "<span class='highlight-string'>childJob</span>"
        }
      ],
      "groups": [],
      "actor": "job",
      "x": 0.286231884057971,
      "y": 0.5100286532951289
    },
    "652d": {
      "name": "RunCommandTemplate",
      "summary": "Commit Install",
      "description": "Run a Command Template against devices.",
      "location": "Application",
      "locationType": null,
      "app": "MOP",
      "displayName": "Command Templates",
      "type": "automatic",
      "variables": {
        "incoming": {
          "template": "Cisco IOS XR Upgrade Commit Install",
          "variables": "$var.7a4a.merged_object",
          "devices": "$var.job.device"
        },
        "outgoing": {
          "mop_template_results": null
        },
        "error": ""
      },
      "deprecated": false,
      "matched": [
        {
          "key": "name",
          "highlightString": "<span class='highlight-string'>RunComman</span>dTemplate"
        }
      ],
      "groups": [],
      "actor": "Pronghorn",
      "x": 0.10434782608695652,
      "y": 0.5085959885386819,
      "scheduled": false
    },
    "8e3f": {
      "name": "childJob",
      "summary": "Async Remove Inactive Packages",
      "description": "Run a child Job inside a Workflow",
      "location": "Application",
      "locationType": null,
      "app": "WorkFlowEngine",
      "displayName": "WorkFlowEngine",
      "type": "operation",
      "variables": {
        "incoming": {
          "task": "",
          "workflow": "Cisco IOS XR Upgrade Async Install Op",
          "variables": {
            "mop_template_results": {
              "variable": "",
              "task": "8264",
              "value": "mop_template_results"
            },
            "device": {
              "variable": "",
              "task": "job",
              "value": "device"
            },
            "mode": {
              "variable": "",
              "task": "job",
              "editable": true,
              "value": "mode"
            }
          },
          "data_array": "",
          "transformation": "",
          "loopType": ""
        },
        "outgoing": {
          "job_details": null
        }
      },
      "deprecated": false,
      "matched": [
        {
          "key": "name",
          "highlightString": "<span class='highlight-string'>childJob</span>"
        }
      ],
      "groups": [],
      "actor": "job",
      "x": 0.6927536231884058,
      "y": 0.5114613180515759
    },
    "c9c4": {
      "name": "evaluation",
      "summary": "Run Evaluation Task",
      "description": "Run an evaluation",
      "location": "Application",
      "locationType": null,
      "app": "WorkFlowEngine",
      "displayName": "WorkFlowEngine",
      "type": "operation",
      "variables": {
        "incoming": {
          "all_true_flag": false,
          "evaluation_groups": [
            {
              "all_true_flag": false,
              "evaluations": [
                {
                  "query": "response",
                  "operand_1": {
                    "variable": "job_details",
                    "task": "b45d"
                  },
                  "operator": "==",
                  "operand_2": {
                    "variable": "success",
                    "task": "static"
                  }
                }
              ]
            }
          ]
        },
        "outgoing": {
          "return_value": null
        }
      },
      "deprecated": false,
      "matched": [
        {
          "key": "name",
          "highlightString": "<span class='highlight-string'>eval</span>uation"
        },
        {
          "key": "summary",
          "highlightString": "Run <span class='highlight-string'>Eval</span>uation Task"
        },
        {
          "key": "description",
          "highlightString": "Run an <span class='highlight-string'>eval</span>uation"
        }
      ],
      "groups": [],
      "x": 0.40942028985507245,
      "y": 0.6790830945558739
    },
    "f607": {
      "name": "evaluation",
      "summary": "Run Evaluation Task",
      "description": "Run an evaluation",
      "location": "Application",
      "locationType": null,
      "app": "WorkFlowEngine",
      "displayName": "WorkFlowEngine",
      "type": "operation",
      "variables": {
        "incoming": {
          "all_true_flag": false,
          "evaluation_groups": [
            {
              "all_true_flag": false,
              "evaluations": [
                {
                  "query": "response",
                  "operand_1": {
                    "variable": "job_details",
                    "task": "8e3f"
                  },
                  "operator": "==",
                  "operand_2": {
                    "variable": "success",
                    "task": "static"
                  }
                }
              ]
            }
          ]
        },
        "outgoing": {
          "return_value": null
        }
      },
      "deprecated": false,
      "matched": [
        {
          "key": "name",
          "highlightString": "<span class='highlight-string'>eval</span>uation"
        },
        {
          "key": "summary",
          "highlightString": "Run <span class='highlight-string'>Eval</span>uation Task"
        },
        {
          "key": "description",
          "highlightString": "Run an <span class='highlight-string'>eval</span>uation"
        }
      ],
      "groups": [],
      "x": 0.8166666666666667,
      "y": 0.6848137535816619
    },
    "7a4a": {
      "name": "merge",
      "summary": "Create template vars",
      "description": "Merge data into a single object",
      "location": "Application",
      "locationType": null,
      "app": "WorkFlowEngine",
      "displayName": "WorkFlowEngine",
      "type": "operation",
      "variables": {
        "incoming": {
          "data_to_merge": [
            {
              "key": "admin",
              "value": {
                "task": "job",
                "variable": "admin",
                "editable": true
              }
            }
          ]
        },
        "outgoing": {
          "merged_object": null
        }
      },
      "deprecated": false,
      "matched": [
        {
          "key": "name",
          "highlightString": "<span class='highlight-string'>merge</span>"
        },
        {
          "key": "summary",
          "highlightString": "<span class='highlight-string'>Merge</span> Data"
        },
        {
          "key": "description",
          "highlightString": "<span class='highlight-string'>Merge</span> data into a single object"
        }
      ],
      "groups": [],
      "x": 0.004347826086956522,
      "y": 0.501432664756447
    },
    "f6c4": {
      "name": "newVariable",
      "summary": "Create a Job Variable",
      "description": "Create a new Job variable by Job ID and assign it a value.",
      "location": "Application",
      "locationType": null,
      "app": "WorkFlowEngine",
      "displayName": "WorkFlowEngine",
      "type": "operation",
      "variables": {
        "incoming": {
          "name": "response",
          "value": "success"
        },
        "outgoing": {
          "value": null
        }
      },
      "deprecated": false,
      "matched": [
        {
          "key": "summary",
          "highlightString": "Create a <span class='highlight-string'>Job</span> Variable"
        },
        {
          "key": "description",
          "highlightString": "Create a new <span class='highlight-string'>Job</span> variable by Job ID and assign it a value."
        }
      ],
      "groups": [],
      "x": 0.9239130434782609,
      "y": 0.5128939828080229
    },
    "51f4": {
      "name": "evaluation",
      "summary": "Eval zero touch",
      "description": "Run an evaluation",
      "location": "Application",
      "locationType": null,
      "app": "WorkFlowEngine",
      "displayName": "WorkFlowEngine",
      "type": "operation",
      "variables": {
        "incoming": {
          "all_true_flag": false,
          "evaluation_groups": [
            {
              "all_true_flag": false,
              "evaluations": [
                {
                  "query": "",
                  "operand_1": {
                    "variable": "mode",
                    "task": "job",
                    "editable": true
                  },
                  "operator": "==",
                  "operand_2": {
                    "variable": "Zero Touch",
                    "task": "static"
                  }
                }
              ]
            }
          ]
        },
        "outgoing": {
          "return_value": null
        }
      },
      "deprecated": false,
      "matched": [
        {
          "key": "name",
          "highlightString": "<span class='highlight-string'>eval</span>uation"
        },
        {
          "key": "summary",
          "highlightString": "Run <span class='highlight-string'>Eval</span>uation Task"
        },
        {
          "key": "description",
          "highlightString": "Run an <span class='highlight-string'>eval</span>uation"
        }
      ],
      "groups": [],
      "x": -0.06376811594202898,
      "y": 0.5071633237822349
    },
    "6b9b": {
      "name": "ViewData",
      "summary": "Commit install",
      "description": "View data in a pretty format",
      "location": "Application",
      "app": "WorkFlowEngine",
      "displayName": "Tools",
      "type": "manual",
      "variables": {
        "incoming": {
          "header": "ATTENTION",
          "message": "",
          "body": "Ready to commit install? Press ok to proceed, or abort to exit.",
          "btn_success": "Ok",
          "btn_failure": "Abort"
        },
        "outgoing": {},
        "error": ""
      },
      "view": "/workflow_engine/task/ViewData",
      "deprecated": false,
      "matched": [
        {
          "key": "name",
          "highlightString": "<span class='highlight-string'>ViewData</span>"
        }
      ],
      "groups": [],
      "x": -0.0644927536231884,
      "y": 0.9928366762177651,
      "scheduled": false
    },
    "83e0": {
      "name": "stub",
      "summary": "Rollback",
      "description": "Create a stub for an automated task",
      "location": "Application",
      "locationType": null,
      "app": "WorkFlowEngine",
      "displayName": "Tools",
      "type": "automatic",
      "variables": {
        "incoming": {
          "type": "success",
          "delay": "",
          "response": ""
        },
        "outgoing": {
          "response": null
        },
        "error": ""
      },
      "deprecated": false,
      "matched": [
        {
          "key": "name",
          "highlightString": "<span class='highlight-string'>stub</span>"
        },
        {
          "key": "summary",
          "highlightString": "<span class='highlight-string'>Stub</span>"
        },
        {
          "key": "description",
          "highlightString": "Create a <span class='highlight-string'>stub</span> for an automated task"
        }
      ],
      "groups": [],
      "actor": "Pronghorn",
      "x": 0.25507246376811593,
      "y": 0.9899713467048711,
      "scheduled": false
    }
  },
  "transitions": {
    "2803": {
      "workflow_end": {
        "type": "standard",
        "state": "success"
      }
    },
    "8264": {
      "8e3f": {
        "type": "standard",
        "state": "success"
      }
    },
    "workflow_start": {
      "51f4": {
        "type": "standard",
        "state": "success"
      }
    },
    "workflow_end": {},
    "b45d": {
      "c9c4": {
        "type": "standard",
        "state": "success"
      }
    },
    "652d": {
      "b45d": {
        "type": "standard",
        "state": "success"
      }
    },
    "8e3f": {
      "f607": {
        "type": "standard",
        "state": "success"
      }
    },
    "c9c4": {
      "2803": {
        "type": "standard",
        "state": "failure"
      },
      "8264": {
        "type": "standard",
        "state": "success"
      }
    },
    "f607": {
      "2803": {
        "type": "standard",
        "state": "failure"
      },
      "f6c4": {
        "type": "standard",
        "state": "success"
      }
    },
    "7a4a": {
      "652d": {
        "type": "standard",
        "state": "success"
      }
    },
    "f6c4": {
      "workflow_end": {
        "type": "standard",
        "state": "success"
      }
    },
    "51f4": {
      "7a4a": {
        "type": "standard",
        "state": "success"
      },
      "6b9b": {
        "type": "standard",
        "state": "failure"
      }
    },
    "6b9b": {
      "7a4a": {
        "type": "standard",
        "state": "success"
      },
      "83e0": {
        "type": "standard",
        "state": "failure"
      }
    },
    "83e0": {
      "2803": {
        "type": "standard",
        "state": "success"
      }
    }
  },
  "font_size": 12,
  "created": "2020-01-21T21:09:53.336Z",
  "created_by": {
    "provenance": "Local AAA",
    "username": "admin@pronghorn",
    "firstname": "admin",
    "inactive": true,
    "email": ""
  },
  "createdVersion": "4.5.3-2019.2.9.0",
  "last_updated": "2021-02-18T15:29:47.232Z",
  "last_updated_by": {
    "provenance": "local_aaa",
    "username": "admin@pronghorn",
    "firstname": "admin",
    "inactive": false,
    "email": "rahul.chakraborty@itential.com"
  },
  "lastUpdatedVersion": "5.29.14-2020.2.9",
  "type": "automation",
  "description": null,
  "inputSchema": {
    "type": "object",
    "properties": {
      "device": {
        "type": [
          "array",
          "boolean",
          "null",
          "number",
          "object",
          "string"
        ]
      },
      "mode": {
        "type": [
          "array",
          "boolean",
          "null",
          "number",
          "object",
          "string"
        ]
      },
      "admin": {
        "type": [
          "array",
          "boolean",
          "null",
          "number",
          "object",
          "string"
        ]
      }
    },
    "required": [
      "device",
      "mode",
      "admin"
    ]
  },
  "outputSchema": {
    "type": "object",
    "properties": {
      "device": {
        "type": [
          "array",
          "boolean",
          "null",
          "number",
          "object",
          "string"
        ]
      },
      "mode": {
        "type": [
          "array",
          "boolean",
          "null",
          "number",
          "object",
          "string"
        ]
      },
      "admin": {
        "type": [
          "array",
          "boolean",
          "null",
          "number",
          "object",
          "string"
        ]
      },
      "_id": {
        "type": "string",
        "pattern": "^[0-9a-f]{24}$"
      },
      "initiator": {
        "type": "string"
      },
      "response": {
        "type": "string"
      }
    }
  },
  "tags": [],
  "groups": []
}
