{
  "tags": [],
  "name": "Cisco IOS XR Upgrade Activate Install",
  "os": "",
  "passRule": true,
  "ignoreWarnings": false,
  "commands": [
    {
      "command": "<!admin!> install activate noprompt",
      "passRule": true,
      "rules": [
        {
          "rule": "Install operation \\d+ started",
          "eval": "RegEx",
          "severity": "error"
        },
        {
          "rule": "Install operation \\d+ aborted",
          "eval": "!RegEx",
          "severity": "error"
        }
      ]
    }
  ],
  "created": 1579105585322,
  "createdBy": "admin@pronghorn",
  "lastUpdated": 1581685050818,
  "lastUpdatedBy": "admin@pronghorn"
}
