{
  "tags": [],
  "name": "Cisco IOS XR Upgrade Check Install",
  "os": "",
  "passRule": true,
  "ignoreWarnings": false,
  "commands": [
    {
      "command": "show install active",
      "passRule": true,
      "rules": [
        {
          "rule": "",
          "eval": "contains",
          "severity": "error"
        }
      ]
    },
    {
      "command": "admin show install active",
      "passRule": true,
      "rules": [
        {
          "rule": "",
          "eval": "contains",
          "severity": "error"
        }
      ]
    }
  ],
  "created": 1579741209250,
  "createdBy": "Itential Artifacts",
  "lastUpdated": 1581685050789,
  "lastUpdatedBy": "admin@pronghorn"
}
