{
  "_id": "62abae449cd6a8017a5ed99e",
  "name": "asaUpgradeFormData",
  "description": "",
  "incoming": [
    {
      "$id": "formData",
      "title": "IAP Artifacts IOS Upgrade Form",
      "description": "A form to be used in conjunction with Itential's \"Cisco IOS Device Upgrade\" Artifacts ",
      "type": "object",
      "required": [
        "mode",
        "asaDeviceHostname"
      ],
      "properties": {
        "mode": {
          "type": "string",
          "title": "Mode",
          "description": "",
          "enum": [
            "Zero Touch",
            "Normal",
            "Verbose"
          ]
        },
        "asaDeviceHostname": {
          "type": "string",
          "title": "ASA Device Hostname",
          "description": ""
        },
        "flashMemory": {
          "type": "string",
          "title": "Flash Memory",
          "description": ""
        },
        "asaRelease": {
          "type": "string",
          "title": "asaRelease",
          "description": ""
        },
        "asdmRelease": {
          "type": "string",
          "title": "asdmRelease",
          "description": ""
        },
        "healthcheckVariables": {
          "type": "object",
          "title": "Healthcheck Variables",
          "description": "",
          "required": [],
          "properties": {
            "numberOfRetries": {
              "type": "number",
              "title": "Number of retries",
              "description": "Number of times to retry the healthcheck before concluding a failure"
            },
            "numberOfRetriesStability": {
              "type": "number",
              "title": "Number of retries stability",
              "description": "Number of consecutive successful pings required to conclude that device is stable%2E This feature will detect unstable interfaces%2E "
            },
            "secondsBetweenRetry": {
              "type": "number",
              "title": "Seconds between retry",
              "description": "Number of seconds to wait in between each failed ping"
            }
          }
        }
      }
    }
  ],
  "outgoing": [
    {
      "$id": "mode",
      "type": "string"
    },
    {
      "$id": "deviceString",
      "type": "string"
    },
    {
      "$id": "fileName",
      "type": "string"
    },
    {
      "$id": "numberOfRetries",
      "type": "string"
    },
    {
      "$id": "numberOfRetriesStability",
      "type": "string"
    },
    {
      "$id": "secondsBetweenRetry",
      "type": "string"
    },
    {
      "$id": "flashMemory",
      "type": "string",
      "title": "Flash Memory",
      "description": ""
    },
    {
      "$id": "asdmFilename",
      "type": "string"
    }
  ],
  "steps": [
    {
      "id": 4,
      "type": "assign",
      "from": {
        "location": "incoming",
        "name": "formData",
        "ptr": "/mode"
      },
      "to": {
        "location": "outgoing",
        "name": "mode",
        "ptr": ""
      }
    },
    {
      "id": 7,
      "type": "assign",
      "from": {
        "location": "incoming",
        "name": "formData",
        "ptr": "/healthcheckVariables/numberOfRetries"
      },
      "to": {
        "location": "method",
        "name": 3,
        "ptr": "/args/0/value"
      }
    },
    {
      "id": 9,
      "type": "assign",
      "from": {
        "location": "incoming",
        "name": "formData",
        "ptr": "/healthcheckVariables/numberOfRetriesStability"
      },
      "to": {
        "location": "method",
        "name": 2,
        "ptr": "/args/0/value"
      }
    },
    {
      "id": 11,
      "type": "assign",
      "from": {
        "location": "incoming",
        "name": "formData",
        "ptr": "/healthcheckVariables/secondsBetweenRetry"
      },
      "to": {
        "location": "method",
        "name": 1,
        "ptr": "/args/0/value"
      }
    },
    {
      "id": 1,
      "type": "method",
      "library": "Number",
      "method": "toString",
      "args": [
        null,
        null
      ],
      "view": {
        "row": 3,
        "col": 1
      }
    },
    {
      "id": 2,
      "type": "method",
      "library": "Number",
      "method": "toString",
      "args": [
        null,
        null
      ],
      "view": {
        "row": 2,
        "col": 1
      }
    },
    {
      "id": 3,
      "type": "method",
      "library": "Number",
      "method": "toString",
      "args": [
        null,
        null
      ],
      "view": {
        "row": 1,
        "col": 1
      }
    },
    {
      "id": 8,
      "type": "assign",
      "from": {
        "location": "method",
        "name": 3,
        "ptr": "/return"
      },
      "to": {
        "location": "outgoing",
        "name": "numberOfRetries",
        "ptr": ""
      }
    },
    {
      "id": 10,
      "type": "assign",
      "from": {
        "location": "method",
        "name": 2,
        "ptr": "/return"
      },
      "to": {
        "location": "outgoing",
        "name": "numberOfRetriesStability",
        "ptr": ""
      }
    },
    {
      "id": 12,
      "type": "assign",
      "from": {
        "location": "method",
        "name": 1,
        "ptr": "/return"
      },
      "to": {
        "location": "outgoing",
        "name": "secondsBetweenRetry",
        "ptr": ""
      }
    },
    {
      "id": 13,
      "type": "assign",
      "from": {
        "location": "incoming",
        "name": "formData",
        "ptr": "/flashMemory"
      },
      "to": {
        "location": "outgoing",
        "name": "flashMemory",
        "ptr": ""
      }
    },
    {
      "id": 14,
      "type": "assign",
      "from": {
        "location": "incoming",
        "name": "formData",
        "ptr": "/asaRelease"
      },
      "to": {
        "location": "outgoing",
        "name": "fileName",
        "ptr": ""
      }
    },
    {
      "id": 15,
      "type": "assign",
      "from": {
        "location": "incoming",
        "name": "formData",
        "ptr": "/asdmRelease"
      },
      "to": {
        "location": "outgoing",
        "name": "asdmFilename",
        "ptr": ""
      }
    },
    {
      "id": 16,
      "type": "assign",
      "from": {
        "location": "incoming",
        "name": "formData",
        "ptr": "/asaDeviceHostname"
      },
      "to": {
        "location": "outgoing",
        "name": "deviceString",
        "ptr": ""
      }
    }
  ],
  "functions": [],
  "comments": [],
  "view": {
    "col": 2,
    "row": 4
  },
  "created": "2022-09-21T13:34:51.526Z",
  "createdBy": {
    "_id": "6227924883764bf953a94804",
    "provenance": "local_aaa",
    "username": "admin@pronghorn"
  },
  "lastUpdated": "2022-10-12T15:49:08.502Z",
  "lastUpdatedBy": {
    "_id": "6227924883764bf953a94804",
    "provenance": "local_aaa",
    "username": "admin@pronghorn"
  },
  "version": "3.20.4-2021.2.4",
  "tags": []
}