{
  "metadata": {
    "name": "@itentialopensource/chunk-array",
    "version": "0.0.6",
    "description": "[Deprecated] Chunk array into smaller arrays of user specified size.",
    "license": "Apache-2.0",
    "repository": {
      "type": "gitlab",
      "hostname": "gitlab.com",
      "path": "itentialopensource/pre-built-automations"
    },
    "keywords": [
      "Itential",
      "IAP",
      "artifacts"
    ],
    "author": "Itential Artifacts",
    "IAPDependencies": {
      "@itential/app-workflow_engine": ""
    },
    "gitlabId": 31221771
  },
  "manifest": {
    "bundleName": "Chunk Array",
    "fingerprint": "618c350a31a429007ce8fe38",
    "createdEpoch": "1636578570195",
    "artifacts": [
      {
        "id": "618ad3eb24cba500df985c2c",
        "name": "chunkArray",
        "type": "transformation",
        "location": "/bundles/transformations/chunkArray.json",
        "properties": {
          "entryPoint": false
        }
      }
    ]
  },
  "bundles": [
    {
      "type": "transformation",
      "data": {
        "_id": "618ad3eb24cba500df985c2c",
        "name": "chunkArray",
        "description": "",
        "incoming": [
          {
            "$id": "arr",
            "type": "array"
          },
          {
            "$id": "chunkSize",
            "type": "number"
          }
        ],
        "outgoing": [
          {
            "$id": "splitArray",
            "type": "array"
          }
        ],
        "steps": [
          {
            "id": 3,
            "type": "method",
            "library": "Array",
            "method": "length",
            "args": [
              null
            ],
            "view": {
              "row": 1,
              "col": 1
            }
          },
          {
            "id": 4,
            "type": "assign",
            "from": {
              "location": "incoming",
              "name": "arr",
              "ptr": ""
            },
            "to": {
              "location": "method",
              "name": 3,
              "ptr": "/args/0/value"
            }
          },
          {
            "id": 5,
            "type": "method",
            "library": "Math",
            "method": "divide",
            "args": [
              null,
              null
            ],
            "view": {
              "row": 2,
              "col": 1
            }
          },
          {
            "id": 6,
            "type": "method",
            "library": "Math",
            "method": "ceil",
            "args": [
              null
            ],
            "view": {
              "row": 1,
              "col": 2
            }
          },
          {
            "id": 7,
            "type": "assign",
            "from": {
              "location": "method",
              "name": 3,
              "ptr": "/return"
            },
            "to": {
              "location": "method",
              "name": 5,
              "ptr": "/args/0/value"
            }
          },
          {
            "id": 8,
            "type": "assign",
            "from": {
              "location": "incoming",
              "name": "chunkSize",
              "ptr": ""
            },
            "to": {
              "location": "method",
              "name": 5,
              "ptr": "/args/1/value"
            }
          },
          {
            "id": 9,
            "type": "assign",
            "from": {
              "location": "method",
              "name": 5,
              "ptr": "/return"
            },
            "to": {
              "location": "method",
              "name": 6,
              "ptr": "/args/0/value"
            }
          },
          {
            "id": 10,
            "type": "declaration",
            "library": "Array",
            "method": "new Array",
            "args": [
              null
            ],
            "view": {
              "row": 2,
              "col": 2
            },
            "polymorphIndex": 1
          },
          {
            "id": 11,
            "type": "assign",
            "from": {
              "location": "method",
              "name": 6,
              "ptr": "/return"
            },
            "to": {
              "location": "declaration",
              "name": 10,
              "ptr": "/args/0/value"
            }
          },
          {
            "id": 12,
            "type": "method",
            "library": "Array",
            "method": "reduce",
            "args": [
              null,
              "ƒ_reduce_2",
              [],
              null,
              null
            ],
            "view": {
              "row": 2,
              "col": 3
            }
          },
          {
            "id": 14,
            "type": "assign",
            "from": {
              "location": "incoming",
              "name": "arr",
              "ptr": ""
            },
            "to": {
              "location": "method",
              "name": 12,
              "ptr": "/args/3/value"
            }
          },
          {
            "id": 18,
            "type": "assign",
            "from": {
              "location": "method",
              "name": 12,
              "ptr": "/return"
            },
            "to": {
              "location": "outgoing",
              "name": "splitArray",
              "ptr": ""
            }
          },
          {
            "id": 21,
            "type": "assign",
            "from": {
              "location": "incoming",
              "name": "chunkSize",
              "ptr": ""
            },
            "to": {
              "location": "method",
              "name": 12,
              "ptr": "/args/4/value"
            }
          },
          {
            "id": 22,
            "type": "method",
            "library": "Array",
            "method": "fill",
            "args": [
              null,
              [],
              null,
              null
            ],
            "view": {
              "row": 3,
              "col": 2
            }
          },
          {
            "id": 23,
            "type": "assign",
            "from": {
              "location": "declaration",
              "name": 10,
              "ptr": "/return"
            },
            "to": {
              "location": "method",
              "name": 22,
              "ptr": "/args/0/value"
            }
          },
          {
            "id": 24,
            "type": "assign",
            "from": {
              "location": "method",
              "name": 22,
              "ptr": "/return"
            },
            "to": {
              "location": "method",
              "name": 12,
              "ptr": "/args/0/value"
            }
          }
        ],
        "functions": [
          {
            "incoming": [
              {
                "$id": "accumulator",
                "type": [
                  "array",
                  "boolean",
                  "number",
                  "integer",
                  "string",
                  "object",
                  "null"
                ]
              },
              {
                "type": [
                  "array",
                  "boolean",
                  "number",
                  "integer",
                  "string",
                  "object",
                  "null"
                ],
                "$id": "currentValue"
              },
              {
                "title": "index",
                "type": "number",
                "optional": true,
                "$id": "index"
              },
              {
                "type": "array",
                "$id": "array",
                "optional": true
              },
              {
                "$id": "thisArg",
                "type": "object",
                "properties": {
                  "0_arr": {
                    "$id": "arr",
                    "type": "array"
                  },
                  "1_size": {
                    "$id": "chunkSize",
                    "type": "number"
                  }
                },
                "isContext": true,
                "isIndexed": true
              }
            ],
            "outgoing": [
              {
                "title": "accumulator",
                "type": [
                  "array",
                  "boolean",
                  "number",
                  "integer",
                  "string",
                  "object",
                  "null"
                ],
                "$id": "accumulator"
              }
            ],
            "functions": [],
            "name": "ƒ_reduce_1",
            "steps": [
              {
                "id": 1,
                "type": "method",
                "library": "Array",
                "method": "slice",
                "args": [
                  null,
                  null,
                  null
                ],
                "view": {
                  "row": 2,
                  "col": 2
                }
              },
              {
                "id": 2,
                "type": "assign",
                "from": {
                  "location": "incoming",
                  "name": "thisArg",
                  "ptr": "/0_arr"
                },
                "to": {
                  "location": "method",
                  "name": 1,
                  "ptr": "/args/0/value"
                }
              },
              {
                "id": 3,
                "type": "method",
                "library": "Math",
                "method": "multiply",
                "args": [
                  null,
                  null
                ],
                "view": {
                  "row": 2,
                  "col": 1
                }
              },
              {
                "id": 4,
                "type": "assign",
                "from": {
                  "location": "incoming",
                  "name": "index",
                  "ptr": ""
                },
                "to": {
                  "location": "method",
                  "name": 3,
                  "ptr": "/args/0/value"
                }
              },
              {
                "id": 5,
                "type": "assign",
                "from": {
                  "location": "method",
                  "name": 3,
                  "ptr": "/return"
                },
                "to": {
                  "location": "method",
                  "name": 1,
                  "ptr": "/args/1/value"
                }
              },
              {
                "id": 6,
                "type": "method",
                "library": "Math",
                "method": "add",
                "args": [
                  null,
                  null
                ],
                "view": {
                  "row": 3,
                  "col": 1
                }
              },
              {
                "id": 7,
                "type": "assign",
                "from": {
                  "location": "method",
                  "name": 3,
                  "ptr": "/return"
                },
                "to": {
                  "location": "method",
                  "name": 6,
                  "ptr": "/args/0/value"
                }
              },
              {
                "id": 8,
                "type": "assign",
                "from": {
                  "location": "method",
                  "name": 6,
                  "ptr": "/return"
                },
                "to": {
                  "location": "method",
                  "name": 1,
                  "ptr": "/args/2/value"
                }
              },
              {
                "id": 9,
                "type": "method",
                "library": "Array",
                "method": "push",
                "args": [
                  null,
                  null
                ],
                "view": {
                  "row": 1,
                  "col": 3
                }
              },
              {
                "id": 10,
                "type": "assign",
                "from": {
                  "location": "incoming",
                  "name": "accumulator",
                  "ptr": ""
                },
                "to": {
                  "location": "method",
                  "name": 9,
                  "ptr": "/args/0/value"
                }
              },
              {
                "id": 11,
                "type": "assign",
                "from": {
                  "location": "method",
                  "name": 1,
                  "ptr": "/return"
                },
                "to": {
                  "location": "method",
                  "name": 9,
                  "ptr": "/args/1/value"
                }
              },
              {
                "id": 12,
                "type": "assign",
                "from": {
                  "location": "method",
                  "name": 9,
                  "ptr": "/return"
                },
                "to": {
                  "location": "outgoing",
                  "name": "accumulator",
                  "ptr": ""
                }
              },
              {
                "id": 13,
                "type": "assign",
                "from": {
                  "location": "incoming",
                  "name": "thisArg",
                  "ptr": "/1_size"
                },
                "to": {
                  "location": "method",
                  "name": 6,
                  "ptr": "/args/1/value"
                }
              },
              {
                "id": 14,
                "type": "assign",
                "from": {
                  "location": "incoming",
                  "name": "thisArg",
                  "ptr": "/1_size"
                },
                "to": {
                  "location": "method",
                  "name": 3,
                  "ptr": "/args/1/value"
                }
              }
            ],
            "view": {
              "col": 3,
              "row": 4
            },
            "id": "ƒ_reduce_1",
            "comments": []
          },
          {
            "incoming": [
              {
                "$id": "accumulator",
                "type": [
                  "array",
                  "boolean",
                  "number",
                  "integer",
                  "string",
                  "object",
                  "null"
                ]
              },
              {
                "type": [
                  "array",
                  "boolean",
                  "number",
                  "integer",
                  "string",
                  "object",
                  "null"
                ],
                "$id": "currentValue"
              },
              {
                "title": "index",
                "type": "number",
                "optional": true,
                "$id": "index"
              },
              {
                "type": "array",
                "$id": "array",
                "optional": true
              },
              {
                "$id": "thisArg",
                "type": "object",
                "properties": {
                  "0_arr": {
                    "$id": "arr",
                    "type": "array"
                  },
                  "1_chunkSize": {
                    "$id": "chunkSize",
                    "type": "number"
                  }
                },
                "isContext": true,
                "isThis": true,
                "isIndexed": true
              }
            ],
            "outgoing": [
              {
                "title": "accumulator",
                "type": [
                  "array",
                  "boolean",
                  "number",
                  "integer",
                  "string",
                  "object",
                  "null"
                ],
                "$id": "accumulator"
              }
            ],
            "functions": [],
            "name": "ƒ_reduce_2",
            "steps": [
              {
                "id": 1,
                "type": "method",
                "library": "Math",
                "method": "multiply",
                "args": [
                  null,
                  null
                ],
                "view": {
                  "row": 2,
                  "col": 1
                }
              },
              {
                "id": 2,
                "type": "method",
                "library": "Math",
                "method": "add",
                "args": [
                  null,
                  null
                ],
                "view": {
                  "row": 3,
                  "col": 1
                }
              },
              {
                "id": 3,
                "type": "method",
                "library": "Array",
                "method": "slice",
                "args": [
                  null,
                  null,
                  null
                ],
                "view": {
                  "row": 2,
                  "col": 2
                }
              },
              {
                "id": 4,
                "type": "method",
                "library": "Array",
                "method": "push",
                "args": [
                  null,
                  null
                ],
                "view": {
                  "row": 2,
                  "col": 3
                }
              },
              {
                "id": 5,
                "type": "assign",
                "from": {
                  "location": "incoming",
                  "name": "index",
                  "ptr": ""
                },
                "to": {
                  "location": "method",
                  "name": 1,
                  "ptr": "/args/0/value"
                }
              },
              {
                "id": 6,
                "type": "assign",
                "from": {
                  "location": "incoming",
                  "name": "thisArg",
                  "ptr": "/1_chunkSize"
                },
                "to": {
                  "location": "method",
                  "name": 1,
                  "ptr": "/args/1/value"
                }
              },
              {
                "id": 7,
                "type": "assign",
                "from": {
                  "location": "method",
                  "name": 1,
                  "ptr": "/return"
                },
                "to": {
                  "location": "method",
                  "name": 2,
                  "ptr": "/args/0/value"
                }
              },
              {
                "id": 8,
                "type": "assign",
                "from": {
                  "location": "incoming",
                  "name": "thisArg",
                  "ptr": "/1_chunkSize"
                },
                "to": {
                  "location": "method",
                  "name": 2,
                  "ptr": "/args/1/value"
                }
              },
              {
                "id": 9,
                "type": "assign",
                "from": {
                  "location": "incoming",
                  "name": "thisArg",
                  "ptr": "/0_arr"
                },
                "to": {
                  "location": "method",
                  "name": 3,
                  "ptr": "/args/0/value"
                }
              },
              {
                "id": 10,
                "type": "assign",
                "from": {
                  "location": "method",
                  "name": 1,
                  "ptr": "/return"
                },
                "to": {
                  "location": "method",
                  "name": 3,
                  "ptr": "/args/1/value"
                }
              },
              {
                "id": 11,
                "type": "assign",
                "from": {
                  "location": "method",
                  "name": 2,
                  "ptr": "/return"
                },
                "to": {
                  "location": "method",
                  "name": 3,
                  "ptr": "/args/2/value"
                }
              },
              {
                "id": 13,
                "type": "assign",
                "from": {
                  "location": "incoming",
                  "name": "accumulator",
                  "ptr": ""
                },
                "to": {
                  "location": "method",
                  "name": 4,
                  "ptr": "/args/0/value"
                }
              },
              {
                "id": 14,
                "type": "assign",
                "from": {
                  "location": "method",
                  "name": 4,
                  "ptr": "/return"
                },
                "to": {
                  "location": "outgoing",
                  "name": "accumulator",
                  "ptr": ""
                }
              },
              {
                "id": 15,
                "type": "assign",
                "from": {
                  "location": "method",
                  "name": 3,
                  "ptr": "/return"
                },
                "to": {
                  "location": "method",
                  "name": 4,
                  "ptr": "/args/1/value"
                }
              }
            ],
            "view": {
              "col": 3,
              "row": 4
            },
            "id": "ƒ_reduce_2",
            "comments": []
          }
        ],
        "comments": [],
        "view": {
          "col": 3,
          "row": 5
        },
        "created": "2021-11-09T20:02:51.965Z",
        "createdBy": {
          "_id": "6144f0469d8eacfa15f87756",
          "provenance": "local_aaa",
          "username": "admin@pronghorn"
        },
        "lastUpdated": "2021-11-10T17:07:56.400Z",
        "lastUpdatedBy": {
          "_id": "6144f0469d8eacfa15f87756",
          "provenance": "local_aaa",
          "username": "admin@pronghorn"
        },
        "version": "3.17.7-2021.1.7",
        "tags": []
      }
    }
  ],
  "readme": "<!-- This is a comment in md (Markdown) format, it will not be visible to the end user -->\n## _Deprecation Notice_\nThis Pre-Built has been deprecated as of 01-15-2024 and will be end of life on 01-15-2025. The capabilities of this Pre-Built have been replaced by the [IAP - Data Manipulation](https://gitlab.com/itentialopensource/pre-built-automations/iap-data-manipulation)\n\n<!-- Update the below line with your Pre-Built name -->\n# Chunk Array\n\n<!-- Leave TOC intact unless you've added or removed headers -->\n## Table of Contents\n\n* [Overview](#overview)\n* [Installation Prerequisites](#installation-prerequisites)\n* [How to Install](#how-to-install)\n* [How to Run](#how-to-run)\n* [Additional Information](#additional-information)\n\n## Overview\n\n<!-- Write a few sentences about the Pre-Built and explain the use case(s) -->\n<!-- Avoid using the word Artifact. Please use Pre-Built, Pre-Built Transformation or Pre-Built Automation -->\n<!-- Ex.: The Migration Wizard enables IAP users to conveniently move their automation use cases between different IAP environments -->\n<!-- (e.g. from Dev to Pre-Production or from Lab to Production). -->\nThis Pre-built transformation allows user to pass in an array and a desired chunk size and output an array of arrays in the size specified. This may be useful when users need a smaller sized groups of data.\n<!-- Workflow(s) Image Placeholder - TO BE ADDED DIRECTLY TO GitLab -->\n<!-- REPLACE COMMENT BELOW WITH IMAGE OF YOUR MAIN WORKFLOW -->\n\n<!-- REPLACE COMMENT ABOVE WITH IMAGE OF YOUR MAIN WORKFLOW -->\n\n<!-- ADD ESTIMATED RUN TIME HERE -->\n<!-- e.g. Estimated Run Time: 34 min. -->\n\n\n## Installation Prerequisites\n\nUsers must satisfy the following pre-requisites:\n\n<!-- Include any other required apps or adapters in this list -->\n<!-- Ex.: EC2 Adapter -->\n* Itential Automation Platform\n  * `^2022.1`\n\n\n## How to Install\n\nTo install the Pre-Built:\n\n* Verify you are running a supported version of the Itential Automation Platform (IAP) as listed above in the [Requirements](#requirements) section in order to install the Pre-Built. \n* The Pre-Built can be installed from within App-Admin_Essential. Simply search for the name of your desired Pre-Built and click the install button.\n\n<!-- OPTIONAL - Explain if external components are required outside of IAP -->\n<!-- Ex.: The Ansible roles required for this Pre-Built can be found in the repository located at https://gitlab.com/itentialopensource/pre-built-automations/hello-world -->\n\n## How to Run\n\nUse the following to run the Pre-Built:\n\n<!-- Explain the main entrypoint(s) for this Pre-Built: Automation Catalog item, Workflow, Postman, etc. -->\n1. Add a JST task in a workflow and select the chunkArray transformation\n2. Input the required incoming variables, arr (array) and chunkSize (number)\n3. Run the workflow\n\n\n## Additional Information\n\nPlease use your Itential Customer Success account if you need support when using this Pre-Built.\n"
}