{
  "_id": "61ccfa6eb6a8f201aee6f92b",
  "name": "AWS VPC Creation",
  "description": "This operations manager item will allow users to request creation of a custom VPC in AWS cloud.",
  "componentName": "Create Custom VPC",
  "componentType": "workflows",
  "gbac": {
    "write": [],
    "read": []
  },
  "created": "2021-12-30T00:16:46.862Z",
  "createdBy": "kay.wolfe@itential.com",
  "lastUpdated": "2021-12-30T00:16:46.862Z",
  "lastUpdatedBy": "kay.wolfe@itential.com",
  "triggers": [
    {
      "_id": "61ccfa6fb6a8f201aee6f92c",
      "created": "2021-12-30T00:16:47.242Z",
      "createdBy": "kay.wolfe@itential.com",
      "lastUpdated": "2021-12-30T00:16:47.242Z",
      "lastUpdatedBy": "kay.wolfe@itential.com",
      "name": "Manual Trigger (migrated from AWS VPC Creation)",
      "type": "manual",
      "enabled": true,
      "actionType": "automations",
      "actionId": "61ccfa6eb6a8f201aee6f92b",
      "formId": "VPC Form",
      "formData": {
        "zeroTouch": true,
        "region": "awsec2",
        "customerName": "U.S.A",
        "range": "10.0.0.0",
        "size": "28"
      },
      "migrationVersion": 1
    }
  ]
}
