{
  "name": "VPC Create Route Table",
  "tasks": {
    "workflow_start": {
      "name": "workflow_start",
      "groups": [],
      "x": 0.015482695810564663,
      "y": 0.49429037520391517
    },
    "workflow_end": {
      "name": "workflow_end",
      "groups": [],
      "x": 0.4808743169398907,
      "y": 0.49429037520391517
    },
    "d13b": {
      "name": "forEach",
      "canvasName": "forEach",
      "summary": "Iterate Subnets",
      "description": "Iterate over each item in an array",
      "location": "Application",
      "locationType": null,
      "app": "WorkFlowEngine",
      "displayName": "WorkFlowEngine",
      "type": "operation",
      "variables": {
        "incoming": {
          "data_array": "$var.job.subnets"
        },
        "outgoing": {
          "current_item": null
        },
        "error": ""
      },
      "deprecated": false,
      "matched": [
        {
          "key": "canvasName",
          "highlightString": "<span class='highlight-string'>forEa</span>ch"
        }
      ],
      "groups": [],
      "x": 0.36247723132969034,
      "y": 0.499184339314845,
      "scheduled": false
    },
    "23e9": {
      "name": "createRouteTable",
      "canvasName": "createRouteTable",
      "summary": "Create Route Table",
      "description": "Creates a route table for the specified VPC. After you create a route table, you can add routes and associate the table with a subnet.   For more information, see  Route Tables  in the  Amazon Virtual Private Cloud User Guide .",
      "location": "Adapter",
      "locationType": "Awsec2",
      "app": "Awsec2",
      "displayName": "Awsec2",
      "type": "automatic",
      "variables": {
        "incoming": {
          "dryRun": "",
          "vpcId": "$var.job.vpcId",
          "adapter_id": "$var.job.region"
        },
        "outgoing": {
          "result": null
        },
        "error": ""
      },
      "deprecated": false,
      "matched": [
        {
          "key": "canvasName",
          "highlightString": "<span class='highlight-string'>createRoute</span>Table"
        }
      ],
      "groups": [],
      "actor": "Pronghorn",
      "x": 0.13752276867030966,
      "y": 0.499184339314845,
      "scheduled": false
    },
    "1d94": {
      "name": "associateRouteTable",
      "canvasName": "associateRouteTable",
      "summary": "Associate Subnet",
      "description": "Associates a subnet with a route table. The subnet and route table must be in the same VPC. This association causes traffic originating from the subnet to be routed according to the routes in the route table. The action returns an association ID, which you need in order to disassociate the route table from the subnet later. A route table can be associated with multiple subnets.   For more information, see  Route Tables  in the  Amazon Virtual Private Cloud User Guide .",
      "location": "Adapter",
      "locationType": "Awsec2",
      "app": "Awsec2",
      "displayName": "Awsec2",
      "type": "automatic",
      "variables": {
        "incoming": {
          "dryRun": "",
          "routeTableId": "$var.4f41.return_data",
          "subnetId": "$var.d13b.current_item",
          "adapter_id": "$var.job.region"
        },
        "outgoing": {
          "result": null
        },
        "error": "$var.job.error"
      },
      "deprecated": false,
      "matched": [
        {
          "key": "canvasName",
          "highlightString": "<span class='highlight-string'>associateRoute</span>Table"
        }
      ],
      "groups": [],
      "actor": "Pronghorn",
      "x": 0.3633879781420765,
      "y": 0.768352365415987,
      "scheduled": false
    },
    "4f41": {
      "name": "query",
      "canvasName": "query",
      "summary": "Query Route Table ID",
      "description": "Query data using a dot/bracket notation string and a matching key/value pair.",
      "location": "Application",
      "locationType": null,
      "app": "WorkFlowEngine",
      "displayName": "WorkFlowEngine",
      "type": "operation",
      "variables": {
        "incoming": {
          "pass_on_null": false,
          "query": "response.CreateRouteTableResponse.routeTable.routeTableId",
          "obj": "$var.23e9.result"
        },
        "outgoing": {
          "return_data": "$var.job.result"
        },
        "error": ""
      },
      "deprecated": false,
      "matched": [
        {
          "key": "canvasName",
          "highlightString": "<span class='highlight-string'>query</span>"
        },
        {
          "key": "summary",
          "highlightString": "<span class='highlight-string'>Query</span> Data Using 'json-query' Format"
        },
        {
          "key": "description",
          "highlightString": "<span class='highlight-string'>Query</span> data using a dot/bracket notation string and a matching key/value pair."
        }
      ],
      "groups": [],
      "x": 0.25318761384335153,
      "y": 0.4926590538336052,
      "scheduled": false
    },
    "5eba": {
      "name": "ViewData",
      "canvasName": "ViewData",
      "summary": "View Data",
      "description": "View data in a pretty format",
      "location": "Application",
      "app": "WorkFlowEngine",
      "displayName": "Tools",
      "type": "manual",
      "variables": {
        "incoming": {
          "header": "ERROR",
          "message": "",
          "body": "$var.job.error",
          "btn_success": "Retry",
          "btn_failure": "Ignore"
        },
        "outgoing": {},
        "error": ""
      },
      "view": "/workflow_engine/task/ViewData",
      "deprecated": false,
      "matched": [
        {
          "key": "canvasName",
          "highlightString": "<span class='highlight-string'>ViewData</span>"
        }
      ],
      "groups": [],
      "x": 0.3633879781420765,
      "y": 0.9902120717781403,
      "scheduled": false
    }
  },
  "transitions": {
    "workflow_start": {
      "23e9": {
        "type": "standard",
        "state": "success"
      }
    },
    "workflow_end": {},
    "d13b": {
      "workflow_end": {
        "type": "standard",
        "state": "success"
      },
      "1d94": {
        "type": "standard",
        "state": "loop"
      }
    },
    "23e9": {
      "4f41": {
        "type": "standard",
        "state": "success"
      }
    },
    "1d94": {
      "5eba": {
        "type": "standard",
        "state": "error"
      }
    },
    "4f41": {
      "d13b": {
        "type": "standard",
        "state": "success"
      }
    },
    "5eba": {
      "1d94": {
        "type": "revert",
        "state": "success"
      }
    }
  },
  "font_size": 12,
  "created": "2020-03-18T15:19:27.309Z",
  "created_by": {
    "provenance": "Local AAA",
    "username": "admin@pronghorn",
    "firstname": "admin",
    "inactive": false,
    "email": ""
  },
  "createdVersion": "5.5.9-2019.3.0.0",
  "groups": [],
  "last_updated": "2020-12-11T01:28:14.461Z",
  "last_updated_by": {
    "provenance": "Local AAA",
    "username": "admin@pronghorn",
    "firstname": "admin",
    "inactive": false,
    "email": ""
  },
  "lastUpdatedVersion": "5.10.4-2020.1.32.0",
  "type": "automation",
  "description": null,
  "tags": []
}
