{
  "_id": "60226277f4736704026287fc",
  "name": "createAWSec2Instance",
  "description": "",
  "incoming": [
    {
      "$id": "formData",
      "type": "object",
      "properties": {
        "region": {
          "type": "string",
          "examples": [
            "aws-us-east-1"
          ]
        },
        "ami": {
          "type": "string",
          "examples": [
            "ami-060f953cf8865cf25"
          ]
        },
        "instanceType": {
          "type": "string",
          "examples": [
            "c3%2Exlarge"
          ]
        },
        "vpcId": {
          "type": "string",
          "examples": [
            "12312312"
          ]
        },
        "securityGroupId": {
          "type": "string",
          "examples": [
            "23424324"
          ]
        },
        "subnetId": {
          "type": "string",
          "examples": [
            "342424"
          ]
        },
        "keyName": {
          "type": "string",
          "examples": [
            "itential_keys"
          ]
        }
      },
      "required": []
    }
  ],
  "outgoing": [
    {
      "$id": "region",
      "type": "string",
      "examples": [
        "aws-us-east-1"
      ]
    },
    {
      "$id": "ami",
      "type": "string",
      "examples": [
        "ami-060f953cf8865cf25"
      ]
    },
    {
      "$id": "instanceType",
      "type": "string",
      "examples": [
        "c3%2Exlarge"
      ]
    },
    {
      "$id": "tags",
      "type": "array"
    },
    {
      "$id": "networkInterface",
      "type": "array"
    },
    {
      "$id": "keyName",
      "type": "string",
      "examples": [
        "itential_keys"
      ]
    },
    {
      "$id": "securityGroupId",
      "type": "string",
      "examples": [
        "23424324"
      ]
    },
    {
      "$id": "subnetId",
      "type": "string",
      "examples": [
        "342424"
      ]
    },
    {
      "$id": "vpcId",
      "type": "string",
      "examples": [
        "12312312"
      ]
    }
  ],
  "steps": [
    {
      "id": 1,
      "type": "template",
      "library": "String",
      "method": "templateLiteral",
      "template": "[{\"Key\":\"Name\",\"Value\":\"${vpcId}\"},{\"Key\":\"Maintainer\",\"Value\":\"Sales\"},{\"Key\":\"Environment\",\"Value\":\"Demo\"},{\"Key\":\"Owner\",\"Value\":\"Sales\"}]",
      "args": [
        null
      ],
      "view": {
        "row": 1,
        "col": 1
      }
    },
    {
      "id": 2,
      "type": "method",
      "library": "JSON",
      "method": "parse",
      "args": [
        null,
        null
      ],
      "view": {
        "row": 1,
        "col": 2
      }
    },
    {
      "id": 3,
      "type": "assign",
      "from": {
        "location": "template",
        "name": 1,
        "ptr": "/return"
      },
      "to": {
        "location": "method",
        "name": 2,
        "ptr": "/args/0/value"
      }
    },
    {
      "id": 4,
      "type": "assign",
      "from": {
        "location": "incoming",
        "name": "formData",
        "ptr": "/region"
      },
      "to": {
        "location": "outgoing",
        "name": "region",
        "ptr": ""
      }
    },
    {
      "id": 5,
      "type": "assign",
      "from": {
        "location": "incoming",
        "name": "formData",
        "ptr": "/ami"
      },
      "to": {
        "location": "outgoing",
        "name": "ami",
        "ptr": ""
      }
    },
    {
      "id": 6,
      "type": "assign",
      "from": {
        "location": "incoming",
        "name": "formData",
        "ptr": "/instanceType"
      },
      "to": {
        "location": "outgoing",
        "name": "instanceType",
        "ptr": ""
      }
    },
    {
      "id": 8,
      "type": "template",
      "library": "String",
      "method": "templateLiteral",
      "template": "[\n        {\n            \"AssociatePublicIpAddress\": \"true\",\n            \"DeviceIndex\": 0,\n            \"SubnetId\": \"${SubnetId}\",\n            \"SecurityGroupId\": [\n            \"${securityGroupId}\"\n            ]\n        }\n    ]",
      "args": [
        null,
        null
      ],
      "view": {
        "row": 2,
        "col": 1
      }
    },
    {
      "id": 9,
      "type": "assign",
      "from": {
        "location": "incoming",
        "name": "formData",
        "ptr": "/securityGroupId"
      },
      "to": {
        "location": "template",
        "name": 8,
        "ptr": "/args/1/value"
      }
    },
    {
      "id": 10,
      "type": "assign",
      "from": {
        "location": "incoming",
        "name": "formData",
        "ptr": "/subnetId"
      },
      "to": {
        "location": "template",
        "name": 8,
        "ptr": "/args/0/value"
      }
    },
    {
      "id": 11,
      "type": "assign",
      "from": {
        "location": "incoming",
        "name": "formData",
        "ptr": "/vpcId"
      },
      "to": {
        "location": "template",
        "name": 1,
        "ptr": "/args/0/value"
      }
    },
    {
      "id": 12,
      "type": "method",
      "library": "JSON",
      "method": "parse",
      "args": [
        null,
        null
      ],
      "view": {
        "row": 2,
        "col": 2
      }
    },
    {
      "id": 13,
      "type": "assign",
      "from": {
        "location": "template",
        "name": 8,
        "ptr": "/return"
      },
      "to": {
        "location": "method",
        "name": 12,
        "ptr": "/args/0/value"
      }
    },
    {
      "id": 14,
      "type": "assign",
      "from": {
        "location": "method",
        "name": 2,
        "ptr": "/return"
      },
      "to": {
        "location": "outgoing",
        "name": "tags",
        "ptr": ""
      }
    },
    {
      "id": 15,
      "type": "assign",
      "from": {
        "location": "method",
        "name": 12,
        "ptr": "/return"
      },
      "to": {
        "location": "outgoing",
        "name": "networkInterface",
        "ptr": ""
      }
    },
    {
      "id": 16,
      "type": "assign",
      "from": {
        "location": "incoming",
        "name": "formData",
        "ptr": "/keyName"
      },
      "to": {
        "location": "outgoing",
        "name": "keyName",
        "ptr": ""
      }
    },
    {
      "id": 17,
      "type": "assign",
      "from": {
        "location": "incoming",
        "name": "formData",
        "ptr": "/securityGroupId"
      },
      "to": {
        "location": "outgoing",
        "name": "securityGroupId",
        "ptr": ""
      }
    },
    {
      "id": 18,
      "type": "assign",
      "from": {
        "location": "incoming",
        "name": "formData",
        "ptr": "/subnetId"
      },
      "to": {
        "location": "outgoing",
        "name": "subnetId",
        "ptr": ""
      }
    },
    {
      "id": 19,
      "type": "assign",
      "from": {
        "location": "incoming",
        "name": "formData",
        "ptr": "/vpcId"
      },
      "to": {
        "location": "outgoing",
        "name": "vpcId",
        "ptr": ""
      }
    }
  ],
  "functions": [],
  "view": {
    "col": 3,
    "row": 5
  },
  "created": "2021-02-24T23:18:50.332Z",
  "createdBy": {
    "_id": "5fd0f140d662ab4e4881f056",
    "provenance": "LDAP Server",
    "username": "abhansali"
  },
  "lastUpdated": "2021-02-24T23:18:50.332Z",
  "lastUpdatedBy": {
    "_id": "5fd0f140d662ab4e4881f056",
    "provenance": "LDAP Server",
    "username": "abhansali"
  }
}