{
  "_id": "603fe54a5374196896f12733",
  "name": "TransitToAviatrixCloudN",
  "description": "",
  "incoming": [
    {
      "$id": "formData",
      "type": "object",
      "properties": {
        "vpcId": {
          "type": "string"
        },
        "connectionName": {
          "type": "string"
        },
        "transitGw": {
          "type": "string"
        },
        "bgpLocalAsNumber": {
          "type": "integer",
          "examples": [
            2
          ]
        },
        "cloudnAsNumber": {
          "type": "integer",
          "examples": [
            3
          ]
        },
        "cloudnIp": {
          "type": "string"
        },
        "cloudnNeighborIp": {
          "type": "string"
        },
        "cloudnNeighborAsNumber": {
          "type": "integer",
          "examples": [
            4
          ]
        },
        "enableHa": {
          "type": "string"
        },
        "insaneMode": {
          "type": "string"
        },
        "directConnect": {
          "type": "string"
        }
      },
      "required": []
    }
  ],
  "outgoing": [
    {
      "$id": "vpcId",
      "type": "string"
    },
    {
      "$id": "connectionName",
      "type": "string"
    },
    {
      "$id": "transitGw",
      "type": "string"
    },
    {
      "$id": "bgpLocalAsNumber",
      "type": "integer",
      "examples": [
        2
      ]
    },
    {
      "$id": "cloudnAsNumber",
      "type": "integer",
      "examples": [
        3
      ]
    },
    {
      "$id": "cloudnIp",
      "type": "string"
    },
    {
      "$id": "cloudnNeighborIp",
      "type": "string"
    },
    {
      "$id": "cloudnNeighborAsNumber",
      "type": "integer",
      "examples": [
        4
      ]
    },
    {
      "$id": "enableHa",
      "type": "string"
    },
    {
      "$id": "insaneMode",
      "type": "string"
    },
    {
      "$id": "directConnect",
      "type": "string"
    }
  ],
  "steps": [
    {
      "id": 1,
      "type": "assign",
      "from": {
        "location": "incoming",
        "name": "formData",
        "ptr": "/vpcId"
      },
      "to": {
        "location": "outgoing",
        "name": "vpcId",
        "ptr": ""
      }
    },
    {
      "id": 2,
      "type": "assign",
      "from": {
        "location": "incoming",
        "name": "formData",
        "ptr": "/connectionName"
      },
      "to": {
        "location": "outgoing",
        "name": "connectionName",
        "ptr": ""
      }
    },
    {
      "id": 3,
      "type": "assign",
      "from": {
        "location": "incoming",
        "name": "formData",
        "ptr": "/transitGw"
      },
      "to": {
        "location": "outgoing",
        "name": "transitGw",
        "ptr": ""
      }
    },
    {
      "id": 4,
      "type": "assign",
      "from": {
        "location": "incoming",
        "name": "formData",
        "ptr": "/bgpLocalAsNumber"
      },
      "to": {
        "location": "outgoing",
        "name": "bgpLocalAsNumber",
        "ptr": ""
      }
    },
    {
      "id": 5,
      "type": "assign",
      "from": {
        "location": "incoming",
        "name": "formData",
        "ptr": "/cloudnAsNumber"
      },
      "to": {
        "location": "outgoing",
        "name": "cloudnAsNumber",
        "ptr": ""
      }
    },
    {
      "id": 6,
      "type": "assign",
      "from": {
        "location": "incoming",
        "name": "formData",
        "ptr": "/cloudnIp"
      },
      "to": {
        "location": "outgoing",
        "name": "cloudnIp",
        "ptr": ""
      }
    },
    {
      "id": 7,
      "type": "assign",
      "from": {
        "location": "incoming",
        "name": "formData",
        "ptr": "/cloudnNeighborIp"
      },
      "to": {
        "location": "outgoing",
        "name": "cloudnNeighborIp",
        "ptr": ""
      }
    },
    {
      "id": 8,
      "type": "assign",
      "from": {
        "location": "incoming",
        "name": "formData",
        "ptr": "/cloudnNeighborAsNumber"
      },
      "to": {
        "location": "outgoing",
        "name": "cloudnNeighborAsNumber",
        "ptr": ""
      }
    },
    {
      "id": 9,
      "type": "assign",
      "from": {
        "location": "incoming",
        "name": "formData",
        "ptr": "/enableHa"
      },
      "to": {
        "location": "outgoing",
        "name": "enableHa",
        "ptr": ""
      }
    },
    {
      "id": 10,
      "type": "assign",
      "from": {
        "location": "incoming",
        "name": "formData",
        "ptr": "/insaneMode"
      },
      "to": {
        "location": "outgoing",
        "name": "insaneMode",
        "ptr": ""
      }
    },
    {
      "id": 11,
      "type": "assign",
      "from": {
        "location": "incoming",
        "name": "formData",
        "ptr": "/directConnect"
      },
      "to": {
        "location": "outgoing",
        "name": "directConnect",
        "ptr": ""
      }
    }
  ],
  "functions": [],
  "comments": [],
  "view": {
    "col": 3,
    "row": 4
  },
  "created": "2021-03-03T19:36:42.105Z",
  "createdBy": {
    "_id": "5f36a559597206042cdfd14a",
    "provenance": "Itential AAA Local",
    "username": "admin@pronghorn"
  },
  "lastUpdated": "2021-03-03T19:36:42.105Z",
  "lastUpdatedBy": {
    "_id": "5f36a559597206042cdfd14a",
    "provenance": "Itential AAA Local",
    "username": "admin@pronghorn"
  },
  "version": "3.13.0"
}