{
  "metadata": {
    "name": "@itentialopensource/aviatrix-enable-transit-ha",
    "version": "0.0.11",
    "description": "Default artifact description",
    "license": "Apache-2.0",
    "repository": {
      "type": "gitlab",
      "hostname": "gitlab.com",
      "path": "itentialopensource/pre-built-automations"
    },
    "keywords": [
      "Itential",
      "IAP",
      "artifacts"
    ],
    "author": "Itential Artifacts",
    "IAPDependencies": {
      "@itential/app-workflow_engine": "",
      "@itentialopensource/adapter-aviatrix": ""
    },
    "gitlabId": 24849714
  },
  "manifest": {
    "bundleName": "Aviatrix Enable Transit HA",
    "fingerprint": "603ff26caa3d976c6434d4f5",
    "createdEpoch": "1614803564619",
    "artifacts": [
      {
        "id": "Aviatrix Enable Transit HA",
        "name": "Aviatrix Enable Transit HA",
        "type": "workflow",
        "location": "/bundles/workflows/Aviatrix Enable Transit HA.json",
        "properties": {
          "entryPoint": false
        }
      },
      {
        "id": "603fe5255374196896f12730",
        "name": "EnableTransitHA",
        "type": "transformation",
        "location": "/bundles/transformations/EnableTransitHA.json",
        "properties": {
          "entryPoint": false
        }
      }
    ]
  },
  "bundles": [
    {
      "type": "workflow",
      "data": {
        "name": "Aviatrix Enable Transit HA",
        "tasks": {
          "workflow_start": {
            "name": "workflow_start",
            "groups": [],
            "x": 0.207253886010363,
            "y": 0.476900149031297
          },
          "workflow_end": {
            "name": "workflow_end",
            "groups": [],
            "x": 0.72020725388601,
            "y": 0.466467958271237
          },
          "2e16": {
            "name": "RenderJsonSchema",
            "canvasName": "RenderJsonSchema",
            "summary": "Show Create Transit Gateway Form",
            "description": "Show Create Transit Gateway Form",
            "location": "Application",
            "app": "JsonForms",
            "displayName": "JsonForms",
            "type": "manual",
            "variables": {
              "incoming": {
                "jsonSchema": {
                  "title": "Enable Transit HA",
                  "description": "Enable transit HA",
                  "type": "object",
                  "properties": {
                    "gwName": {
                      "type": "string"
                    },
                    "publicSubnet": {
                      "type": "string"
                    },
                    "allocateNewEip": {
                      "type": "string"
                    },
                    "eip": {
                      "type": "string"
                    }
                  },
                  "required": []
                },
                "uiSchema": "",
                "bindingSchema": "",
                "validationSchema": "",
                "formData": {
                  "gwName": "IAP-LAB-2",
                  "publicSubnet": "10.100.10.80/28~~us-east-2b~~affiliate-ohio-Public-1-us-east-2b",
                  "allocateNewEip": "true"
                }
              },
              "outgoing": {
                "export": null
              },
              "error": ""
            },
            "view": "/json-forms/task/RenderJsonSchema",
            "deprecated": false,
            "matched": [
              {
                "key": "displayName",
                "highlightString": "<span class='highlight-string'>Json</span>Forms"
              },
              {
                "key": "canvasName",
                "highlightString": "Render<span class='highlight-string'>Json</span>Schema"
              },
              {
                "key": "summary",
                "highlightString": "Render <span class='highlight-string'>JSON</span> Schema"
              },
              {
                "key": "description",
                "highlightString": "Render <span class='highlight-string'>JSON</span> Schema"
              }
            ],
            "groups": [],
            "x": 0.368503937007874,
            "y": 0.478932584269663,
            "scheduled": false
          },
          "4e69": {
            "name": "transformation",
            "canvasName": "transformation",
            "summary": "JSON Transformation",
            "description": "Perform a JSON Transformation using the JST library.",
            "location": "Application",
            "locationType": null,
            "app": "WorkFlowEngine",
            "type": "operation",
            "displayName": "WorkFlowEngine",
            "variables": {
              "incoming": {
                "tr_id": "603fe5255374196896f12730",
                "variableMap": {
                  "formData": "$var.2e16.export"
                },
                "options": {
                  "extractOutput": false
                }
              },
              "outgoing": {
                "gwName": null,
                "publicSubnet": null,
                "allocateNewEip": null,
                "eip": null
              }
            },
            "deprecated": false,
            "matched": [
              {
                "key": "description",
                "highlightString": "Perform a JSON Transformation using the <span class='highlight-string'>JST</span> library."
              }
            ],
            "groups": [],
            "x": 0.512089810017271,
            "y": 0.473919523099851,
            "task_name": "EnableTransitHA"
          },
          "79dd": {
            "name": "enableTransitHA",
            "canvasName": "enableTransitHA",
            "summary": "Enable transit HA",
            "description": "Enable transit HA",
            "location": "Adapter",
            "locationType": "Aviatrix",
            "app": "Aviatrix",
            "type": "automatic",
            "displayName": "Aviatrix",
            "variables": {
              "incoming": {
                "gwName": "$var.4e69.gwName",
                "publicSubnet": "$var.4e69.publicSubnet",
                "allocateNewEip": "$var.4e69.allocateNewEip",
                "eip": "$var.4e69.eip",
                "adapter_id": "Aviatrix-East"
              },
              "outgoing": {
                "result": null
              },
              "error": ""
            },
            "deprecated": false,
            "matched": [
              {
                "key": "canvasName",
                "highlightString": "<span class='highlight-string'>enable</span><span class='highlight-string'>Transit</span><span class='highlight-string'>HA</span>"
              },
              {
                "key": "summary",
                "highlightString": "<span class='highlight-string'>Enable</span> <span class='highlight-string'>transit</span> <span class='highlight-string'>HA</span>"
              },
              {
                "key": "description",
                "highlightString": "<span class='highlight-string'>Enable</span> <span class='highlight-string'>transit</span> <span class='highlight-string'>HA</span>"
              }
            ],
            "groups": [],
            "actor": "Pronghorn",
            "x": 0.613989637305699,
            "y": 0.475409836065574,
            "scheduled": false
          }
        },
        "transitions": {
          "workflow_start": {
            "2e16": {
              "type": "standard",
              "state": "success"
            }
          },
          "workflow_end": {},
          "ad15": {},
          "2e16": {
            "4e69": {
              "type": "standard",
              "state": "success"
            }
          },
          "4e69": {
            "79dd": {
              "type": "standard",
              "state": "success"
            }
          },
          "79dd": {
            "workflow_end": {
              "type": "standard",
              "state": "success"
            }
          },
          "1c15": {}
        },
        "font_size": 12,
        "created": "2021-01-12T15:19:27.417Z",
        "created_by": {
          "provenance": "Local AAA",
          "username": "admin@pronghorn",
          "firstname": "admin",
          "inactive": true,
          "email": ""
        },
        "createdVersion": "5.10.4-2020.1.39.0",
        "groups": [],
        "last_updated": "2021-03-03T19:38:27.197Z",
        "last_updated_by": {
          "provenance": "Itential AAA Local",
          "username": "admin@pronghorn",
          "firstname": "admin",
          "inactive": false
        },
        "lastUpdatedVersion": "5.29.14-2020.2.7.0",
        "type": "automation",
        "description": null,
        "tags": [],
        "inputSchema": {
          "type": "object"
        },
        "outputSchema": {
          "type": "object",
          "properties": {
            "_id": {
              "type": "string",
              "pattern": "^[0-9a-f]{24}$"
            },
            "initiator": {
              "type": "string"
            }
          }
        }
      }
    },
    {
      "type": "transformation",
      "data": {
        "_id": "603fe5255374196896f12730",
        "name": "EnableTransitHA",
        "description": "",
        "incoming": [
          {
            "$id": "formData",
            "type": "object",
            "properties": {
              "gwName": {
                "type": "string"
              },
              "publicSubnet": {
                "type": "string"
              },
              "allocateNewEip": {
                "type": "string"
              },
              "eip": {
                "type": "string"
              }
            },
            "required": [
              "gwName",
              "publicSubnet",
              "allocateNewEip"
            ]
          }
        ],
        "outgoing": [
          {
            "$id": "gwName",
            "type": "string"
          },
          {
            "$id": "publicSubnet",
            "type": "string"
          },
          {
            "$id": "allocateNewEip",
            "type": "string"
          },
          {
            "$id": "eip",
            "type": "string"
          }
        ],
        "steps": [
          {
            "id": 1,
            "type": "assign",
            "from": {
              "location": "incoming",
              "name": "formData",
              "ptr": "/gwName"
            },
            "to": {
              "location": "outgoing",
              "name": "gwName",
              "ptr": ""
            }
          },
          {
            "id": 2,
            "type": "assign",
            "from": {
              "location": "incoming",
              "name": "formData",
              "ptr": "/publicSubnet"
            },
            "to": {
              "location": "outgoing",
              "name": "publicSubnet",
              "ptr": ""
            }
          },
          {
            "id": 3,
            "type": "assign",
            "from": {
              "location": "incoming",
              "name": "formData",
              "ptr": "/allocateNewEip"
            },
            "to": {
              "location": "outgoing",
              "name": "allocateNewEip",
              "ptr": ""
            }
          },
          {
            "id": 5,
            "type": "method",
            "library": "Object",
            "method": "getProperty",
            "args": [
              null,
              "eip"
            ],
            "view": {
              "row": 2,
              "col": 1
            }
          },
          {
            "id": 6,
            "type": "assign",
            "from": {
              "location": "incoming",
              "name": "formData",
              "ptr": ""
            },
            "to": {
              "location": "method",
              "name": 5,
              "ptr": "/args/0/value"
            }
          },
          {
            "id": 7,
            "type": "assign",
            "from": {
              "location": "method",
              "name": 5,
              "ptr": "/return"
            },
            "to": {
              "location": "outgoing",
              "name": "eip",
              "ptr": ""
            }
          }
        ],
        "functions": [],
        "comments": [],
        "view": {
          "col": 3,
          "row": 4
        },
        "created": "2021-03-03T19:36:05.849Z",
        "createdBy": {
          "_id": "5f36a559597206042cdfd14a",
          "provenance": "Itential AAA Local",
          "username": "admin@pronghorn"
        },
        "lastUpdated": "2021-03-03T19:36:05.849Z",
        "lastUpdatedBy": {
          "_id": "5f36a559597206042cdfd14a",
          "provenance": "Itential AAA Local",
          "username": "admin@pronghorn"
        },
        "version": "3.13.0"
      }
    }
  ],
  "readme": "<!-- This is a comment in md (Markdown) format, it will not be visible to the end user -->\n\n<!-- Update the below line with your Pre-Built name -->\n# Aviatrix Enable Transit HA\n\n<!-- Leave TOC intact unless you've added or removed headers -->\n## Table of Contents\n\n* [Overview](#overview)\n* [Requirements](#requirements)\n* [How to Install](#how-to-install)\n* [How to Run](#how-to-run)\n* [Deployment Workflows](#deployment-workflows)\n* [Additional Information](#additional-information)\n\n## Overview\n\nThe **Aviatrix Enable Transit HA** Pre-built is used to enable HA for the transit gateway.\nThe Pre-built consists of a transformation to prepare the formData for the `enableTransitHA` task on the workflow to perform the desired operation. \n\n<table><tr><td>\n  <img src=\"https://gitlab.com/itentialopensource/pre-built-automations/aviatrix-enable-transit-ha/-/raw/master/images/workflow.png\" alt=\"workflow\" width=\"800px\">\n</td></tr></table>\n<!-- Write a few sentences about the Pre-Built and explain the use case(s) -->\n<!-- Avoid using the word Artifact. Please use Pre-Built, Pre-Built Transformation or Pre-Built Automation -->\n<!-- Ex.: The Migration Wizard enables IAP users to conveniently move their automation use cases between different IAP environments -->\n<!-- (e.g. from Dev to Pre-Production or from Lab to Production). -->\n\n<!-- Workflow(s) Image Placeholder - TO BE ADDED DIRECTLY TO GitLab -->\n<!-- REPLACE COMMENT BELOW WITH IMAGE OF YOUR MAIN WORKFLOW -->\n<!--\n<table><tr><td>\n  <img src=\"https://gitlab.com/itentialopensource/pre-built-automations/aviatrix-enable-transit-ha/-/raw/master/images/workflow.png\" alt=\"workflow\" width=\"800px\">\n</td></tr></table>\n-->\n<!-- REPLACE COMMENT ABOVE WITH IMAGE OF YOUR MAIN WORKFLOW -->\n\n<!-- ADD ESTIMATED RUN TIME HERE -->\n<!-- e.g. Estimated Run Time: 34 min. -->\n_Estimated Run Time_: 30 seconds\n\n## Requirements\n\nThis Pre-Built requires the following:\n\n* Itential Automation Platform\n  * `^2021.2`\n* An Aviatrix controller.\n* A running instance of the Itential OpenSource Aviatrix adapter, which can be found [here](https://gitlab.com/itentialopensource/adapters/cloud/adapter-aviatrix).\n\n<!-- Unordered list highlighting the requirements of the Pre-Built -->\n<!-- EXAMPLE -->\n<!-- * cisco ios device -->\n<!-- * Ansible or NSO (with F5 NED) * -->\n\n## How to Install\n\nTo install the Pre-Built:\n\n* Verify you are running a supported version of the Itential Automation Platform (IAP) as listed above in the [Requirements](#requirements) section. \n* The Pre-Built can be installed from within **App-Admin_Essential**. Simply search for the name of your desired Pre-Built and click the **Install** button.\n\n<!-- REPLACE BELOW WITH IMAGE OF YOUR PUBLISHED PRE-BUILT -->\n<!--\n<table><tr><td>\n  <img src=\"https://gitlab.com/itentialopensource/pre-built-automations/aviatrix-enable-transit-ha/-/raw/master/images/install.png\" alt=\"install\" width=\"600px\">\n</td></tr></table>\n-->\n<!-- REPLACE ABOVE WITH IMAGE OF YOUR PUBLISHED PRE-BUILT -->\n\n<!-- OPTIONAL - Explain if external components are required outside of IAP -->\n<!-- Ex.: The Ansible roles required for this Pre-Built can be found in the repository located at https://gitlab.com/itentialopensource/pre-built-automations/hello-world -->\n\n## How to Run\n\nUse the following to run the Pre-Built:\n\n* Run the workflow directly from Automation Studio or as a child job, or with an additional json-form supplying the values needed by the workflow.\n* A description of the formData needed by the Pre-Built is provided in the [Aviatrix API](https://api.aviatrix.com/) documentation.\n* Use case information to enable HA for the transit gateway can be found [here](https://docs.aviatrix.com/HowTos/transitvpc_workflow.html#optionally-enable-ha-for-the-transit-gateway).\n\n<table><tr><td>\n  <img src=\"https://gitlab.com/itentialopensource/pre-built-automations/aviatrix-enable-transit-ha/-/raw/master/images/formData.png\" alt=\"formData\" width=\"500px\">\n</td></tr></table>\n\n<!-- Explain the main entrypoint(s) for this Pre-Built: Automation Catalog item, Workflow, Postman, etc. -->\n\n## Deployment Workflows\n\nThe parent workflow and all the associated workflows of **Aviatrix Transit Network** deployment are listed below.\n<table><tr><td>\n  <img src=\"https://gitlab.com/itentialopensource/pre-built-automations/aviatrix-enable-transit-ha/-/raw/master/images/parentWorkflow.png\" alt=\"parentWorkflow\" width=\"800px\">\n</td></tr></table>\n\n- [Aviatrix Transit Gateway Deployment](https://gitlab.com/itentialopensource/pre-built-automations/aviatrix-transit-gateway-deployment)\n- [Aviatrix Create MCNA Transit](https://gitlab.com/itentialopensource/pre-built-automations/aviatrix-create-mcna-transit)\n- [Aviatrix Connect Transit Gateway To VGW](https://gitlab.com/itentialopensource/pre-built-automations/aviatrix-connect-transit-gateway-to-vgw)\n- [Aviatrix Connect Transit Gateway To External Device](https://gitlab.com/itentialopensource/pre-built-automations/aviatrix-connect-transit-gateway-to-external-device)\n- [Aviatrix Connect Transit Gateway To Aviatrix CloudN](https://gitlab.com/itentialopensource/pre-built-automations/aviatrix-connect-transit-gateway-to-aviatrix-cloudn)\n- [Aviatrix Create Spoke Gateway](https://gitlab.com/itentialopensource/pre-built-automations/aviatrix-create-spoke-gateway)\n- [Aviatrix Enable Spoke HA](https://gitlab.com/itentialopensource/pre-built-automations/aviatrix-enable-spoke-ha)\n- [Aviatrix Attach Spoke To Transit Gateway](https://gitlab.com/itentialopensource/pre-built-automations/aviatrix-attach-spoke-to-transit-gateway)\n- [Aviatrix Attach ARM Native Spoke To Transit Gateway](https://gitlab.com/itentialopensource/pre-built-automations/aviatrix-attach-arm-native-spoke-to-transit-gateway)\n\n## Additional Information\n\nPlease use your Itential Customer Success account if you need support when using this Pre-Built.\n"
}