{
  "name": "Aviatrix Enable Transit HA",
  "tasks": {
    "workflow_start": {
      "name": "workflow_start",
      "groups": [],
      "x": 0.207253886010363,
      "y": 0.476900149031297
    },
    "workflow_end": {
      "name": "workflow_end",
      "groups": [],
      "x": 0.72020725388601,
      "y": 0.466467958271237
    },
    "2e16": {
      "name": "RenderJsonSchema",
      "canvasName": "RenderJsonSchema",
      "summary": "Show Create Transit Gateway Form",
      "description": "Show Create Transit Gateway Form",
      "location": "Application",
      "app": "JsonForms",
      "displayName": "JsonForms",
      "type": "manual",
      "variables": {
        "incoming": {
          "jsonSchema": {
            "title": "Enable Transit HA",
            "description": "Enable transit HA",
            "type": "object",
            "properties": {
              "gwName": {
                "type": "string"
              },
              "publicSubnet": {
                "type": "string"
              },
              "allocateNewEip": {
                "type": "string"
              },
              "eip": {
                "type": "string"
              }
            },
            "required": []
          },
          "uiSchema": "",
          "bindingSchema": "",
          "validationSchema": "",
          "formData": {
            "gwName": "IAP-LAB-2",
            "publicSubnet": "10.100.10.80/28~~us-east-2b~~affiliate-ohio-Public-1-us-east-2b",
            "allocateNewEip": "true"
          }
        },
        "outgoing": {
          "export": null
        },
        "error": ""
      },
      "view": "/json-forms/task/RenderJsonSchema",
      "deprecated": false,
      "matched": [
        {
          "key": "displayName",
          "highlightString": "<span class='highlight-string'>Json</span>Forms"
        },
        {
          "key": "canvasName",
          "highlightString": "Render<span class='highlight-string'>Json</span>Schema"
        },
        {
          "key": "summary",
          "highlightString": "Render <span class='highlight-string'>JSON</span> Schema"
        },
        {
          "key": "description",
          "highlightString": "Render <span class='highlight-string'>JSON</span> Schema"
        }
      ],
      "groups": [],
      "x": 0.368503937007874,
      "y": 0.478932584269663,
      "scheduled": false
    },
    "4e69": {
      "name": "transformation",
      "canvasName": "transformation",
      "summary": "JSON Transformation",
      "description": "Perform a JSON Transformation using the JST library.",
      "location": "Application",
      "locationType": null,
      "app": "WorkFlowEngine",
      "type": "operation",
      "displayName": "WorkFlowEngine",
      "variables": {
        "incoming": {
          "tr_id": "603fe5255374196896f12730",
          "variableMap": {
            "formData": "$var.2e16.export"
          },
          "options": {
            "extractOutput": false
          }
        },
        "outgoing": {
          "gwName": null,
          "publicSubnet": null,
          "allocateNewEip": null,
          "eip": null
        }
      },
      "deprecated": false,
      "matched": [
        {
          "key": "description",
          "highlightString": "Perform a JSON Transformation using the <span class='highlight-string'>JST</span> library."
        }
      ],
      "groups": [],
      "x": 0.512089810017271,
      "y": 0.473919523099851,
      "task_name": "EnableTransitHA"
    },
    "79dd": {
      "name": "enableTransitHA",
      "canvasName": "enableTransitHA",
      "summary": "Enable transit HA",
      "description": "Enable transit HA",
      "location": "Adapter",
      "locationType": "Aviatrix",
      "app": "Aviatrix",
      "type": "automatic",
      "displayName": "Aviatrix",
      "variables": {
        "incoming": {
          "gwName": "$var.4e69.gwName",
          "publicSubnet": "$var.4e69.publicSubnet",
          "allocateNewEip": "$var.4e69.allocateNewEip",
          "eip": "$var.4e69.eip",
          "adapter_id": "Aviatrix-East"
        },
        "outgoing": {
          "result": null
        },
        "error": ""
      },
      "deprecated": false,
      "matched": [
        {
          "key": "canvasName",
          "highlightString": "<span class='highlight-string'>enable</span><span class='highlight-string'>Transit</span><span class='highlight-string'>HA</span>"
        },
        {
          "key": "summary",
          "highlightString": "<span class='highlight-string'>Enable</span> <span class='highlight-string'>transit</span> <span class='highlight-string'>HA</span>"
        },
        {
          "key": "description",
          "highlightString": "<span class='highlight-string'>Enable</span> <span class='highlight-string'>transit</span> <span class='highlight-string'>HA</span>"
        }
      ],
      "groups": [],
      "actor": "Pronghorn",
      "x": 0.613989637305699,
      "y": 0.475409836065574,
      "scheduled": false
    }
  },
  "transitions": {
    "workflow_start": {
      "2e16": {
        "type": "standard",
        "state": "success"
      }
    },
    "workflow_end": {},
    "ad15": {},
    "2e16": {
      "4e69": {
        "type": "standard",
        "state": "success"
      }
    },
    "4e69": {
      "79dd": {
        "type": "standard",
        "state": "success"
      }
    },
    "79dd": {
      "workflow_end": {
        "type": "standard",
        "state": "success"
      }
    },
    "1c15": {}
  },
  "font_size": 12,
  "created": "2021-01-12T15:19:27.417Z",
  "created_by": {
    "provenance": "Local AAA",
    "username": "admin@pronghorn",
    "firstname": "admin",
    "inactive": true,
    "email": ""
  },
  "createdVersion": "5.10.4-2020.1.39.0",
  "groups": [],
  "last_updated": "2021-03-03T19:38:27.197Z",
  "last_updated_by": {
    "provenance": "Itential AAA Local",
    "username": "admin@pronghorn",
    "firstname": "admin",
    "inactive": false
  },
  "lastUpdatedVersion": "5.29.14-2020.2.7.0",
  "type": "automation",
  "description": null,
  "tags": [],
  "inputSchema": {
    "type": "object"
  },
  "outputSchema": {
    "type": "object",
    "properties": {
      "_id": {
        "type": "string",
        "pattern": "^[0-9a-f]{24}$"
      },
      "initiator": {
        "type": "string"
      }
    }
  }
}