{
  "_id": "603fe5255374196896f12730",
  "name": "EnableTransitHA",
  "description": "",
  "incoming": [
    {
      "$id": "formData",
      "type": "object",
      "properties": {
        "gwName": {
          "type": "string"
        },
        "publicSubnet": {
          "type": "string"
        },
        "allocateNewEip": {
          "type": "string"
        },
        "eip": {
          "type": "string"
        }
      },
      "required": [
        "gwName",
        "publicSubnet",
        "allocateNewEip"
      ]
    }
  ],
  "outgoing": [
    {
      "$id": "gwName",
      "type": "string"
    },
    {
      "$id": "publicSubnet",
      "type": "string"
    },
    {
      "$id": "allocateNewEip",
      "type": "string"
    },
    {
      "$id": "eip",
      "type": "string"
    }
  ],
  "steps": [
    {
      "id": 1,
      "type": "assign",
      "from": {
        "location": "incoming",
        "name": "formData",
        "ptr": "/gwName"
      },
      "to": {
        "location": "outgoing",
        "name": "gwName",
        "ptr": ""
      }
    },
    {
      "id": 2,
      "type": "assign",
      "from": {
        "location": "incoming",
        "name": "formData",
        "ptr": "/publicSubnet"
      },
      "to": {
        "location": "outgoing",
        "name": "publicSubnet",
        "ptr": ""
      }
    },
    {
      "id": 3,
      "type": "assign",
      "from": {
        "location": "incoming",
        "name": "formData",
        "ptr": "/allocateNewEip"
      },
      "to": {
        "location": "outgoing",
        "name": "allocateNewEip",
        "ptr": ""
      }
    },
    {
      "id": 5,
      "type": "method",
      "library": "Object",
      "method": "getProperty",
      "args": [
        null,
        "eip"
      ],
      "view": {
        "row": 2,
        "col": 1
      }
    },
    {
      "id": 6,
      "type": "assign",
      "from": {
        "location": "incoming",
        "name": "formData",
        "ptr": ""
      },
      "to": {
        "location": "method",
        "name": 5,
        "ptr": "/args/0/value"
      }
    },
    {
      "id": 7,
      "type": "assign",
      "from": {
        "location": "method",
        "name": 5,
        "ptr": "/return"
      },
      "to": {
        "location": "outgoing",
        "name": "eip",
        "ptr": ""
      }
    }
  ],
  "functions": [],
  "comments": [],
  "view": {
    "col": 3,
    "row": 4
  },
  "created": "2021-03-03T19:36:05.849Z",
  "createdBy": {
    "_id": "5f36a559597206042cdfd14a",
    "provenance": "Itential AAA Local",
    "username": "admin@pronghorn"
  },
  "lastUpdated": "2021-03-03T19:36:05.849Z",
  "lastUpdatedBy": {
    "_id": "5f36a559597206042cdfd14a",
    "provenance": "Itential AAA Local",
    "username": "admin@pronghorn"
  },
  "version": "3.13.0"
}