{
  "_id": "603fec4f5374196896f12738",
  "name": "TransitToVGW",
  "description": "",
  "incoming": [
    {
      "$id": "formData",
      "type": "object",
      "properties": {
        "connectionName": {
          "type": "string"
        },
        "bgpVgwAccountName": {
          "type": "string"
        },
        "bgpVgwRegion": {
          "type": "string"
        },
        "vgwId": {
          "type": "string"
        },
        "transitGw": {
          "type": "string"
        },
        "vpcId": {
          "type": "string"
        },
        "bgpLocalAsNumber": {
          "type": "integer",
          "examples": [
            1
          ]
        },
        "connectionPolicy": {
          "type": "boolean",
          "examples": [
            true,
            false
          ]
        }
      },
      "required": []
    }
  ],
  "outgoing": [
    {
      "$id": "connectionName",
      "type": "string"
    },
    {
      "$id": "bgpVgwAccountName",
      "type": "string"
    },
    {
      "$id": "bgpVgwRegion",
      "type": "string"
    },
    {
      "$id": "vgwId",
      "type": "string"
    },
    {
      "$id": "transitGw",
      "type": "string"
    },
    {
      "$id": "vpcId",
      "type": "string"
    },
    {
      "$id": "bgpLocalAsNumber",
      "type": "integer",
      "examples": [
        1
      ]
    },
    {
      "$id": "connectionPolicy",
      "type": "boolean",
      "examples": [
        true,
        false
      ]
    }
  ],
  "steps": [
    {
      "id": 1,
      "type": "assign",
      "from": {
        "location": "incoming",
        "name": "formData",
        "ptr": "/connectionName"
      },
      "to": {
        "location": "outgoing",
        "name": "connectionName",
        "ptr": ""
      }
    },
    {
      "id": 2,
      "type": "assign",
      "from": {
        "location": "incoming",
        "name": "formData",
        "ptr": "/bgpVgwAccountName"
      },
      "to": {
        "location": "outgoing",
        "name": "bgpVgwAccountName",
        "ptr": ""
      }
    },
    {
      "id": 3,
      "type": "assign",
      "from": {
        "location": "incoming",
        "name": "formData",
        "ptr": "/bgpVgwRegion"
      },
      "to": {
        "location": "outgoing",
        "name": "bgpVgwRegion",
        "ptr": ""
      }
    },
    {
      "id": 4,
      "type": "assign",
      "from": {
        "location": "incoming",
        "name": "formData",
        "ptr": "/vgwId"
      },
      "to": {
        "location": "outgoing",
        "name": "vgwId",
        "ptr": ""
      }
    },
    {
      "id": 5,
      "type": "assign",
      "from": {
        "location": "incoming",
        "name": "formData",
        "ptr": "/transitGw"
      },
      "to": {
        "location": "outgoing",
        "name": "transitGw",
        "ptr": ""
      }
    },
    {
      "id": 6,
      "type": "assign",
      "from": {
        "location": "incoming",
        "name": "formData",
        "ptr": "/vpcId"
      },
      "to": {
        "location": "outgoing",
        "name": "vpcId",
        "ptr": ""
      }
    },
    {
      "id": 7,
      "type": "assign",
      "from": {
        "location": "incoming",
        "name": "formData",
        "ptr": "/bgpLocalAsNumber"
      },
      "to": {
        "location": "outgoing",
        "name": "bgpLocalAsNumber",
        "ptr": ""
      }
    },
    {
      "id": 8,
      "type": "assign",
      "from": {
        "location": "incoming",
        "name": "formData",
        "ptr": "/connectionPolicy"
      },
      "to": {
        "location": "outgoing",
        "name": "connectionPolicy",
        "ptr": ""
      }
    }
  ],
  "functions": [],
  "comments": [],
  "view": {
    "col": 3,
    "row": 4
  },
  "created": "2021-03-03T20:06:39.990Z",
  "createdBy": {
    "_id": "5f36a559597206042cdfd14a",
    "provenance": "Itential AAA Local",
    "username": "admin@pronghorn"
  },
  "lastUpdated": "2021-03-03T20:06:39.990Z",
  "lastUpdatedBy": {
    "_id": "5f36a559597206042cdfd14a",
    "provenance": "Itential AAA Local",
    "username": "admin@pronghorn"
  },
  "version": "3.13.0"
}