{
  "name": "IAP Artifacts AW Discover Components",
  "tasks": {
    "834": {
      "name": "componentDiscovery",
      "canvasName": "componentDiscovery",
      "summary": "Performs discovery on Automation Catalogs or Workflows",
      "description": "Discovers any referenced components within automation catalogs",
      "location": "Application",
      "locationType": null,
      "app": "AppArtifacts",
      "displayName": "AppArtifacts",
      "type": "automatic",
      "variables": {
        "incoming": {
          "entryPoint": "$var.5e6b.merged_object"
        },
        "outgoing": {
          "discovery": "$var.job.discovery"
        },
        "error": "$var.job.discoveryError",
        "decorators": []
      },
      "deprecated": false,
      "matched": [
        {
          "key": "canvasName",
          "highlightString": "component<span class='highlight-string'>Disc</span>overy"
        },
        {
          "key": "summary",
          "highlightString": "Performs <span class='highlight-string'>disc</span>overy on Automation Catalogs or Workflows"
        },
        {
          "key": "description",
          "highlightString": "<span class='highlight-string'>Disc</span>overs any referenced components within automation catalogs"
        }
      ],
      "groups": [],
      "actor": "Pronghorn",
      "x": 0.1418744625967326,
      "y": 0.49480968858131485,
      "scheduled": false
    },
    "2749": {
      "name": "query",
      "canvasName": "query",
      "summary": "Query forms from form",
      "description": "Query data using a dot/bracket notation string and a matching key/value pair.",
      "location": "Application",
      "locationType": null,
      "app": "WorkFlowEngine",
      "displayName": "WorkFlowEngine",
      "type": "operation",
      "variables": {
        "incoming": {
          "pass_on_null": false,
          "query": "forms",
          "obj": "$var.6f9c.return_data"
        },
        "outgoing": {
          "return_data": null
        },
        "error": ""
      },
      "deprecated": false,
      "matched": [
        {
          "key": "canvasName",
          "highlightString": "<span class='highlight-string'>query</span>"
        },
        {
          "key": "summary",
          "highlightString": "<span class='highlight-string'>Query</span> Data Using 'json-query' Format"
        },
        {
          "key": "description",
          "highlightString": "<span class='highlight-string'>Query</span> data using a dot/bracket notation string and a matching key/value pair."
        }
      ],
      "groups": [],
      "x": 1.6262626262626263,
      "y": 0.6015503875968993,
      "scheduled": false
    },
    "5875": {
      "name": "modify",
      "canvasName": "modify",
      "summary": "Modify catalogAutomations",
      "description": "Modify data",
      "location": "Application",
      "locationType": null,
      "app": "WorkFlowEngine",
      "displayName": "WorkFlowEngine",
      "type": "operation",
      "variables": {
        "incoming": {
          "object_to_update": "$var.job.components",
          "query": "catalogAutomations",
          "new_value": "$var.624e.return_data"
        },
        "outgoing": {
          "updated_object": "$var.job.components"
        },
        "error": "",
        "decorators": []
      },
      "deprecated": false,
      "matched": [
        {
          "key": "canvasName",
          "highlightString": "<span class='highlight-string'>modify</span>"
        },
        {
          "key": "summary",
          "highlightString": "<span class='highlight-string'>Modify</span> Data"
        },
        {
          "key": "description",
          "highlightString": "<span class='highlight-string'>Modify</span> data"
        }
      ],
      "groups": [],
      "x": 0.9709595959595959,
      "y": 0.5674418604651162,
      "scheduled": false
    },
    "7144": {
      "name": "merge",
      "canvasName": "merge",
      "summary": "Merge Discovery Data",
      "description": "Merge data into a single object",
      "location": "Application",
      "locationType": null,
      "app": "WorkFlowEngine",
      "displayName": "WorkFlowEngine",
      "type": "operation",
      "variables": {
        "incoming": {
          "data_to_merge": [
            {
              "key": "components",
              "value": {
                "task": "job",
                "variable": "components"
              }
            }
          ]
        },
        "outgoing": {
          "merged_object": null
        }
      },
      "deprecated": false,
      "matched": [
        {
          "key": "canvasName",
          "highlightString": "<span class='highlight-string'>merge</span>"
        },
        {
          "key": "summary",
          "highlightString": "<span class='highlight-string'>Merge</span> Data"
        },
        {
          "key": "description",
          "highlightString": "<span class='highlight-string'>Merge</span> data into a single object"
        }
      ],
      "groups": [],
      "x": 1.0126262626262625,
      "y": 2.4604651162790696
    },
    "workflow_start": {
      "name": "workflow_start",
      "groups": [],
      "x": -0.3343725643024162,
      "y": 0.48575305291723203
    },
    "workflow_end": {
      "name": "workflow_end",
      "groups": [],
      "x": 1.9492691315563198,
      "y": 0.21337946943483277
    },
    "2d7f": {
      "name": "query",
      "canvasName": "query",
      "summary": "Get Array Automation Catalogs",
      "description": "Query data using a dot/bracket notation string and a matching key/value pair.",
      "location": "Application",
      "locationType": null,
      "app": "WorkFlowEngine",
      "displayName": "WorkFlowEngine",
      "type": "operation",
      "variables": {
        "incoming": {
          "pass_on_null": false,
          "query": "automationCatalogs.name",
          "obj": "$var.job.artifact"
        },
        "outgoing": {
          "return_data": null
        },
        "error": ""
      },
      "deprecated": false,
      "matched": [
        {
          "key": "canvasName",
          "highlightString": "<span class='highlight-string'>query</span>"
        },
        {
          "key": "summary",
          "highlightString": "<span class='highlight-string'>Query</span> Data Using 'json-query' Format"
        },
        {
          "key": "description",
          "highlightString": "<span class='highlight-string'>Query</span> data using a dot/bracket notation string and a matching key/value pair."
        }
      ],
      "groups": [],
      "x": -0.23070927513639908,
      "y": 0.3921302578018996,
      "scheduled": false
    },
    "51d6": {
      "name": "query",
      "canvasName": "query",
      "summary": "Get Array Automation Workflows.",
      "description": "Query data using a dot/bracket notation string and a matching key/value pair.",
      "location": "Application",
      "locationType": null,
      "app": "WorkFlowEngine",
      "displayName": "WorkFlowEngine",
      "type": "operation",
      "variables": {
        "incoming": {
          "pass_on_null": false,
          "query": "automationWorkflows.name",
          "obj": "$var.job.artifact"
        },
        "outgoing": {
          "return_data": null
        },
        "error": ""
      },
      "deprecated": false,
      "matched": [
        {
          "key": "canvasName",
          "highlightString": "<span class='highlight-string'>query</span>"
        },
        {
          "key": "summary",
          "highlightString": "<span class='highlight-string'>Query</span> Data Using 'json-query' Format"
        },
        {
          "key": "description",
          "highlightString": "<span class='highlight-string'>Query</span> data using a dot/bracket notation string and a matching key/value pair."
        }
      ],
      "groups": [],
      "x": -0.23226812159002339,
      "y": 0.6010854816824966,
      "scheduled": false
    },
    "5dc2": {
      "name": "query",
      "canvasName": "query",
      "summary": "Query Component Map",
      "description": "Query data using a dot/bracket notation string and a matching key/value pair.",
      "location": "Application",
      "locationType": null,
      "app": "WorkFlowEngine",
      "displayName": "WorkFlowEngine",
      "type": "operation",
      "variables": {
        "incoming": {
          "pass_on_null": false,
          "query": "componentMap",
          "obj": "$var.job.discovery"
        },
        "outgoing": {
          "return_data": null
        },
        "error": ""
      },
      "deprecated": false,
      "matched": [
        {
          "key": "canvasName",
          "highlightString": "<span class='highlight-string'>query</span>"
        },
        {
          "key": "summary",
          "highlightString": "<span class='highlight-string'>Query</span> Data Using 'json-query' Format"
        },
        {
          "key": "description",
          "highlightString": "<span class='highlight-string'>Query</span> data using a dot/bracket notation string and a matching key/value pair."
        }
      ],
      "groups": [],
      "x": 0.738341968911917,
      "y": 0.483630952380952,
      "scheduled": false
    },
    "66d8": {
      "name": "ShowJsonForm",
      "canvasName": "ShowJsonForm",
      "summary": "Show Json Form",
      "description": "Show Json Form",
      "location": "Application",
      "app": "JsonForms",
      "displayName": "JsonForms",
      "type": "manual",
      "variables": {
        "incoming": {
          "form_id": "Artifact Components",
          "instance_data": "$var.7144.merged_object"
        },
        "outgoing": {
          "export": "$var.job.mergedComponents"
        },
        "error": ""
      },
      "view": "/json-forms/task/ShowJsonForm",
      "deprecated": false,
      "matched": [],
      "groups": [],
      "x": 1.14520202020202,
      "y": 0.4821705426356589,
      "scheduled": false
    },
    "aa5f": {
      "name": "query",
      "canvasName": "query",
      "summary": "Query workflow",
      "description": "Query data using a dot/bracket notation string and a matching key/value pair.",
      "location": "Application",
      "locationType": null,
      "app": "WorkFlowEngine",
      "displayName": "WorkFlowEngine",
      "type": "operation",
      "variables": {
        "incoming": {
          "pass_on_null": false,
          "query": "workflow",
          "obj": "$var.5dc2.return_data"
        },
        "outgoing": {
          "return_data": null
        },
        "error": ""
      },
      "deprecated": false,
      "matched": [
        {
          "key": "canvasName",
          "highlightString": "<span class='highlight-string'>query</span>"
        },
        {
          "key": "summary",
          "highlightString": "<span class='highlight-string'>Query</span> Data Using 'json-query' Format"
        },
        {
          "key": "description",
          "highlightString": "<span class='highlight-string'>Query</span> data using a dot/bracket notation string and a matching key/value pair."
        }
      ],
      "groups": [],
      "x": 0.816062176165803,
      "y": 0.380952380952381,
      "scheduled": false
    },
    "624e": {
      "name": "query",
      "canvasName": "query",
      "summary": "Query ac-agenda-job",
      "description": "Query data using a dot/bracket notation string and a matching key/value pair.",
      "location": "Application",
      "locationType": null,
      "app": "WorkFlowEngine",
      "displayName": "WorkFlowEngine",
      "type": "operation",
      "variables": {
        "incoming": {
          "pass_on_null": false,
          "query": "ac-agenda-job",
          "obj": "$var.5dc2.return_data"
        },
        "outgoing": {
          "return_data": null
        },
        "error": "",
        "decorators": []
      },
      "deprecated": false,
      "matched": [
        {
          "key": "canvasName",
          "highlightString": "<span class='highlight-string'>query</span>"
        },
        {
          "key": "summary",
          "highlightString": "<span class='highlight-string'>Query</span> Data Using 'json-query' Format"
        },
        {
          "key": "description",
          "highlightString": "<span class='highlight-string'>Query</span> data using a dot/bracket notation string and a matching key/value pair."
        }
      ],
      "groups": [],
      "x": 0.820379965457686,
      "y": 0.543154761904762,
      "scheduled": false
    },
    "2f07": {
      "name": "query",
      "canvasName": "query",
      "summary": "Query forms",
      "description": "Query data using a dot/bracket notation string and a matching key/value pair.",
      "location": "Application",
      "locationType": null,
      "app": "WorkFlowEngine",
      "displayName": "WorkFlowEngine",
      "type": "operation",
      "variables": {
        "incoming": {
          "pass_on_null": false,
          "query": "forms",
          "obj": "$var.5dc2.return_data"
        },
        "outgoing": {
          "return_data": null
        },
        "error": ""
      },
      "deprecated": false,
      "matched": [
        {
          "key": "canvasName",
          "highlightString": "<span class='highlight-string'>query</span>"
        },
        {
          "key": "summary",
          "highlightString": "<span class='highlight-string'>Query</span> Data Using 'json-query' Format"
        },
        {
          "key": "description",
          "highlightString": "<span class='highlight-string'>Query</span> data using a dot/bracket notation string and a matching key/value pair."
        }
      ],
      "groups": [],
      "x": 0.821969696969697,
      "y": 1.0868217054263567,
      "scheduled": false
    },
    "a796": {
      "name": "query",
      "canvasName": "query",
      "summary": "Query template",
      "description": "Query data using a dot/bracket notation string and a matching key/value pair.",
      "location": "Application",
      "locationType": null,
      "app": "WorkFlowEngine",
      "displayName": "WorkFlowEngine",
      "type": "operation",
      "variables": {
        "incoming": {
          "pass_on_null": false,
          "query": "template",
          "obj": "$var.5dc2.return_data"
        },
        "outgoing": {
          "return_data": null
        },
        "error": ""
      },
      "deprecated": false,
      "matched": [
        {
          "key": "canvasName",
          "highlightString": "<span class='highlight-string'>query</span>"
        },
        {
          "key": "summary",
          "highlightString": "<span class='highlight-string'>Query</span> Data Using 'json-query' Format"
        },
        {
          "key": "description",
          "highlightString": "<span class='highlight-string'>Query</span> data using a dot/bracket notation string and a matching key/value pair."
        }
      ],
      "groups": [],
      "x": 0.821969696969697,
      "y": 1.2682170542635658,
      "scheduled": false
    },
    "5fa9": {
      "name": "newVariable",
      "canvasName": "newVariable",
      "summary": "Create a Job Variable",
      "description": "Create a new Job variable by Job ID and assign it a value.",
      "location": "Application",
      "locationType": null,
      "app": "WorkFlowEngine",
      "displayName": "WorkFlowEngine",
      "type": "operation",
      "variables": {
        "incoming": {
          "name": "components",
          "value": {
            "workflows": [],
            "catalogAutomations": [],
            "operationsAutomations": [],
            "triggers": [],
            "jsonForms": [],
            "templates": [],
            "forms": [],
            "commandTemplates": [],
            "analyticTemplates": [],
            "goldenConfigTrees": [],
            "transformations": []
          }
        },
        "outgoing": {
          "value": null
        }
      },
      "deprecated": false,
      "matched": [
        {
          "key": "summary",
          "highlightString": "Create a <span class='highlight-string'>Job</span> Variable"
        },
        {
          "key": "description",
          "highlightString": "Create a new <span class='highlight-string'>Job</span> variable by Job ID and assign it a value."
        }
      ],
      "groups": [],
      "x": 0.5237724084177708,
      "y": 0.5115332428765265
    },
    "b24c": {
      "name": "modify",
      "canvasName": "modify",
      "summary": "Modify workflows",
      "description": "Modify data",
      "location": "Application",
      "locationType": null,
      "app": "WorkFlowEngine",
      "displayName": "WorkFlowEngine",
      "type": "operation",
      "variables": {
        "incoming": {
          "object_to_update": "$var.job.components",
          "query": "workflows",
          "new_value": "$var.aa5f.return_data"
        },
        "outgoing": {
          "updated_object": "$var.job.components"
        },
        "error": ""
      },
      "deprecated": false,
      "matched": [
        {
          "key": "canvasName",
          "highlightString": "<span class='highlight-string'>modify</span>"
        },
        {
          "key": "summary",
          "highlightString": "<span class='highlight-string'>Modify</span> Data"
        },
        {
          "key": "description",
          "highlightString": "<span class='highlight-string'>Modify</span> data"
        }
      ],
      "groups": [],
      "x": 0.914507772020725,
      "y": 0.389880952380952,
      "scheduled": false
    },
    "f0f": {
      "name": "modify",
      "canvasName": "modify",
      "summary": "Modify forms",
      "description": "Modify data",
      "location": "Application",
      "locationType": null,
      "app": "WorkFlowEngine",
      "displayName": "WorkFlowEngine",
      "type": "operation",
      "variables": {
        "incoming": {
          "object_to_update": "$var.job.components",
          "query": "forms",
          "new_value": "$var.2f07.return_data"
        },
        "outgoing": {
          "updated_object": "$var.job.components"
        },
        "error": ""
      },
      "deprecated": false,
      "matched": [
        {
          "key": "canvasName",
          "highlightString": "<span class='highlight-string'>modify</span>"
        },
        {
          "key": "summary",
          "highlightString": "<span class='highlight-string'>Modify</span> Data"
        },
        {
          "key": "description",
          "highlightString": "<span class='highlight-string'>Modify</span> data"
        }
      ],
      "groups": [],
      "x": 0.9128787878787878,
      "y": 1.1038759689922482,
      "scheduled": false
    },
    "6b26": {
      "name": "modify",
      "canvasName": "modify",
      "summary": "Modify templates",
      "description": "Modify data",
      "location": "Application",
      "locationType": null,
      "app": "WorkFlowEngine",
      "displayName": "WorkFlowEngine",
      "type": "operation",
      "variables": {
        "incoming": {
          "object_to_update": "$var.job.components",
          "query": "templates",
          "new_value": "$var.a796.return_data"
        },
        "outgoing": {
          "updated_object": "$var.job.components"
        },
        "error": ""
      },
      "deprecated": false,
      "matched": [
        {
          "key": "canvasName",
          "highlightString": "<span class='highlight-string'>modify</span>"
        },
        {
          "key": "summary",
          "highlightString": "<span class='highlight-string'>Modify</span> Data"
        },
        {
          "key": "description",
          "highlightString": "<span class='highlight-string'>Modify</span> data"
        }
      ],
      "groups": [],
      "x": 0.9204545454545454,
      "y": 1.2713178294573644,
      "scheduled": false
    },
    "5e51": {
      "name": "modify",
      "canvasName": "modify",
      "summary": "Modify jsonForms",
      "description": "Modify data",
      "location": "Application",
      "locationType": null,
      "app": "WorkFlowEngine",
      "displayName": "WorkFlowEngine",
      "type": "operation",
      "variables": {
        "incoming": {
          "object_to_update": "$var.job.components",
          "query": "jsonForms",
          "new_value": "$var.dfce.return_data"
        },
        "outgoing": {
          "updated_object": "$var.job.components"
        },
        "error": ""
      },
      "deprecated": false,
      "matched": [
        {
          "key": "canvasName",
          "highlightString": "<span class='highlight-string'>modify</span>"
        },
        {
          "key": "summary",
          "highlightString": "<span class='highlight-string'>Modify</span> Data"
        },
        {
          "key": "description",
          "highlightString": "<span class='highlight-string'>Modify</span> data"
        }
      ],
      "groups": [],
      "x": 0.9141414141414141,
      "y": 1.441860465116279,
      "scheduled": false
    },
    "dfce": {
      "name": "query",
      "canvasName": "query",
      "summary": "Query json-forms",
      "description": "Query data using a dot/bracket notation string and a matching key/value pair.",
      "location": "Application",
      "locationType": null,
      "app": "WorkFlowEngine",
      "displayName": "WorkFlowEngine",
      "type": "operation",
      "variables": {
        "incoming": {
          "pass_on_null": false,
          "query": "json-forms",
          "obj": "$var.5dc2.return_data"
        },
        "outgoing": {
          "return_data": null
        },
        "error": ""
      },
      "deprecated": false,
      "matched": [
        {
          "key": "canvasName",
          "highlightString": "<span class='highlight-string'>query</span>"
        },
        {
          "key": "summary",
          "highlightString": "<span class='highlight-string'>Query</span> Data Using 'json-query' Format"
        },
        {
          "key": "description",
          "highlightString": "<span class='highlight-string'>Query</span> data using a dot/bracket notation string and a matching key/value pair."
        }
      ],
      "groups": [],
      "x": 0.8244949494949495,
      "y": 1.4387596899224806,
      "scheduled": false
    },
    "dab7": {
      "name": "query",
      "canvasName": "query",
      "summary": "Query mop-template",
      "description": "Query data using a dot/bracket notation string and a matching key/value pair.",
      "location": "Application",
      "locationType": null,
      "app": "WorkFlowEngine",
      "displayName": "WorkFlowEngine",
      "type": "operation",
      "variables": {
        "incoming": {
          "pass_on_null": false,
          "query": "mop-template",
          "obj": "$var.5dc2.return_data"
        },
        "outgoing": {
          "return_data": null
        },
        "error": ""
      },
      "deprecated": false,
      "matched": [
        {
          "key": "canvasName",
          "highlightString": "<span class='highlight-string'>query</span>"
        },
        {
          "key": "summary",
          "highlightString": "<span class='highlight-string'>Query</span> Data Using 'json-query' Format"
        },
        {
          "key": "description",
          "highlightString": "<span class='highlight-string'>Query</span> data using a dot/bracket notation string and a matching key/value pair."
        }
      ],
      "groups": [],
      "x": 0.827020202020202,
      "y": 1.6325581395348838,
      "scheduled": false
    },
    "e00a": {
      "name": "modify",
      "canvasName": "modify",
      "summary": "Modify commandTemplates",
      "description": "Modify data",
      "location": "Application",
      "locationType": null,
      "app": "WorkFlowEngine",
      "displayName": "WorkFlowEngine",
      "type": "operation",
      "variables": {
        "incoming": {
          "object_to_update": "$var.job.components",
          "query": "commandTemplates",
          "new_value": "$var.dab7.return_data"
        },
        "outgoing": {
          "updated_object": "$var.job.components"
        },
        "error": ""
      },
      "deprecated": false,
      "matched": [
        {
          "key": "canvasName",
          "highlightString": "<span class='highlight-string'>modify</span>"
        },
        {
          "key": "summary",
          "highlightString": "<span class='highlight-string'>Modify</span> Data"
        },
        {
          "key": "description",
          "highlightString": "<span class='highlight-string'>Modify</span> data"
        }
      ],
      "groups": [],
      "x": 0.9330808080808081,
      "y": 1.6232558139534883,
      "scheduled": false
    },
    "e600": {
      "name": "query",
      "canvasName": "query",
      "summary": "Query mop-analytic-template",
      "description": "Query data using a dot/bracket notation string and a matching key/value pair.",
      "location": "Application",
      "locationType": null,
      "app": "WorkFlowEngine",
      "displayName": "WorkFlowEngine",
      "type": "operation",
      "variables": {
        "incoming": {
          "pass_on_null": false,
          "query": "mop-analytic-template",
          "obj": "$var.5dc2.return_data"
        },
        "outgoing": {
          "return_data": null
        },
        "error": ""
      },
      "deprecated": false,
      "matched": [
        {
          "key": "canvasName",
          "highlightString": "<span class='highlight-string'>query</span>"
        },
        {
          "key": "summary",
          "highlightString": "<span class='highlight-string'>Query</span> Data Using 'json-query' Format"
        },
        {
          "key": "description",
          "highlightString": "<span class='highlight-string'>Query</span> data using a dot/bracket notation string and a matching key/value pair."
        }
      ],
      "groups": [],
      "x": 0.827020202020202,
      "y": 1.8201550387596899,
      "scheduled": false
    },
    "a3da": {
      "name": "modify",
      "canvasName": "modify",
      "summary": "Modify analyticTemplates",
      "description": "Modify data",
      "location": "Application",
      "locationType": null,
      "app": "WorkFlowEngine",
      "displayName": "WorkFlowEngine",
      "type": "operation",
      "variables": {
        "incoming": {
          "object_to_update": "$var.job.components",
          "query": "analyticTemplates",
          "new_value": "$var.e600.return_data"
        },
        "outgoing": {
          "updated_object": "$var.job.components"
        },
        "error": ""
      },
      "deprecated": false,
      "matched": [
        {
          "key": "canvasName",
          "highlightString": "<span class='highlight-string'>modify</span>"
        },
        {
          "key": "summary",
          "highlightString": "<span class='highlight-string'>Modify</span> Data"
        },
        {
          "key": "description",
          "highlightString": "<span class='highlight-string'>Modify</span> data"
        }
      ],
      "groups": [],
      "x": 0.9305555555555556,
      "y": 1.8201550387596899,
      "scheduled": false
    },
    "a5ab": {
      "name": "modify",
      "canvasName": "modify",
      "summary": "Modify goldenConfigTrees",
      "description": "Modify data",
      "location": "Application",
      "locationType": null,
      "app": "WorkFlowEngine",
      "displayName": "WorkFlowEngine",
      "type": "operation",
      "variables": {
        "incoming": {
          "object_to_update": "$var.job.components",
          "query": "goldenConfigTrees",
          "new_value": "$var.f35a.return_data"
        },
        "outgoing": {
          "updated_object": "$var.job.components"
        },
        "error": ""
      },
      "deprecated": false,
      "matched": [
        {
          "key": "canvasName",
          "highlightString": "<span class='highlight-string'>modify</span>"
        },
        {
          "key": "summary",
          "highlightString": "<span class='highlight-string'>Modify</span> Data"
        },
        {
          "key": "description",
          "highlightString": "<span class='highlight-string'>Modify</span> data"
        }
      ],
      "groups": [],
      "x": 0.9393939393939394,
      "y": 2.0108527131782945,
      "scheduled": false
    },
    "f35a": {
      "name": "query",
      "canvasName": "query",
      "summary": "Query golden-config",
      "description": "Query data using a dot/bracket notation string and a matching key/value pair.",
      "location": "Application",
      "locationType": null,
      "app": "WorkFlowEngine",
      "displayName": "WorkFlowEngine",
      "type": "operation",
      "variables": {
        "incoming": {
          "pass_on_null": false,
          "query": "golden-config",
          "obj": "$var.5dc2.return_data"
        },
        "outgoing": {
          "return_data": null
        },
        "error": ""
      },
      "deprecated": false,
      "matched": [
        {
          "key": "canvasName",
          "highlightString": "<span class='highlight-string'>query</span>"
        },
        {
          "key": "summary",
          "highlightString": "<span class='highlight-string'>Query</span> Data Using 'json-query' Format"
        },
        {
          "key": "description",
          "highlightString": "<span class='highlight-string'>Query</span> data using a dot/bracket notation string and a matching key/value pair."
        }
      ],
      "groups": [],
      "x": 0.8295454545454546,
      "y": 2.0046511627906978,
      "scheduled": false
    },
    "6f9c": {
      "name": "query",
      "canvasName": "query",
      "summary": "Query components from form",
      "description": "Query data using a dot/bracket notation string and a matching key/value pair.",
      "location": "Application",
      "locationType": null,
      "app": "WorkFlowEngine",
      "displayName": "WorkFlowEngine",
      "type": "operation",
      "variables": {
        "incoming": {
          "pass_on_null": false,
          "query": "components",
          "obj": "$var.job.mergedComponents"
        },
        "outgoing": {
          "return_data": null
        },
        "error": ""
      },
      "deprecated": false,
      "matched": [
        {
          "key": "canvasName",
          "highlightString": "<span class='highlight-string'>query</span>"
        },
        {
          "key": "summary",
          "highlightString": "<span class='highlight-string'>Query</span> Data Using 'json-query' Format"
        },
        {
          "key": "description",
          "highlightString": "<span class='highlight-string'>Query</span> data using a dot/bracket notation string and a matching key/value pair."
        }
      ],
      "groups": [],
      "x": 1.37305699481865,
      "y": 0.474702380952381,
      "scheduled": false
    },
    "ca33": {
      "name": "query",
      "canvasName": "query",
      "summary": "Query catalogAutomations from form",
      "description": "Query data using a dot/bracket notation string and a matching key/value pair.",
      "location": "Application",
      "locationType": null,
      "app": "WorkFlowEngine",
      "displayName": "WorkFlowEngine",
      "type": "operation",
      "variables": {
        "incoming": {
          "pass_on_null": false,
          "query": "catalogAutomations",
          "obj": "$var.6f9c.return_data"
        },
        "outgoing": {
          "return_data": null
        },
        "error": "",
        "decorators": []
      },
      "deprecated": false,
      "matched": [
        {
          "key": "canvasName",
          "highlightString": "<span class='highlight-string'>query</span>"
        },
        {
          "key": "summary",
          "highlightString": "<span class='highlight-string'>Query</span> Data Using 'json-query' Format"
        },
        {
          "key": "description",
          "highlightString": "<span class='highlight-string'>Query</span> data using a dot/bracket notation string and a matching key/value pair."
        }
      ],
      "groups": [],
      "x": 1.2853535353535352,
      "y": 0.7829457364341085,
      "scheduled": false
    },
    "f4fa": {
      "name": "query",
      "canvasName": "query",
      "summary": "Query workflows from form",
      "description": "Query data using a dot/bracket notation string and a matching key/value pair.",
      "location": "Application",
      "locationType": null,
      "app": "WorkFlowEngine",
      "displayName": "WorkFlowEngine",
      "type": "operation",
      "variables": {
        "incoming": {
          "pass_on_null": false,
          "query": "workflows",
          "obj": "$var.6f9c.return_data"
        },
        "outgoing": {
          "return_data": null
        },
        "error": ""
      },
      "deprecated": false,
      "matched": [
        {
          "key": "canvasName",
          "highlightString": "<span class='highlight-string'>query</span>"
        },
        {
          "key": "summary",
          "highlightString": "<span class='highlight-string'>Query</span> Data Using 'json-query' Format"
        },
        {
          "key": "description",
          "highlightString": "<span class='highlight-string'>Query</span> data using a dot/bracket notation string and a matching key/value pair."
        }
      ],
      "groups": [],
      "x": 1.5101010101010102,
      "y": 0.703875968992248,
      "scheduled": false
    },
    "a9df": {
      "name": "query",
      "canvasName": "query",
      "summary": "Query jsonForms from form",
      "description": "Query data using a dot/bracket notation string and a matching key/value pair.",
      "location": "Application",
      "locationType": null,
      "app": "WorkFlowEngine",
      "displayName": "WorkFlowEngine",
      "type": "operation",
      "variables": {
        "incoming": {
          "pass_on_null": false,
          "query": "jsonForms",
          "obj": "$var.6f9c.return_data"
        },
        "outgoing": {
          "return_data": null
        },
        "error": ""
      },
      "deprecated": false,
      "matched": [
        {
          "key": "canvasName",
          "highlightString": "<span class='highlight-string'>query</span>"
        },
        {
          "key": "summary",
          "highlightString": "<span class='highlight-string'>Query</span> Data Using 'json-query' Format"
        },
        {
          "key": "description",
          "highlightString": "<span class='highlight-string'>Query</span> data using a dot/bracket notation string and a matching key/value pair."
        }
      ],
      "groups": [],
      "x": 1.5656565656565657,
      "y": 0.6573643410852713,
      "scheduled": false
    },
    "e6f7": {
      "name": "query",
      "canvasName": "query",
      "summary": "Query analyticTemplates from form",
      "description": "Query data using a dot/bracket notation string and a matching key/value pair.",
      "location": "Application",
      "locationType": null,
      "app": "WorkFlowEngine",
      "displayName": "WorkFlowEngine",
      "type": "operation",
      "variables": {
        "incoming": {
          "pass_on_null": false,
          "query": "analyticTemplates",
          "obj": "$var.6f9c.return_data"
        },
        "outgoing": {
          "return_data": null
        },
        "error": ""
      },
      "deprecated": false,
      "matched": [
        {
          "key": "canvasName",
          "highlightString": "<span class='highlight-string'>query</span>"
        },
        {
          "key": "summary",
          "highlightString": "<span class='highlight-string'>Query</span> Data Using 'json-query' Format"
        },
        {
          "key": "description",
          "highlightString": "<span class='highlight-string'>Query</span> data using a dot/bracket notation string and a matching key/value pair."
        }
      ],
      "groups": [],
      "x": 1.8055555555555556,
      "y": 0.4356589147286822,
      "scheduled": false
    },
    "7ca3": {
      "name": "query",
      "canvasName": "query",
      "summary": "Query templates from form",
      "description": "Query data using a dot/bracket notation string and a matching key/value pair.",
      "location": "Application",
      "locationType": null,
      "app": "WorkFlowEngine",
      "displayName": "WorkFlowEngine",
      "type": "operation",
      "variables": {
        "incoming": {
          "pass_on_null": false,
          "query": "templates",
          "obj": "$var.6f9c.return_data"
        },
        "outgoing": {
          "return_data": null
        },
        "error": ""
      },
      "deprecated": false,
      "matched": [
        {
          "key": "canvasName",
          "highlightString": "<span class='highlight-string'>query</span>"
        },
        {
          "key": "summary",
          "highlightString": "<span class='highlight-string'>Query</span> Data Using 'json-query' Format"
        },
        {
          "key": "description",
          "highlightString": "<span class='highlight-string'>Query</span> data using a dot/bracket notation string and a matching key/value pair."
        }
      ],
      "groups": [],
      "x": 1.6893939393939394,
      "y": 0.5550387596899224,
      "scheduled": false
    },
    "7fb0": {
      "name": "query",
      "canvasName": "query",
      "summary": "Query commandTemplates from form",
      "description": "Query data using a dot/bracket notation string and a matching key/value pair.",
      "location": "Application",
      "locationType": null,
      "app": "WorkFlowEngine",
      "displayName": "WorkFlowEngine",
      "type": "operation",
      "variables": {
        "incoming": {
          "pass_on_null": false,
          "query": "commandTemplates",
          "obj": "$var.6f9c.return_data"
        },
        "outgoing": {
          "return_data": null
        },
        "error": ""
      },
      "deprecated": false,
      "matched": [
        {
          "key": "canvasName",
          "highlightString": "<span class='highlight-string'>query</span>"
        },
        {
          "key": "summary",
          "highlightString": "<span class='highlight-string'>Query</span> Data Using 'json-query' Format"
        },
        {
          "key": "description",
          "highlightString": "<span class='highlight-string'>Query</span> data using a dot/bracket notation string and a matching key/value pair."
        }
      ],
      "groups": [],
      "x": 1.7436868686868687,
      "y": 0.5069767441860465,
      "scheduled": false
    },
    "e651": {
      "name": "query",
      "canvasName": "query",
      "summary": "Query goldenConfigTrees from form",
      "description": "Query data using a dot/bracket notation string and a matching key/value pair.",
      "location": "Application",
      "locationType": null,
      "app": "WorkFlowEngine",
      "displayName": "WorkFlowEngine",
      "type": "operation",
      "variables": {
        "incoming": {
          "pass_on_null": false,
          "query": "goldenConfigTrees",
          "obj": "$var.6f9c.return_data"
        },
        "outgoing": {
          "return_data": null
        },
        "error": ""
      },
      "deprecated": false,
      "matched": [
        {
          "key": "canvasName",
          "highlightString": "<span class='highlight-string'>query</span>"
        },
        {
          "key": "summary",
          "highlightString": "<span class='highlight-string'>Query</span> Data Using 'json-query' Format"
        },
        {
          "key": "description",
          "highlightString": "<span class='highlight-string'>Query</span> data using a dot/bracket notation string and a matching key/value pair."
        }
      ],
      "groups": [],
      "x": 1.856060606060606,
      "y": 0.3643410852713178,
      "scheduled": false
    },
    "47d6": {
      "name": "merge",
      "canvasName": "merge",
      "summary": "Merge Component Data to original form",
      "description": "Merge data into a single object",
      "location": "Application",
      "locationType": null,
      "app": "WorkFlowEngine",
      "displayName": "WorkFlowEngine",
      "type": "operation",
      "variables": {
        "incoming": {
          "data_to_merge": [
            {
              "key": "ac-agenda-job",
              "value": {
                "task": "ca33",
                "variable": "return_data"
              }
            },
            {
              "key": "automation",
              "value": {
                "task": "7ae5",
                "variable": "return_data"
              }
            },
            {
              "key": "workflow",
              "value": {
                "task": "f4fa",
                "variable": "return_data"
              }
            },
            {
              "key": "json-forms",
              "value": {
                "task": "a9df",
                "variable": "return_data"
              }
            },
            {
              "key": "forms",
              "value": {
                "task": "2749",
                "variable": "return_data"
              }
            },
            {
              "key": "template",
              "value": {
                "task": "7ca3",
                "variable": "return_data"
              }
            },
            {
              "key": "mop-template",
              "value": {
                "task": "7fb0",
                "variable": "return_data"
              }
            },
            {
              "key": "mop-analytic-template",
              "value": {
                "task": "e6f7",
                "variable": "return_data"
              }
            },
            {
              "key": "golden-config",
              "value": {
                "task": "e651",
                "variable": "return_data"
              }
            },
            {
              "key": "transformation",
              "value": {
                "task": "1ee5",
                "variable": "return_data"
              }
            }
          ]
        },
        "outgoing": {
          "merged_object": null
        }
      },
      "deprecated": false,
      "matched": [
        {
          "key": "canvasName",
          "highlightString": "<span class='highlight-string'>merge</span>"
        },
        {
          "key": "summary",
          "highlightString": "<span class='highlight-string'>Merge</span> Data"
        },
        {
          "key": "description",
          "highlightString": "<span class='highlight-string'>Merge</span> data into a single object"
        }
      ],
      "groups": [],
      "x": 1.5744949494949494,
      "y": 0.8589147286821706
    },
    "3dc1": {
      "name": "setObjectKey",
      "canvasName": "setObjectKey",
      "summary": "Set componentMap Key",
      "description": "Set an object key",
      "location": "Application",
      "locationType": null,
      "app": "WorkFlowEngine",
      "displayName": "Object",
      "type": "automatic",
      "variables": {
        "incoming": {
          "obj": "$var.job.discovery",
          "path": [
            "componentMap"
          ],
          "value": "$var.47d6.merged_object"
        },
        "outgoing": {
          "object": "$var.job.discovery"
        },
        "error": ""
      },
      "deprecated": true,
      "matched": [
        {
          "key": "canvasName",
          "highlightString": "<span class='highlight-string'>setObj</span>ectKey"
        }
      ],
      "groups": [],
      "actor": "Pronghorn",
      "x": 1.9006908462867,
      "y": 0.852678571428571,
      "scheduled": false
    },
    "c9b2": {
      "name": "prepareExports",
      "canvasName": "prepareExports",
      "summary": "Export components",
      "description": "Prepare list of selected individual components for export. Takes in the component map, filters components selected for export, and outputs an array of component maps and dependencies for each item.",
      "location": "Application",
      "locationType": null,
      "app": "AppArtifacts",
      "displayName": "AppArtifacts",
      "type": "automatic",
      "variables": {
        "incoming": {
          "componentMap": "$var.47d6.merged_object"
        },
        "outgoing": {
          "List": "$var.job.exports"
        },
        "error": "",
        "decorators": []
      },
      "deprecated": false,
      "matched": [
        {
          "key": "canvasName",
          "highlightString": "<span class='highlight-string'>prepare</span>Exports"
        },
        {
          "key": "description",
          "highlightString": "<span class='highlight-string'>Prepare</span> list of selected individual components for export. Takes in the component map, filters components selected for export, and outputs an array of component maps and dependencies for each item."
        }
      ],
      "groups": [],
      "actor": "Pronghorn",
      "x": 1.73316062176166,
      "y": 0.852678571428571,
      "scheduled": false
    },
    "5e6b": {
      "name": "merge",
      "canvasName": "merge",
      "summary": "Merge Data",
      "description": "Merge data into a single object",
      "location": "Application",
      "locationType": null,
      "app": "WorkFlowEngine",
      "type": "operation",
      "displayName": "WorkFlowEngine",
      "variables": {
        "incoming": {
          "data_to_merge": [
            {
              "key": "catalogAutomation",
              "value": {
                "task": "2d7f",
                "variable": "return_data"
              }
            },
            {
              "key": "workflow",
              "value": {
                "task": "51d6",
                "variable": "return_data"
              }
            },
            {
              "key": "transformation",
              "value": {
                "task": "93bc",
                "variable": "return_data"
              }
            },
            {
              "key": "operationsAutomation",
              "value": {
                "task": "8d2d",
                "variable": "return_data"
              }
            }
          ]
        },
        "outgoing": {
          "merged_object": null
        }
      },
      "deprecated": false,
      "matched": [
        {
          "key": "canvasName",
          "highlightString": "<span class='highlight-string'>merge</span>"
        },
        {
          "key": "summary",
          "highlightString": "<span class='highlight-string'>Merge</span> Data"
        },
        {
          "key": "description",
          "highlightString": "<span class='highlight-string'>Merge</span> data into a single object"
        }
      ],
      "groups": [],
      "x": 0.009353078721745909,
      "y": 0.4898236092265943
    },
    "d162": {
      "name": "evaluation",
      "canvasName": "evaluation",
      "summary": "Run Evaluation Task",
      "description": "Run an evaluation",
      "location": "Application",
      "locationType": null,
      "app": "WorkFlowEngine",
      "type": "operation",
      "displayName": "WorkFlowEngine",
      "variables": {
        "incoming": {
          "all_true_flag": false,
          "evaluation_groups": [
            {
              "all_true_flag": false,
              "evaluations": [
                {
                  "query": "zeroTouch",
                  "operand_1": {
                    "variable": "artifact",
                    "task": "job"
                  },
                  "operator": "==",
                  "operand_2": {
                    "variable": false,
                    "task": "static"
                  }
                }
              ]
            }
          ]
        },
        "outgoing": {
          "return_value": null
        }
      },
      "deprecated": false,
      "matched": [
        {
          "key": "canvasName",
          "highlightString": "<span class='highlight-string'>eval</span>uation"
        },
        {
          "key": "summary",
          "highlightString": "Run <span class='highlight-string'>Eval</span>uation Task"
        },
        {
          "key": "description",
          "highlightString": "Run an <span class='highlight-string'>eval</span>uation"
        }
      ],
      "groups": [],
      "x": 1.151986183074266,
      "y": 0.9023485784919654
    },
    "f2e9": {
      "name": "newVariable",
      "canvasName": "newVariable",
      "summary": "Create a Job Variable",
      "description": "Create a new Job variable by Job ID and assign it a value.",
      "location": "Application",
      "locationType": null,
      "app": "WorkFlowEngine",
      "type": "operation",
      "displayName": "WorkFlowEngine",
      "variables": {
        "incoming": {
          "name": "mergedComponents",
          "value": "$var.7144.merged_object"
        },
        "outgoing": {
          "value": null
        }
      },
      "deprecated": false,
      "matched": [
        {
          "key": "summary",
          "highlightString": "Create a <span class='highlight-string'>Job</span> Variable"
        },
        {
          "key": "description",
          "highlightString": "Create a new <span class='highlight-string'>Job</span> variable by Job ID and assign it a value."
        }
      ],
      "groups": [],
      "x": 1.13568281938326,
      "y": 1.2886435331230284
    },
    "4c38": {
      "name": "query",
      "canvasName": "query",
      "summary": "Query transformation",
      "description": "Query data using a dot/bracket notation string and a matching key/value pair.",
      "location": "Application",
      "locationType": null,
      "app": "WorkFlowEngine",
      "displayName": "WorkFlowEngine",
      "type": "operation",
      "variables": {
        "incoming": {
          "pass_on_null": false,
          "query": "transformation",
          "obj": "$var.5dc2.return_data"
        },
        "outgoing": {
          "return_data": null
        },
        "error": ""
      },
      "deprecated": false,
      "matched": [
        {
          "key": "canvasName",
          "highlightString": "<span class='highlight-string'>query</span>"
        },
        {
          "key": "summary",
          "highlightString": "<span class='highlight-string'>Query</span> Data Using 'json-query' Format"
        },
        {
          "key": "description",
          "highlightString": "<span class='highlight-string'>Query</span> data using a dot/bracket notation string and a matching key/value pair."
        }
      ],
      "groups": [],
      "x": 0.8295454545454546,
      "y": 2.2418604651162792,
      "scheduled": false
    },
    "9e15": {
      "name": "modify",
      "canvasName": "modify",
      "summary": "Modify transformations",
      "description": "Modify data",
      "location": "Application",
      "locationType": null,
      "app": "WorkFlowEngine",
      "displayName": "WorkFlowEngine",
      "type": "operation",
      "variables": {
        "incoming": {
          "object_to_update": "$var.job.components",
          "query": "transformations",
          "new_value": "$var.4c38.return_data"
        },
        "outgoing": {
          "updated_object": "$var.job.components"
        },
        "error": ""
      },
      "deprecated": false,
      "matched": [
        {
          "key": "canvasName",
          "highlightString": "<span class='highlight-string'>modify</span>"
        },
        {
          "key": "summary",
          "highlightString": "<span class='highlight-string'>Modify</span> Data"
        },
        {
          "key": "description",
          "highlightString": "<span class='highlight-string'>Modify</span> data"
        }
      ],
      "groups": [],
      "x": 0.9444444444444444,
      "y": 2.2387596899224804,
      "scheduled": false
    },
    "1ee5": {
      "name": "query",
      "canvasName": "query",
      "summary": "Query transformations from form",
      "description": "Query data using a dot/bracket notation string and a matching key/value pair.",
      "location": "Application",
      "locationType": null,
      "app": "WorkFlowEngine",
      "displayName": "WorkFlowEngine",
      "type": "operation",
      "variables": {
        "incoming": {
          "pass_on_null": false,
          "query": "transformations",
          "obj": "$var.6f9c.return_data"
        },
        "outgoing": {
          "return_data": null
        },
        "error": ""
      },
      "deprecated": false,
      "matched": [
        {
          "key": "canvasName",
          "highlightString": "<span class='highlight-string'>query</span>"
        },
        {
          "key": "summary",
          "highlightString": "<span class='highlight-string'>Query</span> Data Using 'json-query' Format"
        },
        {
          "key": "description",
          "highlightString": "<span class='highlight-string'>Query</span> data using a dot/bracket notation string and a matching key/value pair."
        }
      ],
      "groups": [],
      "x": 1.8901515151515151,
      "y": 0.27596899224806204,
      "scheduled": false
    },
    "93bc": {
      "name": "query",
      "canvasName": "query",
      "summary": "Query JST",
      "description": "Query data using a dot/bracket notation string and a matching key/value pair.",
      "location": "Application",
      "locationType": null,
      "app": "WorkFlowEngine",
      "type": "operation",
      "displayName": "WorkFlowEngine",
      "variables": {
        "incoming": {
          "pass_on_null": false,
          "query": "jst",
          "obj": "$var.job.artifact"
        },
        "outgoing": {
          "return_data": null
        },
        "error": ""
      },
      "deprecated": false,
      "matched": [
        {
          "key": "canvasName",
          "highlightString": "<span class='highlight-string'>query</span>"
        },
        {
          "key": "summary",
          "highlightString": "<span class='highlight-string'>Query</span> Data Using 'json-query' Format"
        },
        {
          "key": "description",
          "highlightString": "<span class='highlight-string'>Query</span> data using a dot/bracket notation string and a matching key/value pair."
        }
      ],
      "groups": [],
      "x": -0.2283710054559626,
      "y": 0.48846675712347354,
      "scheduled": false
    },
    "8d2d": {
      "name": "query",
      "canvasName": "query",
      "summary": "Get Array Operations Manager Automations",
      "description": "Query data using a dot/bracket notation string and a matching key/value pair.",
      "location": "Application",
      "locationType": null,
      "app": "WorkFlowEngine",
      "type": "operation",
      "displayName": "WorkFlowEngine",
      "variables": {
        "incoming": {
          "pass_on_null": false,
          "query": "operationsManagerAutomations.name",
          "obj": "$var.job.artifact"
        },
        "outgoing": {
          "return_data": null
        },
        "error": "",
        "decorators": []
      },
      "deprecated": false,
      "matched": [
        {
          "key": "canvasName",
          "highlightString": "<span class='highlight-string'>query</span>"
        },
        {
          "key": "summary",
          "highlightString": "<span class='highlight-string'>Query</span> Data Using 'json-query' Format"
        },
        {
          "key": "description",
          "highlightString": "<span class='highlight-string'>Query</span> data using a dot/bracket notation string and a matching key/value pair."
        }
      ],
      "groups": [],
      "x": -0.22915042868277474,
      "y": 0.7177747625508819,
      "scheduled": false
    },
    "6fe8": {
      "name": "query",
      "canvasName": "query",
      "summary": "Query 'om-automations'",
      "description": "Query data using a dot/bracket notation string and a matching key/value pair.",
      "location": "Application",
      "locationType": null,
      "app": "WorkFlowEngine",
      "type": "operation",
      "displayName": "WorkFlowEngine",
      "variables": {
        "incoming": {
          "pass_on_null": false,
          "query": "automation",
          "obj": "$var.5dc2.return_data"
        },
        "outgoing": {
          "return_data": null
        },
        "error": "",
        "decorators": []
      },
      "deprecated": false,
      "matched": [
        {
          "key": "canvasName",
          "highlightString": "<span class='highlight-string'>query</span>"
        },
        {
          "key": "summary",
          "highlightString": "<span class='highlight-string'>Query</span> Data Using 'json-query' Format"
        },
        {
          "key": "description",
          "highlightString": "<span class='highlight-string'>Query</span> data using a dot/bracket notation string and a matching key/value pair."
        }
      ],
      "groups": [],
      "x": 0.8093434343434344,
      "y": 0.7286821705426356,
      "scheduled": false
    },
    "f29c": {
      "name": "modify",
      "canvasName": "modify",
      "summary": "Modify operationsAutomations",
      "description": "Modify data",
      "location": "Application",
      "locationType": null,
      "app": "WorkFlowEngine",
      "type": "operation",
      "displayName": "WorkFlowEngine",
      "variables": {
        "incoming": {
          "object_to_update": "$var.job.components",
          "query": "operationsAutomations",
          "new_value": "$var.6fe8.return_data"
        },
        "outgoing": {
          "updated_object": "$var.job.components"
        },
        "error": "",
        "decorators": []
      },
      "deprecated": false,
      "matched": [
        {
          "key": "canvasName",
          "highlightString": "<span class='highlight-string'>modify</span>"
        },
        {
          "key": "summary",
          "highlightString": "<span class='highlight-string'>Modify</span> Data"
        },
        {
          "key": "description",
          "highlightString": "<span class='highlight-string'>Modify</span> data"
        }
      ],
      "groups": [],
      "x": 0.9785353535353535,
      "y": 0.7333333333333333,
      "scheduled": false
    },
    "7ae5": {
      "name": "query",
      "canvasName": "query",
      "summary": "Query operationsAutomations from form",
      "description": "Query data using a dot/bracket notation string and a matching key/value pair.",
      "location": "Application",
      "locationType": null,
      "app": "WorkFlowEngine",
      "type": "operation",
      "displayName": "WorkFlowEngine",
      "variables": {
        "incoming": {
          "pass_on_null": false,
          "query": "operationsAutomations",
          "obj": "$var.6f9c.return_data"
        },
        "outgoing": {
          "return_data": null
        },
        "error": "",
        "decorators": []
      },
      "deprecated": false,
      "matched": [
        {
          "key": "canvasName",
          "highlightString": "<span class='highlight-string'>query</span>"
        },
        {
          "key": "summary",
          "highlightString": "<span class='highlight-string'>Query</span> Data Using 'json-query' Format"
        },
        {
          "key": "description",
          "highlightString": "<span class='highlight-string'>Query</span> data using a dot/bracket notation string and a matching key/value pair."
        }
      ],
      "groups": [],
      "x": 1.3674242424242424,
      "y": 0.7689922480620155,
      "scheduled": false
    },
    "f381": {
      "name": "query",
      "canvasName": "query",
      "summary": "Query 'triggers'",
      "description": "Query data using a dot/bracket notation string and a matching key/value pair.",
      "location": "Application",
      "locationType": null,
      "app": "WorkFlowEngine",
      "type": "operation",
      "displayName": "WorkFlowEngine",
      "variables": {
        "incoming": {
          "pass_on_null": false,
          "query": "trigger",
          "obj": "$var.5dc2.return_data"
        },
        "outgoing": {
          "return_data": null
        },
        "error": "",
        "decorators": []
      },
      "deprecated": false,
      "matched": [
        {
          "key": "canvasName",
          "highlightString": "<span class='highlight-string'>query</span>"
        },
        {
          "key": "summary",
          "highlightString": "<span class='highlight-string'>Query</span> Data Using 'json-query' Format"
        },
        {
          "key": "description",
          "highlightString": "<span class='highlight-string'>Query</span> data using a dot/bracket notation string and a matching key/value pair."
        }
      ],
      "groups": [],
      "x": 0.8055555555555556,
      "y": 0.9054263565891473,
      "scheduled": false
    },
    "72e5": {
      "name": "query",
      "canvasName": "query",
      "summary": "Query triggers from form",
      "description": "Query data using a dot/bracket notation string and a matching key/value pair.",
      "location": "Application",
      "locationType": null,
      "app": "WorkFlowEngine",
      "type": "operation",
      "displayName": "WorkFlowEngine",
      "variables": {
        "incoming": {
          "pass_on_null": false,
          "query": "triggers",
          "obj": "$var.6f9c.return_data"
        },
        "outgoing": {
          "return_data": null
        },
        "error": "",
        "decorators": []
      },
      "deprecated": false,
      "matched": [
        {
          "key": "canvasName",
          "highlightString": "<span class='highlight-string'>query</span>"
        },
        {
          "key": "summary",
          "highlightString": "<span class='highlight-string'>Query</span> Data Using 'json-query' Format"
        },
        {
          "key": "description",
          "highlightString": "<span class='highlight-string'>Query</span> data using a dot/bracket notation string and a matching key/value pair."
        }
      ],
      "groups": [],
      "x": 1.4381313131313131,
      "y": 0.7503875968992249,
      "scheduled": false
    },
    "c39b": {
      "name": "modify",
      "canvasName": "modify",
      "summary": "Modify triggers",
      "description": "Modify data",
      "location": "Application",
      "locationType": null,
      "app": "WorkFlowEngine",
      "type": "operation",
      "displayName": "WorkFlowEngine",
      "variables": {
        "incoming": {
          "object_to_update": "$var.job.components",
          "query": "triggers",
          "new_value": "$var.f381.return_data"
        },
        "outgoing": {
          "updated_object": null
        },
        "error": "",
        "decorators": []
      },
      "deprecated": false,
      "matched": [
        {
          "key": "canvasName",
          "highlightString": "<span class='highlight-string'>modify</span>"
        },
        {
          "key": "summary",
          "highlightString": "<span class='highlight-string'>Modify</span> Data"
        },
        {
          "key": "description",
          "highlightString": "<span class='highlight-string'>Modify</span> data"
        }
      ],
      "groups": [],
      "x": 0.9318181818181818,
      "y": 0.9054263565891473,
      "scheduled": false
    },
    "da4": {
      "name": "query",
      "canvasName": "query",
      "summary": "Query Component Map",
      "description": "Query data using a dot/bracket notation string and a matching key/value pair.",
      "location": "Application",
      "locationType": null,
      "app": "WorkFlowEngine",
      "displayName": "WorkFlowEngine",
      "type": "operation",
      "variables": {
        "incoming": {
          "pass_on_null": false,
          "query": "invalidComponents",
          "obj": "$var.job.discovery"
        },
        "outgoing": {
          "return_data": null
        },
        "error": "",
        "decorators": []
      },
      "deprecated": false,
      "matched": [
        {
          "key": "canvasName",
          "highlightString": "<span class='highlight-string'>query</span>"
        },
        {
          "key": "summary",
          "highlightString": "<span class='highlight-string'>Query</span> Data Using 'json-query' Format"
        },
        {
          "key": "description",
          "highlightString": "<span class='highlight-string'>Query</span> data using a dot/bracket notation string and a matching key/value pair."
        }
      ],
      "groups": [],
      "x": 0.44368013757523644,
      "y": 0.6274509803921569,
      "scheduled": false
    },
    "fa03": {
      "name": "arrayLength",
      "canvasName": "length",
      "summary": "Check if there are invalid components",
      "description": "Check if there are invalid components",
      "location": "Application",
      "locationType": null,
      "app": "WorkFlowEngine",
      "type": "automatic",
      "displayName": "Array",
      "variables": {
        "incoming": {
          "arr": "$var.da4.return_data"
        },
        "outgoing": {
          "length": null
        },
        "error": "",
        "decorators": []
      },
      "deprecated": false,
      "matched": [
        {
          "key": "canvasName",
          "highlightString": "<span class='highlight-string'>length</span>"
        },
        {
          "key": "summary",
          "highlightString": "Gets the <span class='highlight-string'>length</span> of an array."
        }
      ],
      "groups": [],
      "actor": "Pronghorn",
      "x": 0.35151987529228373,
      "y": 0.7435549525101763,
      "scheduled": false
    },
    "c14c": {
      "name": "evaluation",
      "canvasName": "evaluation",
      "summary": "Run Evaluation Task",
      "description": "Run an evaluation",
      "location": "Application",
      "locationType": null,
      "app": "WorkFlowEngine",
      "type": "operation",
      "displayName": "WorkFlowEngine",
      "variables": {
        "incoming": {
          "all_true_flag": false,
          "evaluation_groups": [
            {
              "all_true_flag": false,
              "evaluations": [
                {
                  "query": "",
                  "operand_1": {
                    "variable": "length",
                    "task": "fa03"
                  },
                  "operator": ">",
                  "operand_2": {
                    "variable": 0,
                    "task": "static"
                  }
                }
              ]
            }
          ]
        },
        "outgoing": {
          "return_value": null
        }
      },
      "deprecated": false,
      "matched": [
        {
          "key": "canvasName",
          "highlightString": "<span class='highlight-string'>eval</span>uation"
        },
        {
          "key": "summary",
          "highlightString": "Run <span class='highlight-string'>Eval</span>uation Task"
        },
        {
          "key": "description",
          "highlightString": "Run an <span class='highlight-string'>eval</span>uation"
        }
      ],
      "groups": [],
      "x": 0.5151987529228371,
      "y": 0.7924016282225237
    },
    "e45c": {
      "name": "ViewData",
      "canvasName": "ViewData",
      "summary": "Invalid components were discovered",
      "description": "Invalid components were discovered",
      "location": "Application",
      "app": "WorkFlowEngine",
      "displayName": "Tools",
      "type": "manual",
      "variables": {
        "incoming": {
          "header": "Invalid components were discovered",
          "message": "Please review the discovery report and choose to either bypass this validation or try-again",
          "body": "You may want to run this automation in NON zero-touch mode, so you can review the list of components and emit the component(s) that are causing this issue",
          "variables": {},
          "btn_success": "try again",
          "btn_failure": "bypass"
        },
        "outgoing": {},
        "error": "",
        "decorators": []
      },
      "view": "/workflow_engine/task/ViewData",
      "deprecated": false,
      "matched": [
        {
          "key": "canvasName",
          "highlightString": "<span class='highlight-string'>ViewData</span>"
        }
      ],
      "groups": [],
      "x": 0.6336710833982853,
      "y": 1.1112618724559022,
      "scheduled": false
    },
    "a382": {
      "name": "ErrorHandling",
      "canvasName": "ErrorHandling",
      "summary": "Error Handling",
      "description": "Do error handling within a workflow",
      "location": "Application",
      "app": "WorkFlowEngine",
      "displayName": "Tools",
      "type": "manual",
      "variables": {
        "incoming": {
          "severity": "fatal",
          "status": "$var.834.error",
          "retry": ""
        },
        "outgoing": {
          "response": null
        },
        "error": "",
        "decorators": []
      },
      "view": "/workflow_engine/task/ErrorHandling",
      "deprecated": false,
      "matched": [
        {
          "key": "canvasName",
          "highlightString": "<span class='highlight-string'>Error</span>Handling"
        },
        {
          "key": "summary",
          "highlightString": "<span class='highlight-string'>Error</span> Handling"
        },
        {
          "key": "description",
          "highlightString": "Do <span class='highlight-string'>error</span> handling within a workflow"
        }
      ],
      "groups": [],
      "x": 0.2596732588134136,
      "y": 0.3575547866205306,
      "scheduled": false
    },
    "60fd": {
      "name": "parse",
      "canvasName": "parse",
      "summary": "Parses a string to create an object.",
      "description": "Parses a JSON string, constructing the JavaScript value or object described by the string.",
      "location": "Application",
      "locationType": null,
      "app": "WorkFlowEngine",
      "type": "automatic",
      "displayName": "String",
      "variables": {
        "incoming": {
          "text": "$var.834.error"
        },
        "outgoing": {
          "textObject": "$var.job.discoveryError"
        },
        "error": "",
        "decorators": []
      },
      "deprecated": false,
      "matched": [
        {
          "key": "canvasName",
          "highlightString": "<span class='highlight-string'>parse</span>"
        },
        {
          "key": "summary",
          "highlightString": "<span class='highlight-string'>Parse</span>s a string to create an object."
        },
        {
          "key": "description",
          "highlightString": "<span class='highlight-string'>Parse</span>s a JSON string, constructing the JavaScript value or object described by the string."
        }
      ],
      "groups": [],
      "actor": "Pronghorn",
      "x": 0.413585554600172,
      "y": 0.356401384083045,
      "scheduled": false
    },
    "ae96": {
      "name": "newVariable",
      "canvasName": "newVariable",
      "summary": "Create a Job Variable",
      "description": "Create a new Job variable by Job ID and assign it a value.",
      "location": "Application",
      "locationType": null,
      "app": "WorkFlowEngine",
      "type": "operation",
      "displayName": "WorkFlowEngine",
      "variables": {
        "incoming": {
          "name": "discoveryError",
          "value": null
        },
        "outgoing": {
          "value": null
        }
      },
      "deprecated": false,
      "matched": [
        {
          "key": "summary",
          "highlightString": "Create a <span class='highlight-string'>Job</span> Variable"
        },
        {
          "key": "description",
          "highlightString": "Create a new <span class='highlight-string'>Job</span> variable by Job ID and assign it a value."
        }
      ],
      "groups": [],
      "x": 0.31900257953568356,
      "y": 0.5605536332179931
    }
  },
  "transitions": {
    "834": {
      "a382": {
        "type": "standard",
        "state": "error"
      },
      "ae96": {
        "type": "standard",
        "state": "success"
      }
    },
    "2749": {
      "47d6": {
        "type": "standard",
        "state": "success"
      }
    },
    "5875": {
      "6fe8": {
        "type": "standard",
        "state": "success"
      }
    },
    "7144": {
      "f2e9": {
        "type": "standard",
        "state": "success"
      }
    },
    "workflow_start": {
      "93bc": {
        "type": "standard",
        "state": "success"
      }
    },
    "workflow_end": {},
    "2d7f": {
      "5e6b": {
        "type": "standard",
        "state": "success"
      }
    },
    "51d6": {
      "5e6b": {
        "type": "standard",
        "state": "success"
      }
    },
    "5dc2": {
      "aa5f": {
        "type": "standard",
        "state": "success"
      }
    },
    "66d8": {
      "6f9c": {
        "type": "standard",
        "state": "success"
      }
    },
    "aa5f": {
      "b24c": {
        "type": "standard",
        "state": "success"
      },
      "624e": {
        "type": "standard",
        "state": "failure"
      }
    },
    "624e": {
      "5875": {
        "type": "standard",
        "state": "success"
      },
      "6fe8": {
        "type": "standard",
        "state": "failure"
      }
    },
    "c8f0": {},
    "2f07": {
      "f0f": {
        "type": "standard",
        "state": "success"
      },
      "a796": {
        "type": "standard",
        "state": "failure"
      }
    },
    "a796": {
      "6b26": {
        "type": "standard",
        "state": "success"
      },
      "dfce": {
        "type": "standard",
        "state": "failure"
      }
    },
    "5fa9": {
      "5dc2": {
        "type": "standard",
        "state": "success"
      }
    },
    "b24c": {
      "624e": {
        "type": "standard",
        "state": "success"
      }
    },
    "f0f": {
      "a796": {
        "type": "standard",
        "state": "success"
      }
    },
    "6b26": {
      "dfce": {
        "type": "standard",
        "state": "success"
      }
    },
    "5e51": {
      "dab7": {
        "type": "standard",
        "state": "success"
      }
    },
    "dfce": {
      "5e51": {
        "type": "standard",
        "state": "success"
      },
      "dab7": {
        "type": "standard",
        "state": "failure"
      }
    },
    "dab7": {
      "e00a": {
        "type": "standard",
        "state": "success"
      },
      "e600": {
        "type": "standard",
        "state": "failure"
      }
    },
    "e00a": {
      "e600": {
        "type": "standard",
        "state": "success"
      }
    },
    "e600": {
      "a3da": {
        "type": "standard",
        "state": "success"
      },
      "f35a": {
        "type": "standard",
        "state": "failure"
      }
    },
    "a3da": {
      "f35a": {
        "type": "standard",
        "state": "success"
      }
    },
    "a5ab": {
      "4c38": {
        "type": "standard",
        "state": "success"
      }
    },
    "f35a": {
      "a5ab": {
        "type": "standard",
        "state": "success"
      },
      "4c38": {
        "type": "standard",
        "state": "failure"
      }
    },
    "6f9c": {
      "2749": {
        "type": "standard",
        "state": "success"
      },
      "ca33": {
        "type": "standard",
        "state": "success"
      },
      "f4fa": {
        "type": "standard",
        "state": "success"
      },
      "a9df": {
        "type": "standard",
        "state": "success"
      },
      "7ca3": {
        "type": "standard",
        "state": "success"
      },
      "7fb0": {
        "type": "standard",
        "state": "success"
      },
      "e6f7": {
        "type": "standard",
        "state": "success"
      },
      "e651": {
        "type": "standard",
        "state": "success"
      },
      "1ee5": {
        "type": "standard",
        "state": "success"
      },
      "7ae5": {
        "type": "standard",
        "state": "success"
      },
      "72e5": {
        "type": "standard",
        "state": "success"
      }
    },
    "ca33": {
      "47d6": {
        "type": "standard",
        "state": "success"
      }
    },
    "f4fa": {
      "47d6": {
        "type": "standard",
        "state": "success"
      }
    },
    "a9df": {
      "47d6": {
        "type": "standard",
        "state": "success"
      }
    },
    "e6f7": {
      "47d6": {
        "type": "standard",
        "state": "success"
      }
    },
    "7ca3": {
      "47d6": {
        "type": "standard",
        "state": "success"
      }
    },
    "7fb0": {
      "47d6": {
        "type": "standard",
        "state": "success"
      }
    },
    "e651": {
      "47d6": {
        "type": "standard",
        "state": "success"
      }
    },
    "47d6": {
      "c9b2": {
        "type": "standard",
        "state": "success"
      }
    },
    "3dc1": {
      "workflow_end": {
        "type": "standard",
        "state": "success"
      }
    },
    "fd8d": {},
    "b8e8": {},
    "2a8b": {},
    "c9b2": {
      "3dc1": {
        "type": "standard",
        "state": "success"
      }
    },
    "5e6b": {
      "834": {
        "type": "standard",
        "state": "success"
      }
    },
    "d162": {
      "6f9c": {
        "type": "standard",
        "state": "failure"
      },
      "66d8": {
        "type": "standard",
        "state": "success"
      }
    },
    "f2e9": {
      "d162": {
        "type": "standard",
        "state": "success"
      }
    },
    "4c38": {
      "7144": {
        "type": "standard",
        "state": "failure"
      },
      "9e15": {
        "type": "standard",
        "state": "success"
      }
    },
    "9e15": {
      "7144": {
        "type": "standard",
        "state": "success"
      }
    },
    "1ee5": {
      "47d6": {
        "type": "standard",
        "state": "success"
      }
    },
    "93bc": {
      "2d7f": {
        "type": "standard",
        "state": "failure"
      },
      "51d6": {
        "type": "standard",
        "state": "failure"
      },
      "5e6b": {
        "type": "standard",
        "state": "success"
      },
      "8d2d": {
        "type": "standard",
        "state": "failure"
      }
    },
    "8d2d": {
      "5e6b": {
        "type": "standard",
        "state": "success"
      }
    },
    "d705": {},
    "6fe8": {
      "f29c": {
        "type": "standard",
        "state": "success"
      },
      "f381": {
        "type": "standard",
        "state": "failure"
      }
    },
    "f29c": {
      "f381": {
        "type": "standard",
        "state": "success"
      }
    },
    "7ae5": {
      "47d6": {
        "type": "standard",
        "state": "success"
      }
    },
    "f381": {
      "c39b": {
        "type": "standard",
        "state": "success"
      },
      "2f07": {
        "type": "standard",
        "state": "failure"
      }
    },
    "72e5": {
      "47d6": {
        "type": "standard",
        "state": "success"
      }
    },
    "c39b": {
      "2f07": {
        "type": "standard",
        "state": "success"
      }
    },
    "da4": {
      "5fa9": {
        "type": "standard",
        "state": "failure"
      },
      "fa03": {
        "type": "standard",
        "state": "success"
      }
    },
    "fa03": {
      "c14c": {
        "type": "standard",
        "state": "success"
      }
    },
    "c14c": {
      "5fa9": {
        "type": "standard",
        "state": "failure"
      },
      "e45c": {
        "type": "standard",
        "state": "success"
      }
    },
    "e45c": {
      "834": {
        "type": "revert",
        "state": "success"
      },
      "5fa9": {
        "type": "standard",
        "state": "failure"
      }
    },
    "a382": {
      "834": {
        "type": "revert",
        "state": "success"
      },
      "60fd": {
        "type": "standard",
        "state": "failure"
      }
    },
    "60fd": {
      "workflow_end": {
        "type": "standard",
        "state": "success"
      }
    },
    "ae96": {
      "da4": {
        "type": "standard",
        "state": "success"
      }
    }
  },
  "font_size": 12,
  "created": "2020-03-27T16:46:32.533Z",
  "created_by": {
    "provenance": "Local AAA",
    "username": "Itential Artifacts",
    "firstname": "admin",
    "inactive": true,
    "email": ""
  },
  "createdVersion": "5.5.9-2019.3.0.0",
  "last_updated": "2021-09-21T14:47:35.952Z",
  "last_updated_by": {
    "provenance": "local_aaa",
    "username": "admin@pronghorn",
    "firstname": "admin",
    "inactive": false,
    "email": ""
  },
  "lastUpdatedVersion": "5.40.5-2021.1.20.0",
  "type": "automation",
  "description": null,
  "inputSchema": {
    "type": "object",
    "properties": {
      "artifact": {
        "type": "object",
        "examples": [
          {
            "name": "value"
          }
        ]
      }
    },
    "required": [
      "artifact"
    ]
  },
  "outputSchema": {
    "type": "object",
    "properties": {
      "artifact": {
        "type": "object",
        "examples": [
          {
            "name": "value"
          }
        ]
      },
      "_id": {
        "type": "string",
        "pattern": "^[0-9a-f]{24}$"
      },
      "initiator": {
        "type": "string"
      },
      "discovery": {
        "title": "object",
        "type": "object",
        "properties": {},
        "examples": [
          {
            "first": {
              "second": {
                "third": "last"
              }
            }
          }
        ]
      },
      "discoveryError": {
        "title": "textObject",
        "type": "object",
        "properties": {},
        "examples": [
          {
            "result": true,
            "count": 42
          }
        ]
      },
      "components": {
        "type": [
          "array",
          "string",
          "boolean",
          "integer",
          "number",
          "object"
        ],
        "examples": [
          "updated item"
        ]
      },
      "mergedComponents": {
        "type": [
          "array",
          "boolean",
          "null",
          "number",
          "object",
          "string"
        ]
      },
      "exports": {
        "type": "array"
      }
    }
  },
  "tags": [],
  "groups": []
}
