{
  "name": "Arista File Transfer CT",
  "type": "automation",
  "tasks": {
    "601": {
      "name": "evaluation",
      "canvasName": "evaluation",
      "summary": "ftp command success",
      "description": "ftp command success",
      "location": "Application",
      "locationType": null,
      "app": "WorkFlowEngine",
      "type": "operation",
      "displayName": "WorkFlowEngine",
      "variables": {
        "incoming": {
          "all_true_flag": false,
          "evaluation_groups": [
            {
              "all_true_flag": true,
              "evaluations": [
                {
                  "query": "response",
                  "operand_1": {
                    "variable": "result",
                    "task": "4fa5"
                  },
                  "operator": "contains",
                  "operand_2": {
                    "variable": "Copy completed successfully",
                    "task": "static"
                  },
                  "rightQuery": ""
                }
              ]
            }
          ]
        },
        "outgoing": {
          "return_value": null
        }
      },
      "deprecated": false,
      "matched": [
        {
          "key": "canvasName",
          "highlightString": "<span class='highlight-string'>eval</span>uation"
        },
        {
          "key": "summary",
          "highlightString": "Run <span class='highlight-string'>Eval</span>uation Task"
        },
        {
          "key": "description",
          "highlightString": "Run an <span class='highlight-string'>eval</span>uation"
        }
      ],
      "groups": [],
      "x": 0.4041420118343195,
      "y": 0.463474025974026
    },
    "6412": {
      "name": "childJob",
      "canvasName": "childJob",
      "summary": "Arista Post Check",
      "description": "Command template runner",
      "location": "Application",
      "locationType": null,
      "app": "WorkFlowEngine",
      "type": "operation",
      "displayName": "WorkFlowEngine",
      "variables": {
        "incoming": {
          "task": "",
          "workflow": "Command Template Runner",
          "variables": {
            "templateName": {
              "editable": true,
              "task": "static",
              "value": "Arista File Transfer Prechecks"
            },
            "templateVariables": {
              "editable": true,
              "task": "2ed0",
              "value": "templateVariables"
            },
            "devices": {
              "editable": true,
              "task": "2ed0",
              "value": "deviceName"
            },
            "zeroTouch": {
              "editable": true,
              "task": "2ed0",
              "value": "zeroTouch"
            },
            "failureType": {
              "editable": true,
              "task": "static",
              "value": "Terminate"
            }
          },
          "data_array": "",
          "transformation": "",
          "loopType": ""
        },
        "outgoing": {
          "job_details": null
        }
      },
      "deprecated": false,
      "matched": [
        {
          "key": "canvasName",
          "highlightString": "<span class='highlight-string'>child</span>Job"
        },
        {
          "key": "summary",
          "highlightString": "Run <span class='highlight-string'>Child</span> Job"
        },
        {
          "key": "description",
          "highlightString": "Runs a <span class='highlight-string'>child</span> job inside a workflow."
        }
      ],
      "groups": [],
      "actor": "job",
      "x": 0.5520710059171597,
      "y": 0.4659090909090909,
      "retrySettings": null
    },
    "9534": {
      "name": "query",
      "canvasName": "query",
      "summary": "FTP response info",
      "description": "FTP response info",
      "location": "Application",
      "locationType": null,
      "app": "WorkFlowEngine",
      "type": "operation",
      "displayName": "WorkFlowEngine",
      "variables": {
        "incoming": {
          "pass_on_null": false,
          "query": "response",
          "obj": "$var.4fa5.result"
        },
        "outgoing": {
          "return_data": "$var.job.return_data"
        },
        "error": "",
        "decorators": []
      },
      "deprecated": false,
      "matched": [
        {
          "key": "canvasName",
          "highlightString": "<span class='highlight-string'>query</span>"
        },
        {
          "key": "summary",
          "highlightString": "<span class='highlight-string'>Query</span> Data Using 'json-query' Format"
        },
        {
          "key": "description",
          "highlightString": "<span class='highlight-string'>Query</span> data using a dot/bracket notation string and a matching key/value pair."
        }
      ],
      "groups": [],
      "x": 0.40384615384615385,
      "y": 0.724025974025974,
      "scheduled": false
    },
    "workflow_start": {
      "name": "workflow_start",
      "groups": [],
      "x": 0.1801775147928994,
      "y": 0.4577922077922078
    },
    "workflow_end": {
      "name": "workflow_end",
      "groups": [],
      "x": 0.7899408284023669,
      "y": 0.5982142857142857
    },
    "4fa5": {
      "name": "RunCommand",
      "canvasName": "RunCommand",
      "summary": "FTP File",
      "description": "FTP File",
      "location": "Application",
      "locationType": null,
      "app": "MOP",
      "type": "automatic",
      "displayName": "MOP",
      "variables": {
        "incoming": {
          "command": "$var.2ed0.ftpCommand",
          "variables": "$var.job.formData",
          "device": "$var.2ed0.deviceName"
        },
        "outgoing": {
          "result": null
        },
        "error": "$var.job.return_data",
        "decorators": []
      },
      "deprecated": false,
      "matched": [
        {
          "key": "canvasName",
          "highlightString": "<span class='highlight-string'>RunComm</span>and"
        }
      ],
      "groups": [],
      "actor": "Pronghorn",
      "x": 0.3384615384615385,
      "y": 0.4650974025974026,
      "scheduled": false
    },
    "7d93": {
      "name": "evaluation",
      "canvasName": "evaluation",
      "summary": "Perform MD5 check",
      "description": "Perform Md5 check",
      "location": "Application",
      "locationType": null,
      "app": "WorkFlowEngine",
      "type": "operation",
      "displayName": "WorkFlowEngine",
      "variables": {
        "incoming": {
          "all_true_flag": false,
          "evaluation_groups": [
            {
              "all_true_flag": false,
              "evaluations": [
                {
                  "query": "",
                  "operand_1": {
                    "variable": "performMd5Check",
                    "task": "2ed0"
                  },
                  "operator": "contains",
                  "operand_2": {
                    "variable": true,
                    "task": "static"
                  },
                  "rightQuery": ""
                }
              ]
            }
          ]
        },
        "outgoing": {
          "return_value": null
        }
      },
      "deprecated": false,
      "matched": [
        {
          "key": "canvasName",
          "highlightString": "<span class='highlight-string'>eval</span>uation"
        },
        {
          "key": "summary",
          "highlightString": "Run <span class='highlight-string'>Eval</span>uation Task"
        },
        {
          "key": "description",
          "highlightString": "Run an <span class='highlight-string'>eval</span>uation"
        }
      ],
      "groups": [],
      "x": 0.4710059171597633,
      "y": 0.463474025974026
    },
    "3e41": {
      "name": "newVariable",
      "canvasName": "newVariable",
      "summary": "Create a Job Variable",
      "description": "Create a new Job variable by Job ID and assign it a value.",
      "location": "Application",
      "locationType": null,
      "app": "WorkFlowEngine",
      "type": "operation",
      "displayName": "WorkFlowEngine",
      "variables": {
        "incoming": {
          "name": "outcome",
          "value": "Success"
        },
        "outgoing": {
          "value": null
        }
      },
      "deprecated": false,
      "matched": [
        {
          "key": "canvasName",
          "highlightString": "<span class='highlight-string'>newVar</span>iable"
        }
      ],
      "groups": [],
      "x": 0.7040711597673623,
      "y": 0.6
    },
    "c1ae": {
      "name": "newVariable",
      "canvasName": "newVariable",
      "summary": "Create a Job Variable",
      "description": "Create a new Job variable by Job ID and assign it a value.",
      "location": "Application",
      "locationType": null,
      "app": "WorkFlowEngine",
      "type": "operation",
      "displayName": "WorkFlowEngine",
      "variables": {
        "incoming": {
          "name": "outcome",
          "value": "FTP Failure"
        },
        "outgoing": {
          "value": null
        }
      },
      "deprecated": false,
      "matched": [
        {
          "key": "canvasName",
          "highlightString": "<span class='highlight-string'>newVar</span>iable"
        }
      ],
      "groups": [],
      "x": 0.4710059171597633,
      "y": 0.838474025974026
    },
    "c335": {
      "name": "ViewData",
      "canvasName": "ViewData",
      "summary": "FTP Failed",
      "description": "FTP Failed",
      "location": "Application",
      "app": "WorkFlowEngine",
      "displayName": "Tools",
      "type": "manual",
      "variables": {
        "incoming": {
          "header": "FTP to device failed",
          "message": "FTP to device failed,<br>Failure message:<hr><b><!response!></b><br>Fix error and retry or terminate.",
          "body": "$var.job.return_data",
          "variables": {},
          "btn_success": "Retry",
          "btn_failure": "Terminate"
        },
        "outgoing": {},
        "error": "",
        "decorators": []
      },
      "view": "/workflow_engine/task/ViewData",
      "deprecated": false,
      "matched": [
        {
          "key": "canvasName",
          "highlightString": "<span class='highlight-string'>ViewDa</span>ta"
        }
      ],
      "groups": [],
      "x": 0.3378698224852071,
      "y": 0.8352272727272727,
      "scheduled": false
    },
    "2fad": {
      "name": "evaluation",
      "canvasName": "evaluation",
      "summary": "Zero Touch",
      "description": "Zero Touch",
      "location": "Application",
      "locationType": null,
      "app": "WorkFlowEngine",
      "type": "operation",
      "displayName": "WorkFlowEngine",
      "variables": {
        "incoming": {
          "all_true_flag": false,
          "evaluation_groups": [
            {
              "all_true_flag": false,
              "evaluations": [
                {
                  "query": "",
                  "operand_1": {
                    "variable": "zeroTouch",
                    "task": "2ed0"
                  },
                  "operator": "==",
                  "operand_2": {
                    "variable": true,
                    "task": "static"
                  },
                  "rightQuery": ""
                }
              ]
            }
          ]
        },
        "outgoing": {
          "return_value": null
        }
      },
      "deprecated": false,
      "matched": [
        {
          "key": "canvasName",
          "highlightString": "<span class='highlight-string'>eval</span>uation"
        },
        {
          "key": "summary",
          "highlightString": "Run <span class='highlight-string'>Eval</span>uation Task"
        },
        {
          "key": "description",
          "highlightString": "Run an <span class='highlight-string'>eval</span>uation"
        }
      ],
      "groups": [],
      "x": 0.47071005917159764,
      "y": 0.5925324675324676
    },
    "7acd": {
      "name": "evaluation",
      "canvasName": "evaluation",
      "summary": "Child job success",
      "description": "Child job success",
      "location": "Application",
      "locationType": null,
      "app": "WorkFlowEngine",
      "type": "operation",
      "displayName": "WorkFlowEngine",
      "variables": {
        "incoming": {
          "all_true_flag": false,
          "evaluation_groups": [
            {
              "all_true_flag": false,
              "evaluations": [
                {
                  "query": "outcome",
                  "operand_1": {
                    "variable": "job_details",
                    "task": "6412"
                  },
                  "operator": "contains",
                  "operand_2": {
                    "variable": "success",
                    "task": "static"
                  },
                  "rightQuery": ""
                }
              ]
            }
          ]
        },
        "outgoing": {
          "return_value": null
        }
      },
      "deprecated": false,
      "matched": [
        {
          "key": "canvasName",
          "highlightString": "<span class='highlight-string'>eval</span>uation"
        },
        {
          "key": "summary",
          "highlightString": "Run <span class='highlight-string'>Eval</span>uation Task"
        },
        {
          "key": "description",
          "highlightString": "Run an <span class='highlight-string'>eval</span>uation"
        }
      ],
      "groups": [],
      "x": 0.6248520710059171,
      "y": 0.4667207792207792
    },
    "2ed0": {
      "name": "transformation",
      "canvasName": "transformation",
      "summary": "Arista_File_Transfer_JST",
      "description": "Perform a JSON Transformation using the JST library.",
      "location": "Application",
      "locationType": null,
      "app": "WorkFlowEngine",
      "type": "operation",
      "displayName": "WorkFlowEngine",
      "variables": {
        "incoming": {
          "tr_id": "62606535ebd84d01d67e58c4",
          "variableMap": {
            "formData": "$var.job.formData"
          },
          "options": {
            "extractOutput": false,
            "validateIncoming": true,
            "revertToDefaultValue": true
          }
        },
        "outgoing": {
          "performMd5Check": null,
          "zeroTouch": null,
          "deviceName": null,
          "md5": null,
          "ftpCommand": null,
          "fileName": null,
          "templateVariables": null
        }
      },
      "deprecated": false,
      "matched": [
        {
          "key": "description",
          "highlightString": "Perform a JSON Transformation using the <span class='highlight-string'>JST</span> library."
        }
      ],
      "groups": [],
      "x": 0.25207100591715975,
      "y": 0.46185064935064934,
      "task_name": "Arista_File_Transfer_JST",
      "retrySettings": null
    },
    "f81f": {
      "name": "ViewData",
      "canvasName": "ViewData",
      "summary": "FTP success",
      "description": "FTP success",
      "location": "Application",
      "app": "WorkFlowEngine",
      "displayName": "Tools",
      "type": "manual",
      "variables": {
        "incoming": {
          "header": "FTP to device success",
          "message": "FTP to device success,<br>Message:<hr><b><!response!></b><br>FTP outcome",
          "body": "$var.4fa5.result",
          "variables": {},
          "btn_success": "Complete",
          "btn_failure": ""
        },
        "outgoing": {},
        "error": "",
        "decorators": []
      },
      "view": "/workflow_engine/task/ViewData",
      "deprecated": false,
      "matched": [
        {
          "key": "canvasName",
          "highlightString": "<span class='highlight-string'>ViewDa</span>ta"
        }
      ],
      "groups": [],
      "x": 0.4701183431952663,
      "y": 0.7077922077922078,
      "scheduled": false
    },
    "9cc3": {
      "name": "newVariable",
      "canvasName": "newVariable",
      "summary": "Create a Job Variable",
      "description": "Create a new Job variable by Job ID and assign it a value.",
      "location": "Application",
      "locationType": null,
      "app": "WorkFlowEngine",
      "type": "operation",
      "displayName": "WorkFlowEngine",
      "variables": {
        "incoming": {
          "name": "outcome",
          "value": "Failure"
        },
        "outgoing": {
          "value": null
        }
      },
      "deprecated": false,
      "matched": [
        {
          "key": "canvasName",
          "highlightString": "<span class='highlight-string'>newVar</span>iable"
        }
      ],
      "groups": [],
      "x": 0.7037290455011974,
      "y": 0.4714893617021277
    }
  },
  "transitions": {
    "601": {
      "9534": {
        "type": "standard",
        "state": "failure"
      },
      "7d93": {
        "type": "standard",
        "state": "success"
      }
    },
    "4780": {},
    "6412": {
      "7acd": {
        "type": "standard",
        "state": "success"
      }
    },
    "9383": {},
    "9534": {
      "c335": {
        "type": "standard",
        "state": "success"
      },
      "c1ae": {
        "type": "standard",
        "state": "failure"
      }
    },
    "workflow_start": {
      "2ed0": {
        "type": "standard",
        "state": "success"
      }
    },
    "workflow_end": {},
    "a540": {},
    "4fa5": {
      "601": {
        "type": "standard",
        "state": "success"
      },
      "c335": {
        "type": "standard",
        "state": "error"
      }
    },
    "2b4d": {},
    "7d93": {
      "6412": {
        "type": "standard",
        "state": "success"
      },
      "2fad": {
        "type": "standard",
        "state": "failure"
      }
    },
    "3e41": {
      "workflow_end": {
        "type": "standard",
        "state": "success"
      }
    },
    "c1ae": {
      "workflow_end": {
        "type": "standard",
        "state": "success"
      }
    },
    "c335": {
      "c1ae": {
        "type": "standard",
        "state": "failure"
      },
      "4fa5": {
        "type": "revert",
        "state": "success"
      }
    },
    "e6ce": {},
    "2fad": {
      "3e41": {
        "type": "standard",
        "state": "success"
      },
      "f81f": {
        "type": "standard",
        "state": "failure"
      }
    },
    "ab": {},
    "c3af": {},
    "ab2d": {},
    "7acd": {
      "3e41": {
        "type": "standard",
        "state": "success"
      },
      "9cc3": {
        "type": "standard",
        "state": "failure"
      }
    },
    "2ed0": {
      "4fa5": {
        "type": "standard",
        "state": "success"
      }
    },
    "f81f": {
      "3e41": {
        "type": "standard",
        "state": "success"
      }
    },
    "9cc3": {
      "workflow_end": {
        "type": "standard",
        "state": "success"
      }
    }
  },
  "font_size": 12,
  "last_updated": "2022-04-28T18:53:35.429Z",
  "last_updated_by": {
    "provenance": "local_aaa",
    "username": "admin@pronghorn",
    "firstname": "admin",
    "inactive": false
  },
  "lastUpdatedVersion": "5.44.8-2021.2.2.0",
  "inputSchema": {
    "type": "object",
    "properties": {
      "formData": {
        "$id": "formData",
        "type": "object",
        "properties": {
          "performMd5Check": {
            "type": "boolean",
            "examples": [
              true,
              false
            ]
          },
          "zeroTouch": {
            "type": "boolean",
            "examples": [
              true,
              false
            ]
          },
          "ftpRemoteServer": {
            "type": "object",
            "properties": {
              "username": {
                "type": "string",
                "examples": [
                  "ftpuser"
                ]
              },
              "ipAddress": {
                "type": "string",
                "examples": [
                  "172%2E20%2E100%2E211"
                ],
                "format": "ipv4"
              },
              "path": {
                "type": "string",
                "examples": [
                  "/home/ftpuser/"
                ],
                "format": "regex"
              },
              "fileName": {
                "type": "string",
                "examples": [
                  "scott%2Eswi"
                ]
              },
              "password": {
                "type": "string",
                "examples": [
                  "itentialdsn"
                ]
              }
            },
            "required": []
          },
          "deviceName": {
            "type": "string",
            "examples": [
              "Scott-Arista-1649941817000"
            ]
          },
          "md5": {
            "type": "string",
            "examples": [
              "b05403212c66bdc8ccc597fedf6cd5fe"
            ]
          }
        },
        "required": []
      }
    },
    "required": [
      "formData"
    ]
  },
  "outputSchema": {
    "type": "object",
    "properties": {
      "formData": {
        "$id": "formData",
        "type": "object",
        "properties": {
          "performMd5Check": {
            "type": "boolean",
            "examples": [
              true,
              false
            ]
          },
          "zeroTouch": {
            "type": "boolean",
            "examples": [
              true,
              false
            ]
          },
          "ftpRemoteServer": {
            "type": "object",
            "properties": {
              "username": {
                "type": "string",
                "examples": [
                  "ftpuser"
                ]
              },
              "ipAddress": {
                "type": "string",
                "examples": [
                  "172%2E20%2E100%2E211"
                ],
                "format": "ipv4"
              },
              "path": {
                "type": "string",
                "examples": [
                  "/home/ftpuser/"
                ],
                "format": "regex"
              },
              "fileName": {
                "type": "string",
                "examples": [
                  "scott%2Eswi"
                ]
              },
              "password": {
                "type": "string",
                "examples": [
                  "itentialdsn"
                ]
              }
            },
            "required": []
          },
          "deviceName": {
            "type": "string",
            "examples": [
              "Scott-Arista-1649941817000"
            ]
          },
          "md5": {
            "type": "string",
            "examples": [
              "b05403212c66bdc8ccc597fedf6cd5fe"
            ]
          }
        },
        "required": []
      },
      "_id": {
        "type": "string",
        "pattern": "^[0-9a-f]{24}$"
      },
      "initiator": {
        "type": "string"
      },
      "return_data": {
        "type": [
          "string",
          "number",
          "object",
          "integer",
          "array",
          "boolean",
          "null"
        ],
        "examples": [
          "value"
        ]
      },
      "outcome": {
        "type": "string"
      }
    }
  },
  "created": "2022-04-20T12:57:28.044Z",
  "created_by": {
    "provenance": "local_aaa",
    "username": "admin@pronghorn",
    "firstname": "admin",
    "inactive": false
  },
  "createdVersion": "5.44.8-2021.2.15.0",
  "canvasVersion": 1,
  "tags": [],
  "groups": [],
  "migrationVersion": 1
}