{
  "_id": "64cbe1965fe8280224686011",
  "name": "generateQueriesForCollections",
  "description": "",
  "incoming": [
    {
      "$id": "collectionName",
      "type": "string",
      "examples": [
        "a"
      ]
    }
  ],
  "outgoing": [
    {
      "$id": "aggregateFilter",
      "type": "string",
      "examples": [
        "aggregateFilter"
      ]
    }
  ],
  "steps": [
    {
      "id": 58,
      "type": "template",
      "library": "String",
      "method": "templateLiteral",
      "template": "[\n    {\n        \"$match\": {\n            \n        }\n    },\n    {\n        \"$merge\": {\n            \"into\": \"${collectionName}\"\n            }\n    }\n]",
      "args": [
        null
      ],
      "view": {
        "row": 1,
        "col": 2
      }
    },
    {
      "id": 59,
      "type": "assign",
      "from": {
        "location": "incoming",
        "name": "collectionName",
        "ptr": ""
      },
      "to": {
        "location": "template",
        "name": 58,
        "ptr": "/args/0/value"
      }
    },
    {
      "id": 60,
      "type": "assign",
      "from": {
        "location": "template",
        "name": 58,
        "ptr": "/return"
      },
      "to": {
        "location": "outgoing",
        "name": "aggregateFilter",
        "ptr": ""
      }
    }
  ],
  "functions": [
    {
      "incoming": [
        {
          "type": [
            "array",
            "boolean",
            "number",
            "integer",
            "string",
            "object",
            "null"
          ],
          "$id": "accumulator"
        },
        {
          "type": [
            "array",
            "boolean",
            "number",
            "integer",
            "string",
            "object",
            "null"
          ],
          "$id": "currentValue"
        },
        {
          "title": "index",
          "type": "number",
          "optional": true,
          "$id": "index"
        },
        {
          "type": "array",
          "$id": "array",
          "optional": true
        },
        {
          "$id": "thisArg",
          "type": "object",
          "properties": {},
          "isContext": true,
          "isThis": true
        }
      ],
      "outgoing": [
        {
          "title": "accumulator",
          "type": [
            "array",
            "boolean",
            "number",
            "integer",
            "string",
            "object",
            "null"
          ],
          "$id": "accumulator"
        }
      ],
      "functions": [],
      "name": "getJobIds",
      "steps": [
        {
          "id": 3,
          "type": "assign",
          "from": {
            "location": "incoming",
            "name": "currentValue",
            "ptr": ""
          },
          "to": {
            "location": "method",
            "name": 2,
            "ptr": "/args/0/value"
          }
        },
        {
          "id": 5,
          "type": "assign",
          "from": {
            "location": "incoming",
            "name": "accumulator",
            "ptr": ""
          },
          "to": {
            "location": "method",
            "name": 1,
            "ptr": "/args/0/value"
          }
        },
        {
          "id": 2,
          "type": "method",
          "library": "Object",
          "method": "getProperty",
          "args": [
            null,
            "_id"
          ],
          "view": {
            "row": 2,
            "col": 1
          }
        },
        {
          "id": 4,
          "type": "assign",
          "from": {
            "location": "method",
            "name": 2,
            "ptr": "/return"
          },
          "to": {
            "location": "method",
            "name": 1,
            "ptr": "/args/1/value"
          }
        },
        {
          "id": 1,
          "type": "method",
          "library": "Array",
          "method": "push",
          "args": [
            null,
            null
          ],
          "view": {
            "row": 1,
            "col": 2
          }
        },
        {
          "id": 6,
          "type": "assign",
          "from": {
            "location": "method",
            "name": 1,
            "ptr": "/return"
          },
          "to": {
            "location": "outgoing",
            "name": "accumulator",
            "ptr": ""
          }
        }
      ],
      "view": {
        "col": 2,
        "row": 5
      },
      "id": "ƒ_reduce_1",
      "comments": []
    }
  ],
  "comments": [],
  "view": {
    "col": 3,
    "row": 6
  },
  "created": "2023-08-11T20:29:27.186Z",
  "createdBy": {
    "_id": "647a41e829e2a256067b4e8b",
    "provenance": "local_aaa",
    "username": "admin@pronghorn"
  },
  "lastUpdated": "2023-08-11T20:29:27.186Z",
  "lastUpdatedBy": {
    "_id": "647a41e829e2a256067b4e8b",
    "provenance": "local_aaa",
    "username": "admin@pronghorn"
  },
  "version": "4.1.2-2023.1.8",
  "tags": []
}