{
  "id": "5e5690d39411dd47c17a36c6",
  "created": "2019-12-26T18:31:38.802Z",
  "createdBy": "pinak.kelkar",
  "lastUpdated": "2021-01-06T20:03:36.667Z",
  "lastUpdatedBy": "pinak.kelkar",
  "name": "IAP Artifacts Port Turn Up JSON Form",
  "description": "A form to select a device, interface type and description to be turned up ",
  "version": "2020.1",
  "struct": {
    "nodeId": "f6409f9d-7ab2-471e-9a75-1f7e76d17cf4",
    "type": "object",
    "items": [
      {
        "nodeId": "faca1e1a-6f3e-4652-9355-d458bfc2886c",
        "type": "boolean",
        "title": "Zero Touch",
        "description": "Zero touch will skip all manual task for a happy path.",
        "default": true
      },
      {
        "nodeId": "1a5a58ff-23fb-439c-8e4b-b8652e935e8b",
        "type": "string",
        "title": "Device",
        "description": "The following drop down is queried by the device broker and should reflect devices on NSO and Ansible",
        "placeholder": "Select a device to turn up a port on ",
        "required": true,
        "enum": [],
        "binding": true,
        "rel": "collection",
        "targetPointer": "/enum",
        "method": "POST",
        "base": "/",
        "href": "configuration_manager/devices",
        "body": {
          "options": {
            "start": 0,
            "limit": 50,
            "order": "ascending",
            "sort": [
              {
                "name": 1
              }
            ],
            "filter": {
              "name": ""
            }
          }
        },
        "sourcePointer": "/list",
        "sourceKeyPointer": "/name"
      },
      {
        "nodeId": "6e04cbc1-1e9b-4044-8958-22e8f05e8dde",
        "type": "string",
        "title": "Interface Type",
        "description": "",
        "placeholder": "",
        "required": true,
        "enum": [
          {
            "id": "4cfc85f2-385f-4387-8bb2-26655294d286",
            "value": "GigabitEthernet"
          },
          {
            "id": "d9b091c4-e907-4a8c-89e8-0d5df7de39e7",
            "value": "TenGigE"
          },
          {
            "id": "605fee54-8a66-402a-852b-d979ec68a0ac",
            "value": "FortyGigE"
          },
          {
            "id": "6b2c094f-db28-46fb-aaf0-7fdfe4d7adae",
            "value": "HundredGigE"
          }
        ],
        "binding": false,
        "rel": "collection",
        "targetPointer": "/enum"
      },
      {
        "nodeId": "4e0bf3ec-edad-4833-8dfa-3966a6d88be3",
        "type": "string",
        "title": "Interface ID",
        "description": "Ex. 3",
        "placeholder": "",
        "required": true,
        "pattern": "\\d+"
      },
      {
        "nodeId": "226de150-f957-469e-9cc0-d5fbb01fe534",
        "type": "string",
        "title": "IP Address",
        "description": "Ex. 192.168.0.1",
        "placeholder": "",
        "required": true,
        "pattern": "^([0-9]{1,3})\\.([0-9]{1,3})\\.([0-9]{1,3})\\.([0-9]{1,3})$"
      },
      {
        "nodeId": "fba247e3-bca3-4b4b-ae52-ade9ce714723",
        "type": "string",
        "title": "Subnet Mask",
        "description": "Ex. 255.255.255.0",
        "placeholder": "",
        "required": true,
        "pattern": "^([0-9]{1,3})\\.([0-9]{1,3})\\.([0-9]{1,3})\\.([0-9]{1,3})$"
      },
      {
        "nodeId": "2e5ec318-c217-49ec-9a9f-6f5efe1c9180",
        "type": "string",
        "title": "Description",
        "description": "",
        "placeholder": "",
        "required": true
      },
      {
        "nodeId": "9365802f-1622-4bb8-81c5-447beb9bce95",
        "type": "boolean",
        "title": "Shutdown",
        "description": "",
        "default": false
      }
    ]
  },
  "schema": {
    "title": "IAP Artifacts Port Turn Up JSON Form",
    "description": "A form to select a device, interface type and description to be turned up ",
    "type": "object",
    "required": [
      "device",
      "interfaceType",
      "interfaceId",
      "ipAddress",
      "subnetMask",
      "description"
    ],
    "properties": {
      "zeroTouch": {
        "type": "boolean",
        "title": "Zero Touch",
        "description": "Zero touch will skip all manual task for a happy path.",
        "default": true
      },
      "device": {
        "type": "string",
        "title": "Device",
        "description": "The following drop down is queried by the device broker and should reflect devices on NSO and Ansible",
        "enum": []
      },
      "interfaceType": {
        "type": "string",
        "title": "Interface Type",
        "description": "",
        "enum": [
          "GigabitEthernet",
          "TenGigE",
          "FortyGigE",
          "HundredGigE"
        ]
      },
      "interfaceId": {
        "type": "string",
        "title": "Interface ID",
        "description": "Ex. 3",
        "pattern": "\\d+"
      },
      "ipAddress": {
        "type": "string",
        "title": "IP Address",
        "description": "Ex. 192.168.0.1",
        "pattern": "^([0-9]{1,3})\\.([0-9]{1,3})\\.([0-9]{1,3})\\.([0-9]{1,3})$"
      },
      "subnetMask": {
        "type": "string",
        "title": "Subnet Mask",
        "description": "Ex. 255.255.255.0",
        "pattern": "^([0-9]{1,3})\\.([0-9]{1,3})\\.([0-9]{1,3})\\.([0-9]{1,3})$"
      },
      "description": {
        "type": "string",
        "title": "Description",
        "description": ""
      },
      "shutdown": {
        "type": "boolean",
        "title": "Shutdown",
        "description": "",
        "default": false
      }
    }
  },
  "uiSchema": {
    "device": {
      "ui:placeholder": "Select a device to turn up a port on "
    }
  },
  "bindingSchema": {
    "properties": {
      "device": {
        "binding:method": "POST",
        "binding:link": {
          "$ref": "/links",
          "rel": "collection"
        },
        "binding:body": {
          "options": {
            "start": 0,
            "limit": 50,
            "order": "ascending",
            "sort": [
              {
                "name": 1
              }
            ],
            "filter": {
              "name": ""
            }
          }
        },
        "binding:source": {
          "propertyPointer": "/list",
          "keyPointer": "/name"
        },
        "binding:target": {
          "propertyPointer": "/enum"
        },
        "binding:hyperSchema": {
          "type": "object",
          "base": "/",
          "links": [
            {
              "rel": "collection",
              "href": "configuration_manager/devices",
              "targetMediaType": "application/json",
              "targetSchema": {
                "$ref": "#"
              }
            }
          ]
        }
      }
    }
  },
  "validationSchema": {}
}