{
  "metadata": {
    "name": "@itentialopensource/ansible-port-turn-up",
    "version": "0.0.9",
    "description": "[Deprecated] Ansible Port Turn Up",
    "license": "Apache-2.0",
    "repository": {
      "type": "gitlab",
      "hostname": "gitlab.com",
      "path": "itentialopensource/pre-built-automations"
    },
    "keywords": [
      "Itential",
      "IAP",
      "artifacts"
    ],
    "author": "Itential Artifacts",
    "IAPDependencies": {
      "@itential/app-automation_catalog": "",
      "@itential/app-json_forms": "",
      "@itential/app-workflow_engine": "",
      "@itential/app-mop": ""
    },
    "gitlabId": 23518072
  },
  "manifest": {
    "bundleName": "Ansible Port Turn Up",
    "fingerprint": "5ff71225f5cdda3c3644bcb7",
    "createdEpoch": "1610027557339",
    "artifacts": [
      {
        "id": "IAP Artifacts Port Turn Up Ansible",
        "name": "IAP Artifacts Port Turn Up Ansible",
        "type": "automation",
        "location": "/bundles/automations/ IAP Artifacts Port Turn Up Ansible.json",
        "properties": {
          "entryPoint": false
        }
      },
      {
        "id": " IAP Artifacts Port Turn Up Ansible Deployment",
        "name": " IAP Artifacts Port Turn Up Ansible Deployment",
        "type": "workflow",
        "location": "/bundles/workflows/ IAP Artifacts Port Turn Up Ansible Deployment.json",
        "properties": {
          "entryPoint": false
        }
      },
      {
        "id": " IAP Artifacts Port Turn Up Ansible",
        "name": " IAP Artifacts Port Turn Up Ansible",
        "type": "workflow",
        "location": "/bundles/workflows/ IAP Artifacts Port Turn Up Ansible.json",
        "properties": {
          "entryPoint": false
        }
      },
      {
        "id": "IAP Artifacts Port Turn Up JSON Form",
        "name": "IAP Artifacts Port Turn Up JSON Form",
        "type": "json-forms",
        "location": "/bundles/json_forms/IAP Artifacts Port Turn Up JSON Form.json",
        "properties": {
          "entryPoint": false
        }
      },
      {
        "id": "IAP-Artifacts Port Turn Up Pre-Check",
        "name": "IAP-Artifacts Port Turn Up Pre-Check",
        "type": "mop-template",
        "location": "/bundles/mop_templates/IAP-Artifacts Port Turn Up Pre-Check.json",
        "properties": {
          "entryPoint": false
        }
      },
      {
        "id": "IAP-Artifacts Port Turn Up Post-Check",
        "name": "IAP-Artifacts Port Turn Up Post-Check",
        "type": "mop-template",
        "location": "/bundles/mop_templates/IAP-Artifacts Port Turn Up Post-Check.json",
        "properties": {
          "entryPoint": false
        }
      },
      {
        "id": "5ff618335274463c14141c53",
        "name": "VariablesData",
        "type": "transformation",
        "location": "/bundles/transformations/VariablesData.json",
        "properties": {
          "entryPoint": false
        }
      }
    ]
  },
  "bundles": [
    {
      "type": "automation",
      "data": {
        "_id": "6476332017e2740109edaa57",
        "name": "IAP Artifacts Port Turn Up Ansible",
        "description": "",
        "componentName": " IAP Artifacts Port Turn Up Ansible Deployment",
        "componentType": "workflows",
        "gbac": {
          "write": [],
          "read": []
        },
        "created": "2023-05-30T17:32:16.327Z",
        "createdBy": "admin@pronghorn",
        "lastUpdated": "2023-05-30T17:35:40.131Z",
        "lastUpdatedBy": "admin@pronghorn",
        "triggers": [
          {
            "_id": "647633c717e2740109edaa58",
            "created": "2023-05-30T17:35:03.923Z",
            "createdBy": "admin@pronghorn",
            "lastUpdated": "2023-05-30T17:35:03.923Z",
            "lastUpdatedBy": "admin@pronghorn",
            "name": "Manual",
            "type": "manual",
            "enabled": true,
            "actionType": "automations",
            "actionId": "6476332017e2740109edaa57",
            "description": "",
            "formId": "IAP Artifacts Port Turn Up JSON Form",
            "formData": {
              "zeroTouch": true,
              "shutdown": false,
              "interfaceType": "GigabitEthernet",
              "interfaceId": "2",
              "ipAddress": "192.168.100.100",
              "subnetMask": "255.255.255.0",
              "description": "Example description from Itential Port Turn Up Artifact"
            },
            "formSchemaHash": "32c8cf6840a35623a54d96ce6540f34a3f049958d4516be860203bd44f73e050",
            "migrationVersion": 2
          }
        ]
      }
    },
    {
      "type": "workflow",
      "data": {
        "name": " IAP Artifacts Port Turn Up Ansible Deployment",
        "tasks": {
          "620": {
            "name": "ViewData",
            "summary": "In valid device",
            "description": "In valid device",
            "location": "Application",
            "app": "WorkFlowEngine",
            "displayName": "Tools",
            "type": "manual",
            "variables": {
              "incoming": {
                "header": "In valid device",
                "message": "The device select is not a device in the ansible inventory.",
                "body": "Click Revert to return to form.\nClick End to end the workflow",
                "btn_success": "Revert",
                "btn_failure": "End"
              },
              "outgoing": {},
              "error": ""
            },
            "view": "/workflow_engine/task/ViewData",
            "deprecated": false,
            "matched": [
              {
                "key": "name",
                "highlightString": "<span class='highlight-string'>ViewDa</span>ta"
              }
            ],
            "groups": [],
            "x": -0.883453237410072,
            "y": -0.19250780437044746,
            "scheduled": false
          },
          "2384": {
            "name": "newVariable",
            "summary": "Create a Job Variable",
            "description": "Create a new Job variable by Job ID and assign it a value.",
            "location": "Application",
            "locationType": null,
            "app": "WorkFlowEngine",
            "displayName": "WorkFlowEngine",
            "type": "operation",
            "variables": {
              "incoming": {
                "name": "variables",
                "value": "$var.d88d.result"
              },
              "outgoing": {
                "value": null
              }
            },
            "deprecated": false,
            "matched": [
              {
                "key": "summary",
                "highlightString": "Create a <span class='highlight-string'>Job</span> <span class='highlight-string'>Va</span>riable"
              },
              {
                "key": "description",
                "highlightString": "Create a new <span class='highlight-string'>Job</span> <span class='highlight-string'>va</span>riable by Job ID and assign it a value."
              },
              {
                "key": "name",
                "highlightString": "new<span class='highlight-string'>Va</span>riable"
              }
            ],
            "groups": [],
            "x": -1.2539568345323742,
            "y": 0.5494276795005203
          },
          "7204": {
            "name": "objectHasOwnProperty",
            "summary": "Is Ansible",
            "description": "",
            "location": "Application",
            "locationType": null,
            "app": "WorkFlowEngine",
            "displayName": "Object",
            "type": "automatic",
            "variables": {
              "incoming": {
                "obj": "$var.185b.device",
                "prop": "ned"
              },
              "outgoing": {
                "result": null
              },
              "error": ""
            },
            "deprecated": false,
            "matched": [
              {
                "key": "name",
                "highlightString": "<span class='highlight-string'>hasOwn</span>Property"
              }
            ],
            "groups": [],
            "actor": "Pronghorn",
            "x": -0.9639107611548556,
            "y": 0.6748466257668712,
            "scheduled": false,
            "canvasName": "hasOwnProperty"
          },
          "workflow_start": {
            "name": "workflow_start",
            "groups": [],
            "x": -1.541726618705036,
            "y": 0.5567117585848075
          },
          "workflow_end": {
            "name": "workflow_end",
            "groups": [],
            "x": 0.22965879265091863,
            "y": 0.5447852760736196
          },
          "98e8": {
            "name": "runTemplatesDiff",
            "summary": "Pre/Post Compare",
            "description": "Compare the pre-checks against the post-checks",
            "app": "MOP",
            "displayName": "MOP",
            "type": "manual",
            "variables": {
              "incoming": {
                "pre": "$var.18fb.mop_template_results",
                "post": "$var.b200.mop_template_results"
              },
              "outgoing": {},
              "error": ""
            },
            "view": "/mop/task/runTemplatesDiff",
            "deprecated": false,
            "groups": [],
            "x": 0.009019165727170236,
            "y": 0.21226993865030674,
            "scheduled": false
          },
          "3cf1": {
            "name": "decisionTask",
            "summary": "Retry or Abort",
            "description": "Post-Check Failure, Retry or Abort",
            "app": "MOP",
            "displayName": "MOP",
            "type": "manual",
            "variables": {
              "incoming": {
                "title": "Post-Check Failure Decision",
                "body": "The Post-Check has <b>failed</b>!   Please take corrective action.\n<br>\nClick <b>Abort</b> to end the workflow.\nClick <b>Retry</b> to re-run post check.",
                "variables": "",
                "btn_success": "Retry",
                "btn_failure": "Abort"
              },
              "outgoing": {},
              "error": ""
            },
            "view": "/mop/task/decisionTask",
            "deprecated": false,
            "groups": [],
            "x": -0.11555806087936867,
            "y": -0.014723926380368098,
            "scheduled": false
          },
          "b24d": {
            "name": "viewTemplateResults",
            "summary": "Post-Check Failure",
            "description": "The post-check has failed, review the results.",
            "app": "MOP",
            "displayName": "MOP",
            "type": "manual",
            "variables": {
              "incoming": {
                "mop_template_results": "$var.b200.mop_template_results"
              },
              "outgoing": {},
              "error": ""
            },
            "view": "/mop/task/viewTemplateResults",
            "deprecated": false,
            "groups": [],
            "x": -0.24182638105975196,
            "y": 0.20736196319018405,
            "scheduled": false
          },
          "56a": {
            "name": "decisionTask",
            "summary": "Change Input or Abort",
            "description": "Port Turn Up Child Job Failed, Revert or Abort",
            "app": "MOP",
            "displayName": "MOP",
            "type": "manual",
            "variables": {
              "incoming": {
                "title": "Provisioning Failure",
                "body": "The Port Turn Up network provisioning has <b>failed</b>!   Please take corrective action.\n<br>\n<br>\n<b>Revert (Change Input)</b> or <b>Abort</b> the Job",
                "variables": "",
                "btn_success": "Revert - Change Input",
                "btn_failure": "Abort"
              },
              "outgoing": {},
              "error": ""
            },
            "view": "/mop/task/decisionTask",
            "deprecated": false,
            "groups": [],
            "x": -0.41882750845546785,
            "y": 0.21104294478527608,
            "scheduled": false
          },
          "185b": {
            "name": "getDevice",
            "summary": "Get Device Details",
            "description": "Get detailed information for a specific device, based on its device name",
            "location": "Application",
            "locationType": null,
            "app": "ConfigurationManager",
            "displayName": "ConfigurationManager",
            "type": "automatic",
            "variables": {
              "incoming": {
                "name": "$var.job.device"
              },
              "outgoing": {
                "device": null
              },
              "error": ""
            },
            "deprecated": false,
            "matched": [
              {
                "key": "name",
                "highlightString": "<span class='highlight-string'>getDevice</span>"
              }
            ],
            "groups": [],
            "actor": "Pronghorn",
            "x": -1.0482866043613708,
            "y": 0.5550724637681159,
            "scheduled": false
          },
          "46b9": {
            "name": "query",
            "summary": "Get device's host-id",
            "description": "query the subnet network IP",
            "location": "Application",
            "locationType": null,
            "app": "WorkFlowEngine",
            "displayName": "WorkFlowEngine",
            "type": "operation",
            "variables": {
              "incoming": {
                "pass_on_null": false,
                "query": "host",
                "obj": "$var.185b.device"
              },
              "outgoing": {
                "return_data": "$var.job.host"
              },
              "error": ""
            },
            "deprecated": false,
            "matched": [
              {
                "key": "name",
                "highlightString": "<span class='highlight-string'>query</span>"
              },
              {
                "key": "summary",
                "highlightString": "<span class='highlight-string'>Query</span> Data Using 'json-query' Format"
              },
              {
                "key": "description",
                "highlightString": "<span class='highlight-string'>Query</span> data using a dot/bracket notation string and a matching key/value pair."
              }
            ],
            "groups": [],
            "x": -0.9730971128608924,
            "y": 0.4441717791411043,
            "scheduled": false
          },
          "49f9": {
            "name": "ViewData",
            "summary": "No device",
            "description": "",
            "location": "Application",
            "app": "WorkFlowEngine",
            "displayName": "Tools",
            "type": "manual",
            "variables": {
              "incoming": {
                "header": "No device",
                "message": "Device information could not be retrieved.",
                "body": "Press <b>Retry</b> to fill the form again, or <b>Terminate</b> to exit the workflow",
                "btn_success": "Retry",
                "btn_failure": "Terminate"
              },
              "outgoing": {},
              "error": ""
            },
            "view": "/workflow_engine/task/ViewData",
            "deprecated": false,
            "matched": [],
            "groups": [],
            "x": -1.014388489208633,
            "y": 0.17793964620187305,
            "scheduled": false
          },
          "1dc9": {
            "name": "stub",
            "summary": "Exit",
            "description": "Create a stub for an automated task",
            "location": "Application",
            "locationType": null,
            "app": "WorkFlowEngine",
            "displayName": "Tools",
            "type": "automatic",
            "variables": {
              "incoming": {
                "type": "success",
                "delay": 0,
                "response": "exit"
              },
              "outgoing": {
                "response": null
              },
              "error": ""
            },
            "deprecated": false,
            "matched": [
              {
                "key": "name",
                "highlightString": "<span class='highlight-string'>stub</span>"
              },
              {
                "key": "summary",
                "highlightString": "<span class='highlight-string'>Stub</span>"
              },
              {
                "key": "description",
                "highlightString": "Create a <span class='highlight-string'>stub</span> for an automated task"
              }
            ],
            "groups": [],
            "actor": "Pronghorn",
            "x": 0.21589627959413754,
            "y": -0.44785276073619634,
            "scheduled": false
          },
          "e7fb": {
            "name": "viewTemplateResults",
            "summary": "View MOP Template Results",
            "description": "View MOP Template Results",
            "location": "Application",
            "app": "MOP",
            "displayName": "Command Templates",
            "type": "manual",
            "variables": {
              "incoming": {
                "mop_template_results": "$var.18fb.mop_template_results"
              },
              "outgoing": {},
              "error": ""
            },
            "view": "/mop/task/viewTemplateResults",
            "deprecated": false,
            "matched": [
              {
                "key": "name",
                "highlightString": "<span class='highlight-string'>viewTem</span>plateResults"
              }
            ],
            "groups": [],
            "x": -0.7510791366906475,
            "y": -0.07075962539021852,
            "scheduled": false
          },
          "bbdd": {
            "name": "ViewData",
            "summary": "Pre-Check Failure Decision",
            "description": "Pre-Check Failure Decision",
            "location": "Application",
            "app": "WorkFlowEngine",
            "displayName": "Tools",
            "type": "manual",
            "variables": {
              "incoming": {
                "header": "Pre-Check Failure Decision",
                "message": "The Pre-Check has <b>failed</b>!",
                "body": "Please take corrective action.\n<br>\n<br>\n<b>Retry</b> Pre-checks or <b>Ignore</b> the failure",
                "btn_success": "Retry",
                "btn_failure": "Ignore"
              },
              "outgoing": {},
              "error": ""
            },
            "view": "/workflow_engine/task/ViewData",
            "deprecated": false,
            "matched": [
              {
                "key": "name",
                "highlightString": "<span class='highlight-string'>ViewDa</span>ta"
              }
            ],
            "groups": [],
            "x": -0.6230215827338129,
            "y": 0.12695109261186263,
            "scheduled": false
          },
          "85b1": {
            "name": "ViewData",
            "summary": "Pre-Check Failure Ignored",
            "description": "Pre-Check Failure Decision",
            "location": "Application",
            "app": "WorkFlowEngine",
            "displayName": "Tools",
            "type": "manual",
            "variables": {
              "incoming": {
                "header": "Pre-Check Failure Ignored",
                "message": "The Pre-Check failure is ignored",
                "body": "Please choose action.\n<br>\n<br>\n<b>Continue</b> or <b>Terminate</b> workflow",
                "btn_success": "Continue",
                "btn_failure": "Terminate"
              },
              "outgoing": {},
              "error": ""
            },
            "view": "/workflow_engine/task/ViewData",
            "deprecated": false,
            "matched": [
              {
                "key": "name",
                "highlightString": "<span class='highlight-string'>ViewDa</span>ta"
              }
            ],
            "groups": [],
            "x": -0.564748201438849,
            "y": -0.14984391259105098,
            "scheduled": false
          },
          "7ace": {
            "name": "ShowJsonForm",
            "summary": "Show Json Form",
            "description": "Show Json Form",
            "location": "Application",
            "app": "JsonForms",
            "displayName": "JsonForms",
            "type": "manual",
            "variables": {
              "incoming": {
                "form_id": "IAP Artifacts Port Turn Up JSON Form",
                "instance_data": "$var.job.formData"
              },
              "outgoing": {
                "export": "$var.job.formData"
              },
              "error": ""
            },
            "view": "/json-forms/task/ShowJsonForm",
            "deprecated": false,
            "matched": [
              {
                "key": "name",
                "highlightString": "<span class='highlight-string'>Show</span>Json<span class='highlight-string'>Form</span>"
              },
              {
                "key": "summary",
                "highlightString": "<span class='highlight-string'>Show</span> Json <span class='highlight-string'>Form</span>"
              },
              {
                "key": "description",
                "highlightString": "<span class='highlight-string'>Show</span> Json <span class='highlight-string'>Form</span>"
              },
              {
                "key": "app",
                "highlightString": "Json<span class='highlight-string'>Form</span>s"
              }
            ],
            "groups": [],
            "x": -1.2553956834532374,
            "y": -0.14672216441207075,
            "scheduled": false
          },
          "743e": {
            "name": "evaluation",
            "summary": "Zero Touch Eval",
            "description": "Run an evaluation for zero touch",
            "location": "Application",
            "locationType": null,
            "app": "WorkFlowEngine",
            "displayName": "WorkFlowEngine",
            "type": "operation",
            "variables": {
              "incoming": {
                "all_true_flag": true,
                "evaluation_groups": [
                  {
                    "all_true_flag": true,
                    "evaluations": [
                      {
                        "query": "zeroTouch",
                        "operand_1": {
                          "variable": "formData",
                          "task": "job"
                        },
                        "operator": "==",
                        "operand_2": {
                          "variable": true,
                          "task": "static"
                        }
                      }
                    ]
                  }
                ]
              },
              "outgoing": {
                "return_value": null
              }
            },
            "deprecated": false,
            "matched": [
              {
                "key": "name",
                "highlightString": "<span class='highlight-string'>eval</span>uation"
              },
              {
                "key": "summary",
                "highlightString": "Run <span class='highlight-string'>Eval</span>uation Task"
              },
              {
                "key": "description",
                "highlightString": "Run an <span class='highlight-string'>eval</span>uation"
              }
            ],
            "groups": [],
            "x": -0.7244094488188977,
            "y": 0.5190184049079755
          },
          "7fd4": {
            "name": "evaluation",
            "canvasName": "evaluation",
            "summary": "Is the device NSO",
            "description": "Run an evaluation",
            "location": "Application",
            "locationType": null,
            "app": "WorkFlowEngine",
            "type": "operation",
            "displayName": "WorkFlowEngine",
            "variables": {
              "incoming": {
                "all_true_flag": false,
                "evaluation_groups": [
                  {
                    "all_true_flag": false,
                    "evaluations": [
                      {
                        "query": "",
                        "operand_1": {
                          "variable": "result",
                          "task": "7204"
                        },
                        "operator": "==",
                        "operand_2": {
                          "variable": true,
                          "task": "static"
                        }
                      }
                    ]
                  }
                ]
              },
              "outgoing": {
                "return_value": null
              }
            },
            "deprecated": false,
            "matched": [
              {
                "key": "canvasName",
                "highlightString": "<span class='highlight-string'>eva</span>luation"
              },
              {
                "key": "summary",
                "highlightString": "Run <span class='highlight-string'>Eva</span>luation Task"
              },
              {
                "key": "description",
                "highlightString": "Run an <span class='highlight-string'>eva</span>luation"
              }
            ],
            "groups": [],
            "x": -0.8992080633549316,
            "y": 0.5213319458896982
          },
          "18fb": {
            "name": "RunCommandTemplate",
            "canvasName": "RunCommandTemplate",
            "summary": "Run Command Template",
            "description": "Run a Command Template against devices.",
            "location": "Application",
            "locationType": null,
            "app": "MOP",
            "type": "automatic",
            "displayName": "MOP",
            "variables": {
              "incoming": {
                "template": "IAP-Artifacts Port Turn Up Pre-Check",
                "variables": "$var.job.variables",
                "devices": "$var.job.device"
              },
              "outgoing": {
                "mop_template_results": null
              },
              "error": ""
            },
            "deprecated": false,
            "matched": [
              {
                "key": "canvasName",
                "highlightString": "<span class='highlight-string'>Run</span><span class='highlight-string'>Command</span><span class='highlight-string'>Template</span>"
              },
              {
                "key": "summary",
                "highlightString": "<span class='highlight-string'>Run</span> <span class='highlight-string'>Command</span> <span class='highlight-string'>Template</span>"
              },
              {
                "key": "description",
                "highlightString": "<span class='highlight-string'>Run</span> a <span class='highlight-string'>Command</span> <span class='highlight-string'>Template</span> against devices."
              }
            ],
            "groups": [],
            "actor": "Pronghorn",
            "x": -0.8099352051835853,
            "y": 0.518210197710718,
            "scheduled": false
          },
          "6dcf": {
            "name": "evaluation",
            "canvasName": "evaluation",
            "summary": "PreCheck Eval",
            "description": "Run an evaluation",
            "location": "Application",
            "locationType": null,
            "app": "WorkFlowEngine",
            "type": "operation",
            "displayName": "WorkFlowEngine",
            "variables": {
              "incoming": {
                "all_true_flag": false,
                "evaluation_groups": [
                  {
                    "all_true_flag": false,
                    "evaluations": [
                      {
                        "query": "result",
                        "operand_1": {
                          "variable": "mop_template_results",
                          "task": "18fb"
                        },
                        "operator": "==",
                        "operand_2": {
                          "variable": true,
                          "task": "static"
                        }
                      }
                    ]
                  }
                ]
              },
              "outgoing": {
                "return_value": null
              }
            },
            "deprecated": false,
            "matched": [
              {
                "key": "canvasName",
                "highlightString": "<span class='highlight-string'>eval</span>uation"
              },
              {
                "key": "summary",
                "highlightString": "Run <span class='highlight-string'>Eval</span>uation Task"
              },
              {
                "key": "description",
                "highlightString": "Run an <span class='highlight-string'>eval</span>uation"
              }
            ],
            "groups": [],
            "x": -0.6580273578113751,
            "y": 0.5161290322580645
          },
          "51e8": {
            "name": "childJob",
            "canvasName": "childJob",
            "summary": "Provision Port Turn Up - Ansible",
            "description": "Ansible logic",
            "location": "Application",
            "locationType": null,
            "app": "WorkFlowEngine",
            "type": "operation",
            "displayName": "WorkFlowEngine",
            "variables": {
              "incoming": {
                "task": "",
                "workflow": " IAP Artifacts Port Turn Up Ansible",
                "variables": {
                  "variables": {
                    "variable": "",
                    "task": "job",
                    "value": "variables"
                  },
                  "deviceName": {
                    "variable": "",
                    "task": "job",
                    "value": "device"
                  },
                  "adapter_id": {
                    "variable": "",
                    "task": "job",
                    "value": "adapter"
                  }
                },
                "data_array": "",
                "transformation": "",
                "loopType": ""
              },
              "outgoing": {
                "job_details": null
              }
            },
            "deprecated": false,
            "matched": [
              {
                "key": "canvasName",
                "highlightString": "<span class='highlight-string'>childJob</span>"
              }
            ],
            "groups": [],
            "actor": "job",
            "x": -0.5377969762419006,
            "y": 0.522372528616025
          },
          "e48d": {
            "name": "evaluation",
            "canvasName": "evaluation",
            "summary": "Evaluation",
            "description": "Run an evaluation",
            "location": "Application",
            "locationType": null,
            "app": "WorkFlowEngine",
            "type": "operation",
            "displayName": "WorkFlowEngine",
            "variables": {
              "incoming": {
                "all_true_flag": false,
                "evaluation_groups": [
                  {
                    "all_true_flag": false,
                    "evaluations": [
                      {
                        "query": "outcome",
                        "operand_1": {
                          "variable": "job_details",
                          "task": "51e8"
                        },
                        "operator": "==",
                        "operand_2": {
                          "variable": "success",
                          "task": "static"
                        }
                      }
                    ]
                  }
                ]
              },
              "outgoing": {
                "return_value": null
              }
            },
            "deprecated": false,
            "matched": [
              {
                "key": "canvasName",
                "highlightString": "<span class='highlight-string'>eval</span>uation"
              },
              {
                "key": "summary",
                "highlightString": "Run <span class='highlight-string'>Eval</span>uation Task"
              },
              {
                "key": "description",
                "highlightString": "Run an <span class='highlight-string'>eval</span>uation"
              }
            ],
            "groups": [],
            "x": -0.42836573074154066,
            "y": 0.5256270447110142
          },
          "795d": {
            "name": "evaluation",
            "canvasName": "evaluation",
            "summary": "Run Evaluation Task",
            "description": "Run an evaluation",
            "location": "Application",
            "locationType": null,
            "app": "WorkFlowEngine",
            "type": "operation",
            "displayName": "WorkFlowEngine",
            "variables": {
              "incoming": {
                "all_true_flag": false,
                "evaluation_groups": [
                  {
                    "all_true_flag": false,
                    "evaluations": [
                      {
                        "query": "result",
                        "operand_1": {
                          "variable": "mop_template_results",
                          "task": "b200"
                        },
                        "operator": "==",
                        "operand_2": {
                          "variable": true,
                          "task": "static"
                        }
                      }
                    ]
                  }
                ]
              },
              "outgoing": {
                "return_value": null
              }
            },
            "deprecated": false,
            "matched": [
              {
                "key": "canvasName",
                "highlightString": "<span class='highlight-string'>eval</span>uation"
              },
              {
                "key": "summary",
                "highlightString": "Run <span class='highlight-string'>Eval</span>uation Task"
              },
              {
                "key": "description",
                "highlightString": "Run an <span class='highlight-string'>eval</span>uation"
              }
            ],
            "groups": [],
            "x": -0.11303095752339813,
            "y": 0.20174482006543076
          },
          "1ed8": {
            "name": "evaluation",
            "canvasName": "evaluation",
            "summary": "Run Evaluation Task",
            "description": "Run an evaluation",
            "location": "Application",
            "locationType": null,
            "app": "WorkFlowEngine",
            "type": "operation",
            "displayName": "WorkFlowEngine",
            "variables": {
              "incoming": {
                "all_true_flag": false,
                "evaluation_groups": [
                  {
                    "all_true_flag": false,
                    "evaluations": [
                      {
                        "query": "zeroTouch",
                        "operand_1": {
                          "variable": "formData",
                          "task": "job"
                        },
                        "operator": "==",
                        "operand_2": {
                          "variable": true,
                          "task": "static"
                        }
                      }
                    ]
                  }
                ]
              },
              "outgoing": {
                "return_value": null
              }
            },
            "deprecated": false,
            "matched": [
              {
                "key": "canvasName",
                "highlightString": "<span class='highlight-string'>eval</span>uation"
              },
              {
                "key": "summary",
                "highlightString": "Run <span class='highlight-string'>Eval</span>uation Task"
              },
              {
                "key": "description",
                "highlightString": "Run an <span class='highlight-string'>eval</span>uation"
              }
            ],
            "groups": [],
            "x": -0.22318214542836573,
            "y": 0.5158124318429662
          },
          "b200": {
            "name": "RunCommandTemplate",
            "canvasName": "RunCommandTemplate",
            "summary": "Post-Check",
            "description": "Run a Command Template against devices.",
            "location": "Application",
            "locationType": null,
            "app": "MOP",
            "type": "automatic",
            "displayName": "MOP",
            "variables": {
              "incoming": {
                "template": "IAP-Artifacts Port Turn Up Post-Check",
                "variables": "$var.job.variables",
                "devices": "$var.job.device"
              },
              "outgoing": {
                "mop_template_results": null
              },
              "error": ""
            },
            "deprecated": false,
            "matched": [
              {
                "key": "canvasName",
                "highlightString": "<span class='highlight-string'>RunCommandTemplate</span>"
              }
            ],
            "groups": [],
            "actor": "Pronghorn",
            "x": -0.3326133909287257,
            "y": 0.5332606324972737,
            "scheduled": false
          },
          "c19f": {
            "name": "newVariable",
            "canvasName": "newVariable",
            "summary": "Create a Job Variable",
            "description": "Create a new Job variable by Job ID and assign it a value.",
            "location": "Application",
            "locationType": null,
            "app": "WorkFlowEngine",
            "type": "operation",
            "displayName": "WorkFlowEngine",
            "variables": {
              "incoming": {
                "name": "adapter",
                "value": "DSUP IAG-2020.1"
              },
              "outgoing": {
                "value": null
              }
            },
            "deprecated": false,
            "matched": [
              {
                "key": "canvasName",
                "highlightString": "<span class='highlight-string'>new</span>Variable"
              },
              {
                "key": "description",
                "highlightString": "Create a <span class='highlight-string'>new</span> <span class='highlight-string'>Job</span> variable by Job ID and assign it a value."
              },
              {
                "key": "summary",
                "highlightString": "Create a <span class='highlight-string'>Job</span> Variable"
              }
            ],
            "groups": [],
            "x": -1.418705035971223,
            "y": 0.5535900104058272
          },
          "d88d": {
            "name": "transformation",
            "canvasName": "transformation",
            "summary": "JSON Transformation",
            "description": "Perform a JSON Transformation using the JST library.",
            "location": "Application",
            "locationType": null,
            "app": "WorkFlowEngine",
            "type": "operation",
            "displayName": "WorkFlowEngine",
            "variables": {
              "incoming": {
                "tr_id": "5ff618335274463c14141c53",
                "variableMap": {
                  "formData": "$var.job.formData"
                },
                "options": {
                  "extractOutput": true
                }
              },
              "outgoing": {
                "result": null
              }
            },
            "deprecated": false,
            "matched": [
              {
                "key": "description",
                "highlightString": "Perform a JSON Transformation using the <span class='highlight-string'>JST</span> library."
              }
            ],
            "groups": [],
            "x": -1.3402877697841726,
            "y": 0.5556711758584808,
            "task_name": "VariablesData"
          },
          "6a0e": {
            "name": "query",
            "canvasName": "query",
            "summary": "Query Data Using 'json-query' Format",
            "description": "Query data using a dot/bracket notation string and a matching key/value pair.",
            "location": "Application",
            "locationType": null,
            "app": "WorkFlowEngine",
            "type": "operation",
            "displayName": "WorkFlowEngine",
            "variables": {
              "incoming": {
                "pass_on_null": false,
                "query": "device",
                "obj": "$var.d88d.result"
              },
              "outgoing": {
                "return_data": "$var.job.device"
              },
              "error": ""
            },
            "deprecated": false,
            "matched": [
              {
                "key": "canvasName",
                "highlightString": "<span class='highlight-string'>query</span>"
              },
              {
                "key": "summary",
                "highlightString": "<span class='highlight-string'>Query</span> Data Using 'json-query' Format"
              },
              {
                "key": "description",
                "highlightString": "<span class='highlight-string'>Query</span> data using a dot/bracket notation string and a matching key/value pair."
              }
            ],
            "groups": [],
            "x": -1.1510791366906474,
            "y": 0.5515088449531738,
            "scheduled": false
          }
        },
        "transitions": {
          "321": {},
          "620": {
            "1dc9": {
              "type": "standard",
              "state": "failure"
            },
            "7ace": {
              "type": "standard",
              "state": "success"
            }
          },
          "2384": {
            "6a0e": {
              "type": "standard",
              "state": "success"
            }
          },
          "7204": {
            "7fd4": {
              "type": "standard",
              "state": "success"
            }
          },
          "7735": {},
          "8333": {},
          "workflow_start": {
            "c19f": {
              "type": "standard",
              "state": "success"
            }
          },
          "workflow_end": {},
          "324e": {},
          "3a81": {},
          "5c61": {},
          "94c2": {},
          "98e8": {
            "workflow_end": {
              "type": "standard",
              "state": "success"
            }
          },
          "d711": {},
          "47a9": {},
          "26d": {},
          "87a7": {},
          "3cf1": {
            "1dc9": {
              "type": "standard",
              "state": "failure"
            },
            "b200": {
              "type": "revert",
              "state": "success"
            }
          },
          "b24d": {
            "795d": {
              "type": "standard",
              "state": "success"
            }
          },
          "f20d": {},
          "3f1b": {},
          "56a": {
            "1dc9": {
              "type": "standard",
              "state": "failure"
            }
          },
          "b004": {},
          "185b": {
            "7204": {
              "type": "standard",
              "state": "success"
            },
            "46b9": {
              "type": "standard",
              "state": "success"
            },
            "49f9": {
              "type": "standard",
              "state": "error"
            }
          },
          "46b9": {
            "7fd4": {
              "type": "standard",
              "state": "success"
            }
          },
          "fe6d": {},
          "49f9": {
            "1dc9": {
              "type": "standard",
              "state": "failure"
            },
            "7ace": {
              "type": "standard",
              "state": "success"
            }
          },
          "1dc9": {
            "workflow_end": {
              "type": "standard",
              "state": "success"
            }
          },
          "e7fb": {
            "7ace": {
              "type": "standard",
              "state": "failure"
            },
            "6dcf": {
              "type": "standard",
              "state": "success"
            }
          },
          "bbdd": {
            "85b1": {
              "type": "standard",
              "state": "failure"
            },
            "18fb": {
              "type": "revert",
              "state": "success"
            }
          },
          "85b1": {
            "1dc9": {
              "type": "standard",
              "state": "failure"
            },
            "51e8": {
              "type": "standard",
              "state": "success"
            }
          },
          "7ace": {
            "c19f": {
              "type": "revert",
              "state": "success"
            }
          },
          "743e": {
            "e7fb": {
              "type": "standard",
              "state": "failure"
            },
            "6dcf": {
              "type": "standard",
              "state": "success"
            }
          },
          "7fd4": {
            "620": {
              "type": "standard",
              "state": "success"
            },
            "18fb": {
              "type": "standard",
              "state": "failure"
            }
          },
          "18fb": {
            "743e": {
              "type": "standard",
              "state": "success"
            }
          },
          "6dcf": {
            "bbdd": {
              "type": "standard",
              "state": "failure"
            },
            "51e8": {
              "type": "standard",
              "state": "success"
            }
          },
          "51e8": {
            "e48d": {
              "type": "standard",
              "state": "success"
            }
          },
          "e48d": {
            "56a": {
              "type": "standard",
              "state": "failure"
            },
            "b200": {
              "type": "standard",
              "state": "success"
            }
          },
          "795d": {
            "3cf1": {
              "type": "standard",
              "state": "failure"
            },
            "98e8": {
              "type": "standard",
              "state": "success"
            }
          },
          "1ed8": {
            "workflow_end": {
              "type": "standard",
              "state": "success"
            },
            "b24d": {
              "type": "standard",
              "state": "failure"
            }
          },
          "b200": {
            "1ed8": {
              "type": "standard",
              "state": "success"
            }
          },
          "c19f": {
            "d88d": {
              "type": "standard",
              "state": "success"
            }
          },
          "d88d": {
            "2384": {
              "type": "standard",
              "state": "success"
            }
          },
          "f5cc": {},
          "f20f": {},
          "6a0e": {
            "185b": {
              "type": "standard",
              "state": "success"
            }
          }
        },
        "font_size": 12,
        "created": "2020-03-24T18:15:56.848Z",
        "created_by": {
          "provenance": "Local AAA",
          "username": "admin@pronghorn",
          "firstname": "admin",
          "inactive": true,
          "email": ""
        },
        "createdVersion": "4.5.3-2019.2.9.0",
        "groups": [],
        "last_updated": "2021-01-11T16:04:23.310Z",
        "last_updated_by": {
          "provenance": "local_aaa",
          "username": "admin@pronghorn",
          "firstname": "admin",
          "inactive": false,
          "email": "rahul.chakraborty@itential.com"
        },
        "lastUpdatedVersion": "5.29.14-2020.2.3",
        "type": "automation",
        "description": null,
        "tags": [],
        "inputSchema": {
          "type": "object",
          "properties": {
            "formData": {
              "$id": "formData",
              "type": "object",
              "properties": {
                "zeroTouch": {
                  "type": "boolean",
                  "examples": [
                    true,
                    false
                  ]
                },
                "device": {
                  "type": "string",
                  "examples": [
                    "cisco-ios-catalyst-IAG"
                  ]
                },
                "interfaceType": {
                  "type": "string",
                  "examples": [
                    "GigabitEthernet"
                  ]
                },
                "interfaceId": {
                  "type": "string",
                  "examples": [
                    "3"
                  ]
                },
                "ipAddress": {
                  "type": "string",
                  "examples": [
                    "192.1.1.1"
                  ],
                  "format": "ipv4"
                },
                "subnetMask": {
                  "type": "string",
                  "examples": [
                    "255.255.255.0"
                  ],
                  "format": "ipv4"
                },
                "description": {
                  "type": "string",
                  "examples": [
                    "Test"
                  ]
                },
                "shutdown": {
                  "type": "boolean",
                  "examples": [
                    true,
                    false
                  ]
                }
              },
              "required": []
            }
          },
          "required": [
            "formData"
          ]
        },
        "outputSchema": {
          "type": "object",
          "properties": {
            "formData": {
              "type": [
                "array",
                "boolean",
                "null",
                "number",
                "object",
                "string"
              ]
            },
            "_id": {
              "type": "string",
              "pattern": "^[0-9a-f]{24}$"
            },
            "initiator": {
              "type": "string"
            },
            "variables": {
              "type": [
                "array",
                "boolean",
                "null",
                "number",
                "object",
                "string"
              ]
            },
            "device": {
              "type": [
                "string",
                "number",
                "object",
                "integer",
                "array",
                "boolean",
                "null"
              ],
              "examples": [
                "value"
              ]
            },
            "host": {
              "type": [
                "string",
                "number",
                "object",
                "integer",
                "array",
                "boolean",
                "null"
              ],
              "examples": [
                "value"
              ]
            },
            "adapter": {
              "type": "string"
            }
          }
        }
      }
    },
    {
      "type": "workflow",
      "data": {
        "name": " IAP Artifacts Port Turn Up Ansible",
        "tasks": {
          "workflow_start": {
            "name": "workflow_start",
            "groups": [],
            "x": -0.27619760479041916,
            "y": 0.3217893217893218
          },
          "workflow_end": {
            "name": "workflow_end",
            "groups": [],
            "x": 0.8233264320220842,
            "y": 0.2982810920121335
          },
          "f63c": {
            "name": "evaluation",
            "summary": "check if shutdown",
            "description": "Run an evaluation",
            "location": "Application",
            "locationType": null,
            "app": "WorkFlowEngine",
            "displayName": "WorkFlowEngine",
            "type": "operation",
            "variables": {
              "incoming": {
                "all_true_flag": false,
                "evaluation_groups": [
                  {
                    "all_true_flag": false,
                    "evaluations": [
                      {
                        "query": "shutdown",
                        "operand_1": {
                          "variable": "variables",
                          "task": "job"
                        },
                        "operator": "==",
                        "operand_2": {
                          "variable": true,
                          "task": "static"
                        }
                      }
                    ]
                  }
                ]
              },
              "outgoing": {
                "return_value": null
              }
            },
            "deprecated": false,
            "matched": [
              {
                "key": "name",
                "highlightString": "<span class='highlight-string'>eval</span>uation"
              },
              {
                "key": "summary",
                "highlightString": "Run <span class='highlight-string'>Eval</span>uation Task"
              },
              {
                "key": "description",
                "highlightString": "Run an <span class='highlight-string'>eval</span>uation"
              }
            ],
            "groups": [],
            "x": 0.3604135893648449,
            "y": 0.3375886524822695
          },
          "6dc2": {
            "name": "makeData",
            "canvasName": "makeData",
            "summary": "Make config",
            "description": "Set the interface, ip, and mask config line",
            "location": "Application",
            "locationType": null,
            "app": "WorkFlowEngine",
            "type": "automatic",
            "displayName": "Tools",
            "variables": {
              "incoming": {
                "input": "[{\"parents\":[\"interface <!interface_type!><!interface_id!>\"],\"new\":\"ip address <!ip_address!> <!subnet!>\"}]",
                "outputType": "json",
                "variables": "$var.job.variables"
              },
              "outgoing": {
                "output": null
              },
              "error": ""
            },
            "deprecated": false,
            "matched": [
              {
                "key": "canvasName",
                "highlightString": "<span class='highlight-string'>make</span><span class='highlight-string'>Data</span>"
              },
              {
                "key": "summary",
                "highlightString": "Convert input into a different <span class='highlight-string'>data</span> type"
              },
              {
                "key": "description",
                "highlightString": "This task takes an input and converts it to a different <span class='highlight-string'>data</span> type. For example, converting a number into a string."
              }
            ],
            "groups": [],
            "actor": "Pronghorn",
            "x": -0.14542836573074155,
            "y": 0.3340270551508845,
            "scheduled": false
          },
          "ed96": {
            "name": "makeData",
            "canvasName": "makeData",
            "summary": "Make int description",
            "description": "This task takes an input and converts it to a different data type. For example, converting a number into a string.",
            "location": "Application",
            "locationType": null,
            "app": "WorkFlowEngine",
            "type": "automatic",
            "displayName": "Tools",
            "variables": {
              "incoming": {
                "input": "[{\"parents\":[\"interface <!interface_type!> <!interface_id!>\"],\"new\":\"description <!description!>\"}]",
                "outputType": "json",
                "variables": "$var.job.variables"
              },
              "outgoing": {
                "output": null
              },
              "error": ""
            },
            "deprecated": false,
            "matched": [
              {
                "key": "canvasName",
                "highlightString": "<span class='highlight-string'>make</span><span class='highlight-string'>Data</span>"
              },
              {
                "key": "summary",
                "highlightString": "Convert input into a different <span class='highlight-string'>data</span> type"
              },
              {
                "key": "description",
                "highlightString": "This task takes an input and converts it to a different <span class='highlight-string'>data</span> type. For example, converting a number into a string."
              }
            ],
            "groups": [],
            "actor": "Pronghorn",
            "x": 0.13388543823326432,
            "y": 0.3356926188068756,
            "scheduled": false
          },
          "ac6a": {
            "name": "makeData",
            "canvasName": "makeData",
            "summary": "Shutdown Int",
            "description": "This task takes an input and converts it to a different data type. For example, converting a number into a string.",
            "location": "Application",
            "locationType": null,
            "app": "WorkFlowEngine",
            "type": "automatic",
            "displayName": "Tools",
            "variables": {
              "incoming": {
                "input": "[{\"parents\":[\"interface <!interface_type!> <!interface_id!>\"],\"new\":\"shutdown\"}]",
                "outputType": "json",
                "variables": "$var.job.variables"
              },
              "outgoing": {
                "output": "$var.job.shutdownCommand"
              },
              "error": ""
            },
            "deprecated": false,
            "matched": [
              {
                "key": "canvasName",
                "highlightString": "<span class='highlight-string'>make</span><span class='highlight-string'>Data</span>"
              },
              {
                "key": "summary",
                "highlightString": "Convert input into a different <span class='highlight-string'>data</span> type"
              },
              {
                "key": "description",
                "highlightString": "This task takes an input and converts it to a different <span class='highlight-string'>data</span> type. For example, converting a number into a string."
              }
            ],
            "groups": [],
            "actor": "Pronghorn",
            "x": 0.4610075914423741,
            "y": 0.21739130434782608,
            "scheduled": false
          },
          "c22d": {
            "name": "makeData",
            "canvasName": "makeData",
            "summary": "No Shutdown Int",
            "description": "This task takes an input and converts it to a different data type. For example, converting a number into a string.",
            "location": "Application",
            "locationType": null,
            "app": "WorkFlowEngine",
            "type": "automatic",
            "displayName": "Tools",
            "variables": {
              "incoming": {
                "input": "[{\"parents\":[\"interface <!interface_type!> <!interface_id!>\"],\"old\":\"shutdown\",\"new\":\"no shutdown\"}]",
                "outputType": "json",
                "variables": "$var.job.variables"
              },
              "outgoing": {
                "output": "$var.job.shutdownCommand"
              },
              "error": ""
            },
            "deprecated": false,
            "matched": [
              {
                "key": "canvasName",
                "highlightString": "<span class='highlight-string'>make</span><span class='highlight-string'>Data</span>"
              },
              {
                "key": "summary",
                "highlightString": "Convert input into a different <span class='highlight-string'>data</span> type"
              },
              {
                "key": "description",
                "highlightString": "This task takes an input and converts it to a different <span class='highlight-string'>data</span> type. For example, converting a number into a string."
              }
            ],
            "groups": [],
            "actor": "Pronghorn",
            "x": 0.4644582470669427,
            "y": 0.4570273003033367,
            "scheduled": false
          },
          "e517": {
            "name": "newVariable",
            "canvasName": "newVariable",
            "summary": "Create a Job Variable",
            "description": "Create a new Job variable by Job ID and assign it a value.",
            "location": "Application",
            "locationType": null,
            "app": "WorkFlowEngine",
            "type": "operation",
            "displayName": "WorkFlowEngine",
            "variables": {
              "incoming": {
                "name": "outcome",
                "value": "success"
              },
              "outgoing": {
                "value": null
              }
            },
            "deprecated": false,
            "matched": [
              {
                "key": "canvasName",
                "highlightString": "<span class='highlight-string'>new</span>Variable"
              },
              {
                "key": "description",
                "highlightString": "Create a <span class='highlight-string'>new</span> <span class='highlight-string'>Job</span> variable by Job ID and assign it a value."
              },
              {
                "key": "summary",
                "highlightString": "Create a <span class='highlight-string'>Job</span> Variable"
              }
            ],
            "groups": [],
            "x": 0.47550034506556244,
            "y": -0.0910010111223458
          },
          "baf": {
            "name": "setConfig",
            "canvasName": "setConfig",
            "summary": "Set Int and IP",
            "description": "This method will set the configuration on a device based on the configuration line(s) provided",
            "location": "Adapter",
            "locationType": "AutomationGateway",
            "app": "AutomationGateway",
            "type": "automatic",
            "displayName": "AutomationGateway",
            "variables": {
              "incoming": {
                "deviceName": "$var.job.deviceName",
                "changes": "$var.6dc2.output",
                "adapter_id": "$var.job.adapter_id"
              },
              "outgoing": {
                "result": null
              },
              "error": ""
            },
            "deprecated": false,
            "matched": [
              {
                "key": "canvasName",
                "highlightString": "<span class='highlight-string'>set</span><span class='highlight-string'>Config</span>"
              },
              {
                "key": "summary",
                "highlightString": "<span class='highlight-string'>Set</span> <span class='highlight-string'>config</span>uration on a device"
              },
              {
                "key": "description",
                "highlightString": "This method will <span class='highlight-string'>set</span> the <span class='highlight-string'>config</span>uration on a device based on the configuration line(s) provided"
              }
            ],
            "groups": [],
            "actor": "Pronghorn",
            "x": -0.007919366450683946,
            "y": 0.3456924754634678,
            "scheduled": false
          },
          "87d9": {
            "name": "setConfig",
            "canvasName": "setConfig",
            "summary": "Set Int description",
            "description": "This method will set the configuration on a device based on the configuration line(s) provided",
            "location": "Adapter",
            "locationType": "AutomationGateway",
            "app": "AutomationGateway",
            "type": "automatic",
            "displayName": "AutomationGateway",
            "variables": {
              "incoming": {
                "deviceName": "$var.job.deviceName",
                "changes": "$var.ed96.output",
                "adapter_id": "$var.job.adapter_id"
              },
              "outgoing": {
                "result": null
              },
              "error": ""
            },
            "deprecated": false,
            "matched": [
              {
                "key": "canvasName",
                "highlightString": "<span class='highlight-string'>set</span><span class='highlight-string'>Config</span>"
              },
              {
                "key": "summary",
                "highlightString": "<span class='highlight-string'>Set</span> <span class='highlight-string'>config</span>uration on a device"
              },
              {
                "key": "description",
                "highlightString": "This method will <span class='highlight-string'>set</span> the <span class='highlight-string'>config</span>uration on a device based on the configuration line(s) provided"
              }
            ],
            "groups": [],
            "actor": "Pronghorn",
            "x": 0.2598992080633549,
            "y": 0.3435114503816794,
            "scheduled": false
          },
          "2e7c": {
            "name": "setConfig",
            "canvasName": "setConfig",
            "summary": "Set configuration on a device",
            "description": "This method will set the configuration on a device based on the configuration line(s) provided",
            "location": "Adapter",
            "locationType": "AutomationGateway",
            "app": "AutomationGateway",
            "type": "automatic",
            "displayName": "AutomationGateway",
            "variables": {
              "incoming": {
                "deviceName": "$var.job.deviceName",
                "changes": "$var.job.shutdownCommand",
                "adapter_id": "$var.job.adapter_id"
              },
              "outgoing": {
                "result": null
              },
              "error": ""
            },
            "deprecated": false,
            "matched": [
              {
                "key": "canvasName",
                "highlightString": "<span class='highlight-string'>set</span><span class='highlight-string'>Config</span>"
              },
              {
                "key": "summary",
                "highlightString": "<span class='highlight-string'>Set</span> <span class='highlight-string'>config</span>uration on a device"
              },
              {
                "key": "description",
                "highlightString": "This method will <span class='highlight-string'>set</span> the <span class='highlight-string'>config</span>uration on a device based on the configuration line(s) provided"
              }
            ],
            "groups": [],
            "actor": "Pronghorn",
            "x": 0.6299496040316774,
            "y": 0.30970556161395857,
            "scheduled": false
          },
          "3b": {
            "name": "newVariable",
            "canvasName": "newVariable",
            "summary": "Create a Job Variable",
            "description": "Create a new Job variable by Job ID and assign it a value.",
            "location": "Application",
            "locationType": null,
            "app": "WorkFlowEngine",
            "type": "operation",
            "displayName": "WorkFlowEngine",
            "variables": {
              "incoming": {
                "name": "outcome",
                "value": "fail"
              },
              "outgoing": {
                "value": null
              }
            },
            "deprecated": false,
            "matched": [
              {
                "key": "canvasName",
                "highlightString": "<span class='highlight-string'>new</span>Variable"
              },
              {
                "key": "description",
                "highlightString": "Create a <span class='highlight-string'>new</span> <span class='highlight-string'>Job</span> variable by Job ID and assign it a value."
              },
              {
                "key": "summary",
                "highlightString": "Create a <span class='highlight-string'>Job</span> Variable"
              }
            ],
            "groups": [],
            "x": 0.45716342692584594,
            "y": 0.708636836628512
          }
        },
        "transitions": {
          "3471": {},
          "5765": {},
          "workflow_start": {
            "6dc2": {
              "type": "standard",
              "state": "success"
            }
          },
          "workflow_end": {},
          "c0b5": {},
          "3d91": {},
          "9e7b": {},
          "66f": {},
          "67a2": {},
          "f63c": {
            "ac6a": {
              "type": "standard",
              "state": "success"
            },
            "c22d": {
              "type": "standard",
              "state": "failure"
            }
          },
          "6dc2": {
            "baf": {
              "type": "standard",
              "state": "success"
            }
          },
          "ed96": {
            "87d9": {
              "type": "standard",
              "state": "success"
            }
          },
          "ac6a": {
            "2e7c": {
              "type": "standard",
              "state": "success"
            }
          },
          "c22d": {
            "2e7c": {
              "type": "standard",
              "state": "success"
            }
          },
          "e517": {
            "workflow_end": {
              "type": "standard",
              "state": "success"
            }
          },
          "baf": {
            "ed96": {
              "type": "standard",
              "state": "success"
            },
            "3b": {
              "type": "standard",
              "state": "failure"
            }
          },
          "87d9": {
            "f63c": {
              "type": "standard",
              "state": "success"
            },
            "3b": {
              "type": "standard",
              "state": "failure"
            }
          },
          "2e7c": {
            "e517": {
              "type": "standard",
              "state": "success"
            },
            "3b": {
              "type": "standard",
              "state": "failure"
            }
          },
          "3b": {
            "workflow_end": {
              "type": "standard",
              "state": "success"
            }
          }
        },
        "font_size": 12,
        "created": "2019-02-01T18:03:41.798Z",
        "created_by": {
          "provenance": "Local AAA",
          "username": "Itential Artifacts",
          "firstname": "admin",
          "inactive": true,
          "email": ""
        },
        "createdVersion": "4.5.3-2019.2.4.0",
        "groups": [],
        "last_updated": "2021-01-06T20:08:39.023Z",
        "last_updated_by": {
          "provenance": "Itential AAA LDAP",
          "username": "pinak.kelkar",
          "firstname": "pinak",
          "inactive": false,
          "email": ""
        },
        "lastUpdatedVersion": "5.8.0",
        "type": "automation",
        "description": null,
        "tags": []
      }
    },
    {
      "type": "json-forms",
      "data": {
        "id": "5e5690d39411dd47c17a36c6",
        "created": "2019-12-26T18:31:38.802Z",
        "createdBy": "pinak.kelkar",
        "lastUpdated": "2021-01-06T20:03:36.667Z",
        "lastUpdatedBy": "pinak.kelkar",
        "name": "IAP Artifacts Port Turn Up JSON Form",
        "description": "A form to select a device, interface type and description to be turned up ",
        "version": "2020.1",
        "struct": {
          "nodeId": "f6409f9d-7ab2-471e-9a75-1f7e76d17cf4",
          "type": "object",
          "items": [
            {
              "nodeId": "faca1e1a-6f3e-4652-9355-d458bfc2886c",
              "type": "boolean",
              "title": "Zero Touch",
              "description": "Zero touch will skip all manual task for a happy path.",
              "default": true
            },
            {
              "nodeId": "1a5a58ff-23fb-439c-8e4b-b8652e935e8b",
              "type": "string",
              "title": "Device",
              "description": "The following drop down is queried by the device broker and should reflect devices on NSO and Ansible",
              "placeholder": "Select a device to turn up a port on ",
              "required": true,
              "enum": [],
              "binding": true,
              "rel": "collection",
              "targetPointer": "/enum",
              "method": "POST",
              "base": "/",
              "href": "configuration_manager/devices",
              "body": {
                "options": {
                  "start": 0,
                  "limit": 50,
                  "order": "ascending",
                  "sort": [
                    {
                      "name": 1
                    }
                  ],
                  "filter": {
                    "name": ""
                  }
                }
              },
              "sourcePointer": "/list",
              "sourceKeyPointer": "/name"
            },
            {
              "nodeId": "6e04cbc1-1e9b-4044-8958-22e8f05e8dde",
              "type": "string",
              "title": "Interface Type",
              "description": "",
              "placeholder": "",
              "required": true,
              "enum": [
                {
                  "id": "4cfc85f2-385f-4387-8bb2-26655294d286",
                  "value": "GigabitEthernet"
                },
                {
                  "id": "d9b091c4-e907-4a8c-89e8-0d5df7de39e7",
                  "value": "TenGigE"
                },
                {
                  "id": "605fee54-8a66-402a-852b-d979ec68a0ac",
                  "value": "FortyGigE"
                },
                {
                  "id": "6b2c094f-db28-46fb-aaf0-7fdfe4d7adae",
                  "value": "HundredGigE"
                }
              ],
              "binding": false,
              "rel": "collection",
              "targetPointer": "/enum"
            },
            {
              "nodeId": "4e0bf3ec-edad-4833-8dfa-3966a6d88be3",
              "type": "string",
              "title": "Interface ID",
              "description": "Ex. 3",
              "placeholder": "",
              "required": true,
              "pattern": "\\d+"
            },
            {
              "nodeId": "226de150-f957-469e-9cc0-d5fbb01fe534",
              "type": "string",
              "title": "IP Address",
              "description": "Ex. 192.168.0.1",
              "placeholder": "",
              "required": true,
              "pattern": "^([0-9]{1,3})\\.([0-9]{1,3})\\.([0-9]{1,3})\\.([0-9]{1,3})$"
            },
            {
              "nodeId": "fba247e3-bca3-4b4b-ae52-ade9ce714723",
              "type": "string",
              "title": "Subnet Mask",
              "description": "Ex. 255.255.255.0",
              "placeholder": "",
              "required": true,
              "pattern": "^([0-9]{1,3})\\.([0-9]{1,3})\\.([0-9]{1,3})\\.([0-9]{1,3})$"
            },
            {
              "nodeId": "2e5ec318-c217-49ec-9a9f-6f5efe1c9180",
              "type": "string",
              "title": "Description",
              "description": "",
              "placeholder": "",
              "required": true
            },
            {
              "nodeId": "9365802f-1622-4bb8-81c5-447beb9bce95",
              "type": "boolean",
              "title": "Shutdown",
              "description": "",
              "default": false
            }
          ]
        },
        "schema": {
          "title": "IAP Artifacts Port Turn Up JSON Form",
          "description": "A form to select a device, interface type and description to be turned up ",
          "type": "object",
          "required": [
            "device",
            "interfaceType",
            "interfaceId",
            "ipAddress",
            "subnetMask",
            "description"
          ],
          "properties": {
            "zeroTouch": {
              "type": "boolean",
              "title": "Zero Touch",
              "description": "Zero touch will skip all manual task for a happy path.",
              "default": true
            },
            "device": {
              "type": "string",
              "title": "Device",
              "description": "The following drop down is queried by the device broker and should reflect devices on NSO and Ansible",
              "enum": []
            },
            "interfaceType": {
              "type": "string",
              "title": "Interface Type",
              "description": "",
              "enum": [
                "GigabitEthernet",
                "TenGigE",
                "FortyGigE",
                "HundredGigE"
              ]
            },
            "interfaceId": {
              "type": "string",
              "title": "Interface ID",
              "description": "Ex. 3",
              "pattern": "\\d+"
            },
            "ipAddress": {
              "type": "string",
              "title": "IP Address",
              "description": "Ex. 192.168.0.1",
              "pattern": "^([0-9]{1,3})\\.([0-9]{1,3})\\.([0-9]{1,3})\\.([0-9]{1,3})$"
            },
            "subnetMask": {
              "type": "string",
              "title": "Subnet Mask",
              "description": "Ex. 255.255.255.0",
              "pattern": "^([0-9]{1,3})\\.([0-9]{1,3})\\.([0-9]{1,3})\\.([0-9]{1,3})$"
            },
            "description": {
              "type": "string",
              "title": "Description",
              "description": ""
            },
            "shutdown": {
              "type": "boolean",
              "title": "Shutdown",
              "description": "",
              "default": false
            }
          }
        },
        "uiSchema": {
          "device": {
            "ui:placeholder": "Select a device to turn up a port on "
          }
        },
        "bindingSchema": {
          "properties": {
            "device": {
              "binding:method": "POST",
              "binding:link": {
                "$ref": "/links",
                "rel": "collection"
              },
              "binding:body": {
                "options": {
                  "start": 0,
                  "limit": 50,
                  "order": "ascending",
                  "sort": [
                    {
                      "name": 1
                    }
                  ],
                  "filter": {
                    "name": ""
                  }
                }
              },
              "binding:source": {
                "propertyPointer": "/list",
                "keyPointer": "/name"
              },
              "binding:target": {
                "propertyPointer": "/enum"
              },
              "binding:hyperSchema": {
                "type": "object",
                "base": "/",
                "links": [
                  {
                    "rel": "collection",
                    "href": "configuration_manager/devices",
                    "targetMediaType": "application/json",
                    "targetSchema": {
                      "$ref": "#"
                    }
                  }
                ]
              }
            }
          }
        },
        "validationSchema": {}
      }
    },
    {
      "type": "mop-template",
      "data": {
        "tags": [],
        "name": "IAP-Artifacts Port Turn Up Pre-Check",
        "os": "",
        "passRule": true,
        "ignoreWarnings": false,
        "commands": [
          {
            "command": "show ip int br <!interface_type!> <!interface_id!>",
            "passRule": false,
            "rules": [
              {
                "rule": "<!interface_type!><!interface_id!>*administratively\\sdown",
                "eval": "!RegEx",
                "severity": "error",
                "flags": {
                  "case": true,
                  "global": true,
                  "multiline": true
                }
              },
              {
                "rule": "<!interface_type!><!interface_id!>*\\sdown",
                "eval": "contains",
                "severity": "error",
                "flags": {
                  "case": false
                }
              }
            ]
          },
          {
            "command": "show run interface <!interface_type!> <!interface_id!>",
            "passRule": true,
            "rules": [
              {
                "rule": "",
                "eval": "contains",
                "severity": "error"
              }
            ],
            "tempCommand": "show run | i banner",
            "ruleValues": [
              {
                "rule": "",
                "eval": "contains",
                "severity": "error"
              }
            ]
          },
          {
            "command": "show bgp all",
            "passRule": true,
            "rules": [
              {
                "rule": "",
                "eval": "contains",
                "severity": "error"
              }
            ],
            "tempCommand": "show bgp all",
            "ruleValues": [
              {
                "rule": "",
                "eval": "contains",
                "severity": "error"
              }
            ]
          }
        ],
        "created": 1534511342697,
        "createdBy": "Itential-Artifacts",
        "lastUpdated": 1609964056518,
        "lastUpdatedBy": "pinak.kelkar"
      }
    },
    {
      "type": "mop-template",
      "data": {
        "tags": [],
        "name": "IAP-Artifacts Port Turn Up Post-Check",
        "os": "",
        "passRule": true,
        "ignoreWarnings": false,
        "commands": [
          {
            "command": "show ip int br <!interface_type!> <!interface_id!>",
            "passRule": false,
            "rules": [
              {
                "rule": "<!interface_type!><!interface_id!>*up",
                "eval": "!RegEx",
                "severity": "error",
                "flags": {
                  "case": true,
                  "global": true,
                  "multiline": true
                }
              }
            ]
          },
          {
            "command": "show run interface <!interface_type!> <!interface_id!>",
            "passRule": true,
            "rules": [
              {
                "rule": "",
                "eval": "contains",
                "severity": "error"
              }
            ],
            "tempCommand": "show run | i banner",
            "ruleValues": [
              {
                "rule": "",
                "eval": "contains",
                "severity": "error"
              }
            ]
          },
          {
            "command": "show ip int br",
            "passRule": true,
            "rules": [
              {
                "rule": "",
                "eval": "contains",
                "severity": "error"
              }
            ]
          },
          {
            "command": "show interfaces summary",
            "passRule": true,
            "rules": [
              {
                "rule": "",
                "eval": "contains",
                "severity": "error"
              }
            ],
            "tempCommand": "show interfaces summary",
            "ruleValues": [
              {
                "rule": "",
                "eval": "contains",
                "severity": "error"
              }
            ]
          },
          {
            "command": "show bgp all",
            "passRule": true,
            "rules": [
              {
                "rule": "",
                "eval": "contains",
                "severity": "error"
              }
            ],
            "tempCommand": "show bgp all",
            "ruleValues": [
              {
                "rule": "",
                "eval": "contains",
                "severity": "error"
              }
            ]
          }
        ],
        "created": 1534511361265,
        "createdBy": "Itential-Artifacts",
        "lastUpdated": 1610025183223,
        "lastUpdatedBy": "pinak.kelkar"
      }
    },
    {
      "type": "transformation",
      "data": {
        "_id": "5ff618335274463c14141c53",
        "name": "VariablesData",
        "description": "",
        "incoming": [
          {
            "$id": "formData",
            "type": "object",
            "properties": {
              "zeroTouch": {
                "type": "boolean",
                "examples": [
                  true,
                  false
                ]
              },
              "device": {
                "type": "string",
                "examples": [
                  "cisco-ios-catalyst-IAG"
                ]
              },
              "interfaceType": {
                "type": "string",
                "examples": [
                  "GigabitEthernet"
                ]
              },
              "interfaceId": {
                "type": "string",
                "examples": [
                  "3"
                ]
              },
              "ipAddress": {
                "type": "string",
                "examples": [
                  "192.1.1.1"
                ],
                "format": "ipv4"
              },
              "subnetMask": {
                "type": "string",
                "examples": [
                  "255.255.255.0"
                ],
                "format": "ipv4"
              },
              "description": {
                "type": "string",
                "examples": [
                  "Test"
                ]
              },
              "shutdown": {
                "type": "boolean",
                "examples": [
                  true,
                  false
                ]
              }
            },
            "required": []
          }
        ],
        "outgoing": [
          {
            "$id": "result",
            "type": "object",
            "properties": {
              "device": {
                "type": "string",
                "examples": [
                  "cisco-ios-catalyst-IAG"
                ]
              },
              "interface_type": {
                "type": "string",
                "examples": [
                  "GigabitEthernet"
                ]
              },
              "interface_id": {
                "type": "string",
                "examples": [
                  "2"
                ]
              },
              "ip_address": {
                "type": "string",
                "examples": [
                  "192.168.100.100"
                ],
                "format": "ipv4"
              },
              "subnet": {
                "type": "string",
                "examples": [
                  "255.255.255.0"
                ],
                "format": "ipv4"
              },
              "description": {
                "type": "string",
                "examples": [
                  "Example description from Itential Port Turn Up Artifact"
                ]
              },
              "shutdown": {
                "type": "boolean",
                "examples": [
                  true,
                  false
                ]
              }
            },
            "required": []
          }
        ],
        "steps": [
          {
            "id": 1,
            "type": "assign",
            "from": {
              "location": "incoming",
              "name": "formData",
              "ptr": "/device"
            },
            "to": {
              "location": "outgoing",
              "name": "result",
              "ptr": "/device"
            }
          },
          {
            "id": 2,
            "type": "assign",
            "from": {
              "location": "incoming",
              "name": "formData",
              "ptr": "/interfaceType"
            },
            "to": {
              "location": "outgoing",
              "name": "result",
              "ptr": "/interface_type"
            }
          },
          {
            "id": 3,
            "type": "assign",
            "from": {
              "location": "incoming",
              "name": "formData",
              "ptr": "/interfaceId"
            },
            "to": {
              "location": "outgoing",
              "name": "result",
              "ptr": "/interface_id"
            }
          },
          {
            "id": 4,
            "type": "assign",
            "from": {
              "location": "incoming",
              "name": "formData",
              "ptr": "/ipAddress"
            },
            "to": {
              "location": "outgoing",
              "name": "result",
              "ptr": "/ip_address"
            }
          },
          {
            "id": 5,
            "type": "assign",
            "from": {
              "location": "incoming",
              "name": "formData",
              "ptr": "/subnetMask"
            },
            "to": {
              "location": "outgoing",
              "name": "result",
              "ptr": "/subnet"
            }
          },
          {
            "id": 6,
            "type": "assign",
            "from": {
              "location": "incoming",
              "name": "formData",
              "ptr": "/description"
            },
            "to": {
              "location": "outgoing",
              "name": "result",
              "ptr": "/description"
            }
          },
          {
            "id": 7,
            "type": "assign",
            "from": {
              "location": "incoming",
              "name": "formData",
              "ptr": "/shutdown"
            },
            "to": {
              "location": "outgoing",
              "name": "result",
              "ptr": "/shutdown"
            }
          }
        ],
        "functions": [],
        "view": {
          "col": 1,
          "row": 5
        },
        "created": "2021-01-06T20:06:11.417Z",
        "createdBy": {
          "_id": "5fbd2162af95673ea668de1a",
          "provenance": "Itential AAA LDAP",
          "username": "pinak.kelkar"
        },
        "lastUpdated": "2021-01-06T20:06:11.417Z",
        "lastUpdatedBy": {
          "_id": "5fbd2162af95673ea668de1a",
          "provenance": "Itential AAA LDAP",
          "username": "pinak.kelkar"
        }
      }
    }
  ],
  "readme": "\n## _Deprecation Notice_\nThis Pre-Built has been deprecated as of 07-12-2024 and will be end of life on 07-12-2025. The capabilities of this Pre-Built have been replaced by [Cisco - IOS - IAG](https://gitlab.com/itentialopensource/pre-built-automations/cisco-ios-iag).\n\n<!-- Update the below line with your artifact name -->\n# Artifact Name\n\n<!-- Leave TOC intact unless you've added or removed headers -->\n## Table of Contents\n\n* [Overview](#overview)\n* [Installation Prerequisites](#installation-prerequisites)\n* [Requirements](#requirements)\n* [Features](#features)\n* [Future Enhancements](#future-enhancements)\n* [How to Install](#how-to-install)\n* [How to Run](#how-to-run)\n* [Additional Information](#additional-information)\n\n## Overview\n\nThe Port Turn Up Pre-Built consists of several workflows and command templates meant to serve as a solution for performing a port turn up on Cisco routers running IOS software.\nIn this Pre-Built, we are using Itential Automation Gateway (IAG) as the network orchestrator.\nThe included pre and post checks should be customized to suit the needs of the target device. Additionally, the implementation of routing network traffic is left up to the user to provide. The Pre-Built provides an indication of where a failover and restore should take place, but assumes no responsibility for these tasks.\n<!-- Write a few sentences about the artifact and explain the use case(s) -->\n<!-- Ex.: The Migration Wizard enables IAP users to conveniently move their automation use cases between different IAP environments -->\n<!-- (e.g. from Dev to Pre-Production or from Lab to Production). -->\n\n<!-- Workflow(s) Image Placeholder - TO BE ADDED DIRECTLY TO GitLab -->\n<!-- REPLACE COMMENT BELOW WITH IMAGE OF YOUR MAIN WORKFLOW -->\nThe Pre-Built consist of following:\n  - Automation Catalog(IAP Artifacts Port Turn Up Ansible)\n  - WorkFlow(IAP Artifacts Port Turn Up Ansible)\n  - WorkFlow(IAP Artifacts Port Turn Up Ansible Deployment)\n  - Command Template(IAP-Artifacts Port Turn Up Post-Check)\n  - Command Template(IAP-Artifacts Port Turn Up Pre-Check)\n\n\n<!-- REPLACE COMMENT ABOVE WITH IMAGE OF YOUR MAIN WORKFLOW -->\n\n## Installation Prerequisites\nIn order to use the Port Turn Up Pre-Built, users will have to satisfy the following pre-requisites:\n\n* Itential Automation Platform\n  * `^2023.1.x`\n* Itential Automation Gateway\n  * `^3.227.0+2023.1.15`\n\n## Requirements\n * Cisco IOS Device\n\n## Features\n\n* Automatically checks for device type\n* Displays dry-run to user (asking for confirmation) prior to pushing config to the device\n* Turns up interface and changes IpAddress and Description \n\n<!-- Unordered list highlighting the most exciting features of the artifact -->\n<!-- EXAMPLE -->\n<!-- * Automatically checks for device type -->\n<!-- * Displays dry-run to user (asking for confirmation) prior to pushing config to the device -->\n<!-- * Verifies downloaded file integrity (using md5), will try to download again if failed -->\n\n## Future Enhancements\n * Provide support for different device operation system types like, IOSXR, Arista, F5, Nokia and etc\n\n## How to Install\n\nTo install the Pre-Built:\n\n* Verify you are running a supported version of the Itential Automation Platform (IAP) as listed above in the [Requirements](#requirements) section in order to install the Pre-Built. \n* The Pre-Built can be installed from within App-Admin_Essential. Simply search for the name of your desired Pre-Built and click the install button.\n\n<!-- REPLACE ABOVE WITH IMAGE OF YOUR PUBLISHED ARTIFACT -->\n\nAlternatively, you may clone this repository and run `npm pack` to create a tarball which can then be installed via the offline installer in App-Artifacts. Please consult the documentation for App-Artifacts for further information.\n\n<!-- OPTIONAL - Explain if external components are required outside of IAP. Ex.: The Ansible roles required for this artifact can be found in the repository located at https://gitlab.com/itentialopensource/pre-built-automations/hello-world -->\n\n## How to Run\n\n<!-- Explain the main entrypoint(s) for this artifact: Automation Catalog item, Workflow, Postman, etc. -->\nUse the following to run this artifact: \n\nThis Pre-Built may be run from Operations Manager by clicking `Run` for the IAP Pre-Built Port Turn UP JSON Form. The user will be presented with a form to select options customize which device type, interface type, IP Address and subnet mask. A description is requred to run this artifact. The shutdown option is to turn down the device.\n\n## Additional Information\n\nPlease use your Itential Customer Success account if you need support when using this artifact.\n"
}