{
  "_id": "5ff618335274463c14141c53",
  "name": "VariablesData",
  "description": "",
  "incoming": [
    {
      "$id": "formData",
      "type": "object",
      "properties": {
        "zeroTouch": {
          "type": "boolean",
          "examples": [
            true,
            false
          ]
        },
        "device": {
          "type": "string",
          "examples": [
            "cisco-ios-catalyst-IAG"
          ]
        },
        "interfaceType": {
          "type": "string",
          "examples": [
            "GigabitEthernet"
          ]
        },
        "interfaceId": {
          "type": "string",
          "examples": [
            "3"
          ]
        },
        "ipAddress": {
          "type": "string",
          "examples": [
            "192.1.1.1"
          ],
          "format": "ipv4"
        },
        "subnetMask": {
          "type": "string",
          "examples": [
            "255.255.255.0"
          ],
          "format": "ipv4"
        },
        "description": {
          "type": "string",
          "examples": [
            "Test"
          ]
        },
        "shutdown": {
          "type": "boolean",
          "examples": [
            true,
            false
          ]
        }
      },
      "required": []
    }
  ],
  "outgoing": [
    {
      "$id": "result",
      "type": "object",
      "properties": {
        "device": {
          "type": "string",
          "examples": [
            "cisco-ios-catalyst-IAG"
          ]
        },
        "interface_type": {
          "type": "string",
          "examples": [
            "GigabitEthernet"
          ]
        },
        "interface_id": {
          "type": "string",
          "examples": [
            "2"
          ]
        },
        "ip_address": {
          "type": "string",
          "examples": [
            "192.168.100.100"
          ],
          "format": "ipv4"
        },
        "subnet": {
          "type": "string",
          "examples": [
            "255.255.255.0"
          ],
          "format": "ipv4"
        },
        "description": {
          "type": "string",
          "examples": [
            "Example description from Itential Port Turn Up Artifact"
          ]
        },
        "shutdown": {
          "type": "boolean",
          "examples": [
            true,
            false
          ]
        }
      },
      "required": []
    }
  ],
  "steps": [
    {
      "id": 1,
      "type": "assign",
      "from": {
        "location": "incoming",
        "name": "formData",
        "ptr": "/device"
      },
      "to": {
        "location": "outgoing",
        "name": "result",
        "ptr": "/device"
      }
    },
    {
      "id": 2,
      "type": "assign",
      "from": {
        "location": "incoming",
        "name": "formData",
        "ptr": "/interfaceType"
      },
      "to": {
        "location": "outgoing",
        "name": "result",
        "ptr": "/interface_type"
      }
    },
    {
      "id": 3,
      "type": "assign",
      "from": {
        "location": "incoming",
        "name": "formData",
        "ptr": "/interfaceId"
      },
      "to": {
        "location": "outgoing",
        "name": "result",
        "ptr": "/interface_id"
      }
    },
    {
      "id": 4,
      "type": "assign",
      "from": {
        "location": "incoming",
        "name": "formData",
        "ptr": "/ipAddress"
      },
      "to": {
        "location": "outgoing",
        "name": "result",
        "ptr": "/ip_address"
      }
    },
    {
      "id": 5,
      "type": "assign",
      "from": {
        "location": "incoming",
        "name": "formData",
        "ptr": "/subnetMask"
      },
      "to": {
        "location": "outgoing",
        "name": "result",
        "ptr": "/subnet"
      }
    },
    {
      "id": 6,
      "type": "assign",
      "from": {
        "location": "incoming",
        "name": "formData",
        "ptr": "/description"
      },
      "to": {
        "location": "outgoing",
        "name": "result",
        "ptr": "/description"
      }
    },
    {
      "id": 7,
      "type": "assign",
      "from": {
        "location": "incoming",
        "name": "formData",
        "ptr": "/shutdown"
      },
      "to": {
        "location": "outgoing",
        "name": "result",
        "ptr": "/shutdown"
      }
    }
  ],
  "functions": [],
  "view": {
    "col": 1,
    "row": 5
  },
  "created": "2021-01-06T20:06:11.417Z",
  "createdBy": {
    "_id": "5fbd2162af95673ea668de1a",
    "provenance": "Itential AAA LDAP",
    "username": "pinak.kelkar"
  },
  "lastUpdated": "2021-01-06T20:06:11.417Z",
  "lastUpdatedBy": {
    "_id": "5fbd2162af95673ea668de1a",
    "provenance": "Itential AAA LDAP",
    "username": "pinak.kelkar"
  }
}