{
  "tags": [],
  "name": "IAP-Artifacts Port Turn Up Post-Check",
  "os": "",
  "passRule": true,
  "ignoreWarnings": false,
  "commands": [
    {
      "command": "show ip int br <!interface_type!> <!interface_id!>",
      "passRule": false,
      "rules": [
        {
          "rule": "<!interface_type!><!interface_id!>*up",
          "eval": "!RegEx",
          "severity": "error",
          "flags": {
            "case": true,
            "global": true,
            "multiline": true
          }
        }
      ]
    },
    {
      "command": "show run interface <!interface_type!> <!interface_id!>",
      "passRule": true,
      "rules": [
        {
          "rule": "",
          "eval": "contains",
          "severity": "error"
        }
      ],
      "tempCommand": "show run | i banner",
      "ruleValues": [
        {
          "rule": "",
          "eval": "contains",
          "severity": "error"
        }
      ]
    },
    {
      "command": "show ip int br",
      "passRule": true,
      "rules": [
        {
          "rule": "",
          "eval": "contains",
          "severity": "error"
        }
      ]
    },
    {
      "command": "show interfaces summary",
      "passRule": true,
      "rules": [
        {
          "rule": "",
          "eval": "contains",
          "severity": "error"
        }
      ],
      "tempCommand": "show interfaces summary",
      "ruleValues": [
        {
          "rule": "",
          "eval": "contains",
          "severity": "error"
        }
      ]
    },
    {
      "command": "show bgp all",
      "passRule": true,
      "rules": [
        {
          "rule": "",
          "eval": "contains",
          "severity": "error"
        }
      ],
      "tempCommand": "show bgp all",
      "ruleValues": [
        {
          "rule": "",
          "eval": "contains",
          "severity": "error"
        }
      ]
    }
  ],
  "created": 1534511361265,
  "createdBy": "Itential-Artifacts",
  "lastUpdated": 1610025183223,
  "lastUpdatedBy": "pinak.kelkar"
}