{
  "name": "Aggregate Functions For Arrays",
  "webName": "Aggregate Functions For Arrays",
  "vendor": "Itential",
  "product": "Itential Automation Platform",
  "osVersions": [],
  "apiVersions": [],
  "iapVersions": [
    "2021.2.x",
    "2022.1.x",
    "2023.1.x"
  ],
  "method": "",
  "type": "Transformation Project",
  "domains": [],
  "tags": [],
  "useCases": [],
  "deprecated": {
    "isDeprecated": true,
    "deprecatedOn": "2024-01-15",
    "endOfLife": "2025-01-15",
    "replacedBy": {
      "name": "IAP - Data Manipulation",
      "webName": "IAP Data Manipulation Transformations",
      "isProductFeature": false,
      "overview": "This Transformation Project contains several transformation examples that are used for data manipulation in Itential Automation Platform (IAP)",
      "repoLink": "https://gitlab.com/itentialopensource/pre-built-automations/iap-data-manipulation",
      "docLink": "",
      "webLink": ""
    }
  },
  "brokerSince": "",
  "documentation": {
    "storeLink": "",
    "npmLink": "",
    "repoLink": "",
    "docLink": "",
    "demoLinks": [],
    "trainingLinks": [],
    "faqLink": "",
    "contributeLink": "",
    "issueLink": "",
    "webLink": "",
    "vendorLink": "",
    "productLink": "",
    "apiLinks": []
  },
  "assets": [],
  "relatedItems": {
    "adapters": [],
    "integrations": [],
    "ecosystemApplications": [],
    "workflowProjects": [],
    "transformationProjects": [],
    "exampleProjects": []
  }
}