{
    "openapi": "3.0.3",
    "info": {
        "contact": {},
        "license": {
            "name": "Apache 2.0",
            "url": "http://www.apache.org/licenses/LICENSE-2.0.html"
        },
        "description": "Thruk Monitoring - Thruk offers a rest api to expose various aspects of Thruk itself and livestatus information.",
        "version": "1.0.0",
        "title": "Thruk"
    },
    "servers": [
        {
            "url": "https://your.host.name.io/"
        }
    ],
    "security": [],
    "paths": {
        "/alerts": {
            "get": {
                "parameters": [],
                "tags": [
                    "default"
                ],
                "operationId": "getAlerts",
                "summary": "Get Alerts",
                "description": "lists alerts based on logfiles",
                "responses": {
                    "200": {
                        "description": "successful operation"
                    },
                    "400": {
                        "description": "failed operation"
                    }
                }
            }
        },
        "/checks/stats": {
            "get": {
                "parameters": [],
                "tags": [
                    "default"
                ],
                "operationId": "getStatistics",
                "summary": "Get Statistics",
                "description": "lists host / service check statistics.",
                "responses": {
                    "200": {
                        "description": "successful operation"
                    },
                    "400": {
                        "description": "failed operation"
                    }
                }
            }
        },
        "/cmd": {
            "post": {
                "parameters": [],
                "requestBody": {
                    "description": "body",
                    "required": true,
                    "content": {
                        "*/*": {
                            "schema": {
                                "type": "object"
                            }
                        }
                    }
                },
                "tags": [
                    "default"
                ],
                "operationId": "postCommand",
                "summary": "Post Command",
                "description": "Sends any command.",
                "responses": {
                    "200": {
                        "description": "successful operation"
                    },
                    "400": {
                        "description": "failed operation"
                    }
                }
            }
        },
        "/commands": {
            "get": {
                "parameters": [],
                "tags": [
                    "default"
                ],
                "operationId": "getCommands",
                "summary": "Get Commands",
                "description": "lists livestatus commands. see https://www.naemon.org/documentation/usersguide/livestatus.html#commands for details.",
                "responses": {
                    "200": {
                        "description": "successful operation"
                    },
                    "400": {
                        "description": "failed operation"
                    }
                }
            }
        },
        "/commands/{name}": {
            "get": {
                "parameters": [
                    {
                        "name": "name",
                        "in": "path",
                        "description": "name",
                        "required": true,
                        "schema": {
                            "type": "string"
                        }
                    }
                ],
                "tags": [
                    "default"
                ],
                "operationId": "getCommand",
                "summary": "Get Command",
                "description": "lists commands for given name. alias for /commands?name=<name>",
                "responses": {
                    "200": {
                        "description": "successful operation"
                    },
                    "400": {
                        "description": "failed operation"
                    }
                }
            }
        },
        "/commands/{name}/config": {
            "get": {
                "parameters": [
                    {
                        "name": "name",
                        "in": "path",
                        "description": "name",
                        "schema": {
                            "type": "string"
                        },
                        "required": true
                    }
                ],
                "tags": [
                    "default"
                ],
                "operationId": "getCommandConfig",
                "summary": "Get Command Config",
                "description": "Returns configuration for given command. You will find available attributes here: http://www.naemon.org/documentation/usersguide/objectdefinitions.html#command",
                "responses": {
                    "200": {
                        "description": "successful operation"
                    },
                    "400": {
                        "description": "failed operation"
                    }
                }
            },
            "post": {
                "parameters": [
                    {
                        "name": "name",
                        "in": "path",
                        "description": "name",
                        "required": true,
                        "schema": {
                            "type": "string"
                        }
                    }
                ],
                "requestBody": {
                    "description": "body",
                    "required": true,
                    "content": {
                        "*/*": {
                            "schema": {
                                "type": "object"
                            }
                        }
                    }
                },
                "tags": [
                    "default"
                ],
                "operationId": "postCommandConfig",
                "summary": "Post Command Config",
                "description": "Replace command configuration completely, use PATCH to only update specific attributes.",
                "responses": {
                    "200": {
                        "description": "successful operation"
                    },
                    "400": {
                        "description": "failed operation"
                    }
                }
            },
            "patch": {
                "parameters": [
                    {
                        "name": "name",
                        "in": "path",
                        "description": "name",
                        "required": true,
                        "schema": {
                            "type": "string"
                        }
                    }
                ],
                "requestBody": {
                    "description": "body",
                    "required": true,
                    "content": {
                        "*/*": {
                            "schema": {
                                "type": "object"
                            }
                        }
                    }
                },
                "tags": [
                    "default"
                ],
                "operationId": "patchCommandConfig",
                "summary": "Patch Command Config",
                "description": "Update command configuration partially.",
                "responses": {
                    "200": {
                        "description": "successful operation"
                    },
                    "400": {
                        "description": "failed operation"
                    }
                }
            },
            "delete": {
                "parameters": [
                    {
                        "name": "name",
                        "in": "path",
                        "description": "name",
                        "required": true,
                        "schema": {
                            "type": "string"
                        }
                    }
                ],
                "tags": [
                    "default"
                ],
                "operationId": "deleteCommandConfig",
                "summary": "Delete Command Cofig",
                "description": "Deletes given command from configuration.",
                "responses": {
                    "200": {
                        "description": "successful operation"
                    },
                    "400": {
                        "description": "failed operation"
                    }
                }
            }
        },
        "/comments": {
            "get": {
                "parameters": [],
                "tags": [
                    "default"
                ],
                "operationId": "getComments",
                "summary": "Get Comments",
                "description": "lists livestatus comments. see https://www.naemon.org/documentation/usersguide/livestatus.html#comments for details.",
                "responses": {
                    "200": {
                        "description": "successful operation"
                    },
                    "400": {
                        "description": "failed operation"
                    }
                }
            }
        },
        "/comments/{id}": {
            "get": {
                "parameters": [
                    {
                        "name": "id",
                        "in": "path",
                        "description": "id",
                        "schema": {
                            "type": "string"
                        },
                        "required": true
                    }
                ],
                "tags": [
                    "default"
                ],
                "operationId": "getComment",
                "summary": "Get Comment",
                "description": "lists comments for given id. alias for /comments?id=<id>",
                "responses": {
                    "200": {
                        "description": "successful operation"
                    },
                    "400": {
                        "description": "failed operation"
                    }
                }
            }
        },
        "/config/check": {
            "post": {
                "parameters": [],
                "tags": [
                    "default"
                ],
                "operationId": "postConfigCheck",
                "summary": "Post Config Check",
                "description": "Returns result from config check. This check does require changes to be saved to disk before running the check.",
                "responses": {
                    "200": {
                        "description": "successful operation"
                    },
                    "400": {
                        "description": "failed operation"
                    }
                }
            }
        },
        "/config/diff": {
            "get": {
                "parameters": [],
                "tags": [
                    "default"
                ],
                "operationId": "getConfigDiff",
                "summary": "Get Config Diff",
                "description": "Returns differences between filesystem and stashed config changes.",
                "responses": {
                    "200": {
                        "description": "successful operation"
                    },
                    "400": {
                        "description": "failed operation"
                    }
                }
            }
        },
        "/config/discard": {
            "post": {
                "parameters": [],
                "tags": [
                    "default"
                ],
                "operationId": "postConfigDiscard",
                "summary": "Post Config Discard",
                "description": "Reverts stashed configuration changes. Alias for /config/revert",
                "responses": {
                    "200": {
                        "description": "successful operation"
                    },
                    "400": {
                        "description": "failed operation"
                    }
                }
            }
        },
        "/config/files": {
            "get": {
                "parameters": [],
                "tags": [
                    "default"
                ],
                "operationId": "getConfigFiles",
                "summary": "Get Config Files",
                "description": "returns all config files",
                "responses": {
                    "200": {
                        "description": "successful operation"
                    },
                    "400": {
                        "description": "failed operation"
                    }
                }
            }
        },
        "/config/fullobjects": {
            "get": {
                "parameters": [],
                "tags": [
                    "default"
                ],
                "operationId": "getConfigFullObjects",
                "summary": "Get Config Full Objects",
                "description": "Returns list of all objects with templates expanded. Used templates are saved to the :TEMPLATES attribute",
                "responses": {
                    "200": {
                        "description": "successful operation"
                    },
                    "400": {
                        "description": "failed operation"
                    }
                }
            }
        },
        "/config/objects": {
            "get": {
                "parameters": [],
                "tags": [
                    "default"
                ],
                "operationId": "Get Config Objects",
                "summary": "Get Config Objects",
                "description": "Returns list of all objects with their raw config. Use /config/fullobjects to get the full expanded config.",
                "responses": {
                    "200": {
                        "description": "successful operation"
                    },
                    "400": {
                        "description": "failed operation"
                    }
                }
            },
            "post": {
                "parameters": [],
                "requestBody": {
                    "description": "body",
                    "required": true,
                    "content": {
                        "*/*": {
                            "schema": {
                                "type": "object"
                            }
                        }
                    }
                },
                "tags": [
                    "default"
                ],
                "operationId": "postConfigObjects",
                "summary": "Post Config Objects",
                "description": "Create new object. Besides the actual object config, requires 2 special paramters :FILE and :TYPE.",
                "responses": {
                    "200": {
                        "description": "successful operation"
                    },
                    "400": {
                        "description": "failed operation"
                    }
                }
            },
            "patch": {
                "parameters": [],
                "requestBody": {
                    "description": "body",
                    "required": true,
                    "content": {
                        "*/*": {
                            "schema": {
                                "type": "object"
                            }
                        }
                    }
                },
                "tags": [
                    "default"
                ],
                "operationId": "patchConfigObjects",
                "summary": "Patch Config Objects",
                "description": "Change attributes for all matching objects. This is a very powerful url, for example you could change all hosts which have max_check_attempts=3 to max_check_attempts=5 with this command:",
                "responses": {
                    "200": {
                        "description": "successful operation"
                    },
                    "400": {
                        "description": "failed operation"
                    }
                }
            }
        },
        "/config/objects/{id}": {
            "patch": {
                "parameters": [
                    {
                        "name": "id",
                        "in": "path",
                        "description": "id",
                        "required": true,
                        "schema": {
                            "type": "string"
                        }
                    }
                ],
                "requestBody": {
                    "description": "body",
                    "required": true,
                    "content": {
                        "*/*": {
                            "schema": {
                                "type": "object"
                            }
                        }
                    }
                },
                "tags": [
                    "default"
                ],
                "operationId": "patchConfigObject",
                "summary": "Patch Config Object",
                "description": "Update object configuration partially.",
                "responses": {
                    "200": {
                        "description": "successful operation"
                    },
                    "400": {
                        "description": "failed operation"
                    }
                }
            },
            "post": {
                "parameters": [
                    {
                        "name": "id",
                        "in": "path",
                        "description": "id",
                        "required": true,
                        "schema": {
                            "type": "string"
                        }
                    }
                ],
                "requestBody": {
                    "description": "body",
                    "required": true,
                    "content": {
                        "*/*": {
                            "schema": {
                                "type": "object"
                            }
                        }
                    }
                },
                "tags": [
                    "default"
                ],
                "operationId": "postConfigObject",
                "summary": "Post Config Object",
                "description": "Replace object configuration completely.",
                "responses": {
                    "200": {
                        "description": "successful operation"
                    },
                    "400": {
                        "description": "failed operation"
                    }
                }
            },
            "delete": {
                "parameters": [
                    {
                        "name": "name",
                        "in": "path",
                        "description": "name",
                        "required": true,
                        "schema": {
                            "type": "string"
                        }
                    }
                ],
                "tags": [
                    "default"
                ],
                "operationId": "deleteConfigObject",
                "summary": "Delete Config Object",
                "description": "Remove given object from configuration.",
                "responses": {
                    "200": {
                        "description": "successful operation"
                    },
                    "400": {
                        "description": "failed operation"
                    }
                }
            }
        },
        "/config/precheck": {
            "get": {
                "parameters": [],
                "tags": [
                    "default"
                ],
                "operationId": "getConfigPrecheck",
                "summary": "Get Config Pre Check",
                "description": "Returns result from Thruks config precheck. The precheck does not require changes to be saved to disk before running the check.",
                "responses": {
                    "200": {
                        "description": "successful operation"
                    },
                    "400": {
                        "description": "failed operation"
                    }
                }
            }
        },
        "/config/reload": {
            "post": {
                "parameters": [],
                "tags": [
                    "default"
                ],
                "operationId": "postConfigReload",
                "summary": "Post Config Reload",
                "description": "Reloads configuration with the configured reload command.",
                "responses": {
                    "200": {
                        "description": "successful operation"
                    },
                    "400": {
                        "description": "failed operation"
                    }
                }
            }
        },
        "/config/revert": {
            "post": {
                "parameters": [],
                "tags": [
                    "default"
                ],
                "operationId": "postConfigRevert",
                "summary": "Post Config Revert",
                "description": "Reverts stashed configuration changes.",
                "responses": {
                    "200": {
                        "description": "successful operation"
                    },
                    "400": {
                        "description": "failed operation"
                    }
                }
            }
        },
        "/config/save": {
            "post": {
                "parameters": [],
                "tags": [
                    "default"
                ],
                "operationId": "postConfigSave",
                "summary": "Post Config Save",
                "description": "Saves stashed configuration changes to disk.",
                "responses": {
                    "200": {
                        "description": "successful operation"
                    },
                    "400": {
                        "description": "failed operation"
                    }
                }
            }
        },
        "/contactgroups": {
            "get": {
                "parameters": [],
                "tags": [
                    "default"
                ],
                "operationId": "getContactGroups",
                "summary": "Get Contact Groups",
                "description": "lists livestatus contactgroups. see https://www.naemon.org/documentation/usersguide/livestatus.html#contactgroups for details.",
                "responses": {
                    "200": {
                        "description": "successful operation"
                    },
                    "400": {
                        "description": "failed operation"
                    }
                }
            }
        },
        "/contactgroups/{name}": {
            "get": {
                "parameters": [
                    {
                        "name": "name",
                        "in": "path",
                        "description": "name",
                        "required": true,
                        "schema": {
                            "type": "string"
                        }
                    }
                ],
                "tags": [
                    "default"
                ],
                "operationId": "getContactGroup",
                "summary": "Get Contact Group",
                "description": "lists contactgroups for given name. alias for /contactgroups?name=<name>",
                "responses": {
                    "200": {
                        "description": "successful operation"
                    },
                    "400": {
                        "description": "failed operation"
                    }
                }
            }
        },
        "/contactgroups/{name}/config": {
            "get": {
                "parameters": [
                    {
                        "name": "name",
                        "in": "path",
                        "description": "name",
                        "schema": {
                            "type": "string"
                        },
                        "required": true
                    }
                ],
                "tags": [
                    "default"
                ],
                "operationId": "getContactGroupsConfig",
                "summary": "Get Contact Groups Config",
                "description": "Returns configuration for given contactgroup. You will find available attributes here: http://www.naemon.org/documentation/usersguide/objectdefinitions.html#contactgroup",
                "responses": {
                    "200": {
                        "description": "successful operation"
                    },
                    "400": {
                        "description": "failed operation"
                    }
                }
            },
            "post": {
                "parameters": [
                    {
                        "name": "name",
                        "in": "path",
                        "description": "name",
                        "required": true,
                        "schema": {
                            "type": "string"
                        }
                    }
                ],
                "requestBody": {
                    "description": "body",
                    "required": true,
                    "content": {
                        "*/*": {
                            "schema": {
                                "type": "object"
                            }
                        }
                    }
                },
                "tags": [
                    "default"
                ],
                "operationId": "postContactGroupsConfig",
                "summary": "Post Contact Groups Config",
                "description": "Replace contactgroup configuration completely, use PATCH to only update specific attributes.",
                "responses": {
                    "200": {
                        "description": "successful operation"
                    },
                    "400": {
                        "description": "failed operation"
                    }
                }
            },
            "patch": {
                "parameters": [
                    {
                        "name": "name",
                        "in": "path",
                        "description": "name",
                        "required": true,
                        "schema": {
                            "type": "string"
                        }
                    }
                ],
                "requestBody": {
                    "description": "body",
                    "required": true,
                    "content": {
                        "*/*": {
                            "schema": {
                                "type": "object"
                            }
                        }
                    }
                },
                "tags": [
                    "default"
                ],
                "operationId": "patchContactGroupsConfig",
                "summary": "Patch Contact Groups Config",
                "description": "Update contactgroup configuration partially.",
                "responses": {
                    "200": {
                        "description": "successful operation"
                    },
                    "400": {
                        "description": "failed operation"
                    }
                }
            },
            "delete": {
                "parameters": [
                    {
                        "name": "name",
                        "in": "path",
                        "description": "name",
                        "required": true,
                        "schema": {
                            "type": "string"
                        }
                    }
                ],
                "tags": [
                    "default"
                ],
                "operationId": "deleteContactsGroupConfig",
                "summary": "Delete Contact Groups Config",
                "description": "Deletes given contactgroup from configuration.",
                "responses": {
                    "200": {
                        "description": "successful operation"
                    },
                    "400": {
                        "description": "failed operation"
                    }
                }
            }
        },
        "/contacts": {
            "get": {
                "parameters": [],
                "tags": [
                    "default"
                ],
                "operationId": "getContacts",
                "summary": "Get Contacts",
                "description": "lists livestatus contacts. see https://www.naemon.org/documentation/usersguide/livestatus.html#contacts for details.",
                "responses": {
                    "200": {
                        "description": "successful operation"
                    },
                    "400": {
                        "description": "failed operation"
                    }
                }
            }
        },
        "/contacts/{name}": {
            "get": {
                "parameters": [
                    {
                        "name": "name",
                        "in": "path",
                        "description": "name",
                        "required": true,
                        "schema": {
                            "type": "string"
                        }
                    }
                ],
                "tags": [
                    "default"
                ],
                "operationId": "getContact",
                "summary": "Get Contact",
                "description": "lists contacts for given name. alias for /contacts?name=<name>",
                "responses": {
                    "200": {
                        "description": "successful operation"
                    },
                    "400": {
                        "description": "failed operation"
                    }
                }
            }
        },
        "/contacts/{name}/config": {
            "get": {
                "parameters": [
                    {
                        "name": "name",
                        "in": "path",
                        "description": "name",
                        "required": true,
                        "schema": {
                            "type": "string"
                        }
                    }
                ],
                "tags": [
                    "default"
                ],
                "operationId": "getContactConfig",
                "summary": "Get Contact Config",
                "description": "Returns configuration for given contact. You will find available attributes here: http://www.naemon.org/documentation/usersguide/objectdefinitions.html#contact",
                "responses": {
                    "200": {
                        "description": "successful operation"
                    },
                    "400": {
                        "description": "failed operation"
                    }
                }
            },
            "post": {
                "parameters": [
                    {
                        "name": "name",
                        "in": "path",
                        "description": "name",
                        "required": true,
                        "schema": {
                            "type": "string"
                        }
                    }
                ],
                "requestBody": {
                    "description": "body",
                    "required": true,
                    "content": {
                        "*/*": {
                            "schema": {
                                "type": "object"
                            }
                        }
                    }
                },
                "tags": [
                    "default"
                ],
                "operationId": "postContactConfig",
                "summary": "Post Contact Config",
                "description": "Replace contact configuration completely, use PATCH to only update specific attributes.",
                "responses": {
                    "200": {
                        "description": "successful operation"
                    },
                    "400": {
                        "description": "failed operation"
                    }
                }
            },
            "patch": {
                "parameters": [
                    {
                        "name": "name",
                        "in": "path",
                        "description": "name",
                        "schema": {
                            "type": "string"
                        },
                        "required": true
                    }
                ],
                "requestBody": {
                    "description": "body",
                    "required": true,
                    "content": {
                        "*/*": {
                            "schema": {
                                "type": "object"
                            }
                        }
                    }
                },
                "tags": [
                    "default"
                ],
                "operationId": "patchContactConfig",
                "summary": "Patch Contact Config",
                "description": "Update contact configuration partially.",
                "responses": {
                    "200": {
                        "description": "successful operation"
                    },
                    "400": {
                        "description": "failed operation"
                    }
                }
            },
            "delete": {
                "parameters": [
                    {
                        "name": "name",
                        "in": "path",
                        "description": "name",
                        "required": true,
                        "schema": {
                            "type": "string"
                        }
                    }
                ],
                "tags": [
                    "default"
                ],
                "operationId": "deleteContactConfig",
                "summary": "Delete Contact Config",
                "description": "Deletes given contact from configuration.",
                "responses": {
                    "200": {
                        "description": "successful operation"
                    },
                    "400": {
                        "description": "failed operation"
                    }
                }
            }
        },
        "/downtimes": {
            "get": {
                "parameters": [],
                "tags": [
                    "default"
                ],
                "operationId": "getDowntimes",
                "summary": "Get Downtimes",
                "description": "lists livestatus downtimes. see https://www.naemon.org/documentation/usersguide/livestatus.html#downtimes for details.",
                "responses": {
                    "200": {
                        "description": "successful operation"
                    },
                    "400": {
                        "description": "failed operation"
                    }
                }
            }
        },
        "/downtimes/{id}": {
            "get": {
                "parameters": [
                    {
                        "name": "id",
                        "in": "path",
                        "description": "id",
                        "required": true,
                        "schema": {
                            "type": "string"
                        }
                    }
                ],
                "tags": [
                    "default"
                ],
                "operationId": "getDowntime",
                "summary": "Get Downtime",
                "description": "lists downtimes for given id. alias for /downtimes?id=<id>",
                "responses": {
                    "200": {
                        "description": "successful operation"
                    },
                    "400": {
                        "description": "failed operation"
                    }
                }
            }
        },
        "/hostgroups": {
            "get": {
                "parameters": [],
                "tags": [
                    "default"
                ],
                "operationId": "getHostgroups",
                "summary": "Get Hostgroups",
                "description": "lists livestatus hostgroups. see https://www.naemon.org/documentation/usersguide/livestatus.html#hostgroups for details.",
                "responses": {
                    "200": {
                        "description": "successful operation"
                    },
                    "400": {
                        "description": "failed operation"
                    }
                }
            }
        },
        "/hostgroups/{name}": {
            "get": {
                "parameters": [
                    {
                        "name": "name",
                        "in": "path",
                        "description": "name",
                        "required": true,
                        "schema": {
                            "type": "string"
                        }
                    }
                ],
                "tags": [
                    "default"
                ],
                "operationId": "getHostgroup",
                "summary": "Get Hostgroup",
                "description": "lists hostgroups for given name. alias for /hostgroups?name=<name>",
                "responses": {
                    "200": {
                        "description": "successful operation"
                    },
                    "400": {
                        "description": "failed operation"
                    }
                }
            }
        },
        "/hostgroups/{name}/config": {
            "get": {
                "parameters": [
                    {
                        "name": "name",
                        "in": "path",
                        "description": "name",
                        "required": true,
                        "schema": {
                            "type": "string"
                        }
                    }
                ],
                "tags": [
                    "default"
                ],
                "operationId": "getHostgroupConfig",
                "summary": "Get Hostgroup Config",
                "description": "Returns configuration for given hostgroup. You will find available attributes here: http://www.naemon.org/documentation/usersguide/objectdefinitions.html#hostgroup",
                "responses": {
                    "200": {
                        "description": "successful operation"
                    },
                    "400": {
                        "description": "failed operation"
                    }
                }
            },
            "post": {
                "parameters": [
                    {
                        "name": "name",
                        "in": "path",
                        "description": "name",
                        "required": true,
                        "schema": {
                            "type": "string"
                        }
                    }
                ],
                "requestBody": {
                    "description": "body",
                    "required": true,
                    "content": {
                        "*/*": {
                            "schema": {
                                "type": "object"
                            }
                        }
                    }
                },
                "tags": [
                    "default"
                ],
                "operationId": "postHostgroupConfig",
                "summary": "Post Hostgroup Config",
                "description": "Replace hostgroups configuration completely, use PATCH to only update specific attributes.",
                "responses": {
                    "200": {
                        "description": "successful operation"
                    },
                    "400": {
                        "description": "failed operation"
                    }
                }
            },
            "patch": {
                "parameters": [
                    {
                        "name": "name",
                        "in": "path",
                        "description": "name",
                        "required": true,
                        "schema": {
                            "type": "string"
                        }
                    }
                ],
                "requestBody": {
                    "description": "body",
                    "required": true,
                    "content": {
                        "*/*": {
                            "schema": {
                                "type": "object"
                            }
                        }
                    }
                },
                "tags": [
                    "default"
                ],
                "operationId": "patchHostgroupConfig",
                "summary": "Patch Hostgroup Config",
                "description": "Update hostgroup configuration partially.",
                "responses": {
                    "200": {
                        "description": "successful operation"
                    },
                    "400": {
                        "description": "failed operation"
                    }
                }
            },
            "delete": {
                "parameters": [
                    {
                        "name": "name",
                        "in": "path",
                        "description": "name",
                        "required": true,
                        "schema": {
                            "type": "string"
                        }
                    }
                ],
                "tags": [
                    "default"
                ],
                "operationId": "deleteHostgroupConfig",
                "summary": "Delete Hostgroup Config",
                "description": "Deletes given hostgroup from configuration.",
                "responses": {
                    "200": {
                        "description": "successful operation"
                    },
                    "400": {
                        "description": "failed operation"
                    }
                }
            }
        },
        "/hostgroups/{name}/outages": {
            "get": {
                "parameters": [
                    {
                        "name": "name",
                        "in": "path",
                        "description": "name ",
                        "required": true,
                        "schema": {
                            "type": "string"
                        }
                    }
                ],
                "tags": [
                    "default"
                ],
                "operationId": "getHostgroupOutages",
                "summary": "Get Hostgroup Outages",
                "description": "list of outages for this hostgroup.",
                "responses": {
                    "200": {
                        "description": "successful operation"
                    },
                    "400": {
                        "description": "failed operation"
                    }
                }
            }
        },
        "/hostgroups/{name}/stats": {
            "get": {
                "parameters": [
                    {
                        "name": "name",
                        "in": "path",
                        "description": "name",
                        "required": true,
                        "schema": {
                            "type": "string"
                        }
                    }
                ],
                "tags": [
                    "default"
                ],
                "operationId": "getHostgroupStats",
                "summary": "Get Hostgroup Stats",
                "description": "hash of livestatus hostgroup statistics. alias for /hosts/stats?groups[gte]=<name>",
                "responses": {
                    "200": {
                        "description": "successful operation"
                    },
                    "400": {
                        "description": "failed operation"
                    }
                }
            }
        },
        "/hosts": {
            "get": {
                "parameters": [],
                "tags": [
                    "default"
                ],
                "operationId": "getHosts",
                "summary": "Get Hosts",
                "description": "lists livestatus hosts. see https://www.naemon.org/documentation/usersguide/livestatus.html#hosts for details.",
                "responses": {
                    "200": {
                        "description": "successful operation"
                    },
                    "400": {
                        "description": "failed operation"
                    }
                }
            }
        },
        "/hosts/{name}": {
            "get": {
                "parameters": [
                    {
                        "name": "name",
                        "in": "path",
                        "description": "name",
                        "schema": {
                            "type": "string"
                        },
                        "required": true
                    }
                ],
                "tags": [
                    "default"
                ],
                "operationId": "getHost",
                "summary": "Get Host",
                "description": "lists hosts for given name. alias for /hosts?name=<name>",
                "responses": {
                    "200": {
                        "description": "successful operation"
                    },
                    "400": {
                        "description": "failed operation"
                    }
                }
            }
        },
        "/hosts/{name}/alerts": {
            "get": {
                "parameters": [
                    {
                        "name": "name",
                        "in": "path",
                        "description": "name",
                        "required": true,
                        "schema": {
                            "type": "string"
                        }
                    }
                ],
                "tags": [
                    "default"
                ],
                "operationId": "getHostAlerts",
                "summary": "Get Host Alerts",
                "description": "lists alerts for given host. alias for /logs?type[~]=^(HOST|SERVICE) ALERT&host_name=<name>",
                "responses": {
                    "200": {
                        "description": "successful operation"
                    },
                    "400": {
                        "description": "failed operation"
                    }
                }
            }
        },
        "/hosts/{name}/commandline": {
            "get": {
                "parameters": [
                    {
                        "name": "name",
                        "in": "path",
                        "description": "name",
                        "required": true,
                        "schema": {
                            "type": "string"
                        }
                    }
                ],
                "tags": [
                    "default"
                ],
                "operationId": "getHostCommandLine",
                "summary": "Get Host Command Line",
                "description": "displays commandline for check command of given hosts.",
                "responses": {
                    "200": {
                        "description": "successful operation"
                    },
                    "400": {
                        "description": "failed operation"
                    }
                }
            }
        },
        "/hosts/{name}/config": {
            "get": {
                "parameters": [
                    {
                        "name": "name",
                        "in": "path",
                        "description": "name",
                        "required": true,
                        "schema": {
                            "type": "string"
                        }
                    }
                ],
                "tags": [
                    "default"
                ],
                "operationId": "getHostConfig",
                "summary": "Get Host Config",
                "description": "Returns configuration for given host. You will find available attributes here: http://www.naemon.org/documentation/usersguide/objectdefinitions.html#host",
                "responses": {
                    "200": {
                        "description": "successful operation"
                    },
                    "400": {
                        "description": "failed operation"
                    }
                }
            },
            "post": {
                "parameters": [
                    {
                        "name": "name",
                        "in": "path",
                        "description": "name",
                        "required": true,
                        "schema": {
                            "type": "string"
                        }
                    }
                ],
                "requestBody": {
                    "description": "body",
                    "required": true,
                    "content": {
                        "*/*": {
                            "schema": {
                                "type": "object"
                            }
                        }
                    }
                },
                "tags": [
                    "default"
                ],
                "operationId": "postHostConfig",
                "summary": "Post Host Config",
                "description": "Replace host configuration completely, use PATCH to only update specific attributes.",
                "responses": {
                    "200": {
                        "description": "successful operation"
                    },
                    "400": {
                        "description": "failed operation"
                    }
                }
            },
            "patch": {
                "parameters": [
                    {
                        "name": "name",
                        "in": "path",
                        "description": "name",
                        "required": true,
                        "schema": {
                            "type": "string"
                        }
                    }
                ],
                "requestBody": {
                    "description": "body",
                    "required": true,
                    "content": {
                        "*/*": {
                            "schema": {
                                "type": "object"
                            }
                        }
                    }
                },
                "tags": [
                    "default"
                ],
                "operationId": "patchHostConfig",
                "summary": "Patch Host Config",
                "description": "Update host configuration partially.",
                "responses": {
                    "200": {
                        "description": "successful operation"
                    },
                    "400": {
                        "description": "failed operation"
                    }
                }
            },
            "delete": {
                "parameters": [
                    {
                        "name": "name",
                        "in": "path",
                        "description": "name",
                        "required": true,
                        "schema": {
                            "type": "string"
                        }
                    }
                ],
                "tags": [
                    "default"
                ],
                "operationId": "deleteHostConfig",
                "summary": "Delete Host Config",
                "description": "Deletes given host from configuration.",
                "responses": {
                    "200": {
                        "description": "successful operation"
                    },
                    "400": {
                        "description": "failed operation"
                    }
                }
            }
        },
        "/hosts/{name}/notifications": {
            "get": {
                "parameters": [
                    {
                        "name": "name",
                        "in": "path",
                        "description": "name",
                        "required": true,
                        "schema": {
                            "type": "string"
                        }
                    }
                ],
                "tags": [
                    "default"
                ],
                "operationId": "getHostNotifications",
                "summary": "Get Host Notifications",
                "description": "lists notifications for given host. alias for /logs?class=3&host_name=<name>",
                "responses": {
                    "200": {
                        "description": "successful operation"
                    },
                    "400": {
                        "description": "failed operation"
                    }
                }
            }
        },
        "/hosts/{name}/outages": {
            "get": {
                "parameters": [
                    {
                        "name": "name",
                        "in": "path",
                        "description": "name",
                        "required": true,
                        "schema": {
                            "type": "string"
                        }
                    }
                ],
                "tags": [
                    "default"
                ],
                "operationId": "getHostOutages",
                "summary": "Get Host Outages",
                "description": "list of outages for this host.",
                "responses": {
                    "200": {
                        "description": "successful operation"
                    },
                    "400": {
                        "description": "failed operation"
                    }
                }
            }
        },
        "/hosts/{name}/services": {
            "get": {
                "parameters": [
                    {
                        "name": "name",
                        "in": "path",
                        "description": "name",
                        "required": true,
                        "schema": {
                            "type": "string"
                        }
                    }
                ],
                "tags": [
                    "default"
                ],
                "operationId": "getHostServices",
                "summary": "Get Host Services",
                "description": "lists services for given host. alias for /services?host_name=<name>",
                "responses": {
                    "200": {
                        "description": "successful operation"
                    },
                    "400": {
                        "description": "failed operation"
                    }
                }
            }
        },
        "/hosts/outages": {
            "get": {
                "parameters": [],
                "tags": [
                    "default"
                ],
                "operationId": "getOutages",
                "summary": "Get Outages",
                "description": "list of outages for all hosts.",
                "responses": {
                    "200": {
                        "description": "successful operation"
                    },
                    "400": {
                        "description": "failed operation"
                    }
                }
            }
        },
        "/hosts/stats": {
            "get": {
                "parameters": [],
                "tags": [
                    "default"
                ],
                "operationId": "getHostStats",
                "summary": "Get Host Stats",
                "description": "hash of livestatus host statistics.",
                "responses": {
                    "200": {
                        "description": "successful operation"
                    },
                    "400": {
                        "description": "failed operation"
                    }
                }
            }
        },
        "/hosts/totals": {
            "get": {
                "parameters": [],
                "tags": [
                    "default"
                ],
                "operationId": "getHostTotals",
                "summary": "Get Host Totals",
                "description": "hash of livestatus host totals statistics. its basically a reduced set of /hosts/stats.",
                "responses": {
                    "200": {
                        "description": "successful operation"
                    },
                    "400": {
                        "description": "failed operation"
                    }
                }
            }
        },
        "/index": {
            "get": {
                "parameters": [],
                "tags": [
                    "default"
                ],
                "operationId": "getIndex",
                "summary": "Get Index",
                "description": "lists all available rest urls.",
                "responses": {
                    "200": {
                        "description": "successful operation"
                    },
                    "400": {
                        "description": "failed operation"
                    }
                }
            }
        },
        "/lmd/sites": {
            "get": {
                "parameters": [],
                "tags": [
                    "default"
                ],
                "operationId": "getLMDSites",
                "summary": "Get LMD Sites",
                "description": "lists connected sites. Only available if LMD (use_lmd) is enabled.",
                "responses": {
                    "200": {
                        "description": "successful operation"
                    },
                    "400": {
                        "description": "failed operation"
                    }
                }
            }
        },
        "/logs": {
            "get": {
                "parameters": [],
                "tags": [
                    "default"
                ],
                "operationId": "getLogs",
                "summary": "Get Logs",
                "description": "lists livestatus logs. see https://www.naemon.org/documentation/usersguide/livestatus.html#log for details.",
                "responses": {
                    "200": {
                        "description": "successful operation"
                    },
                    "400": {
                        "description": "failed operation"
                    }
                }
            }
        },
        "/notifications": {
            "get": {
                "parameters": [],
                "tags": [
                    "default"
                ],
                "operationId": "getNotifications",
                "summary": "Get Notifications",
                "description": "lists notifications based on logfiles. alias for /logs?class=3",
                "responses": {
                    "200": {
                        "description": "successful operation"
                    },
                    "400": {
                        "description": "failed operation"
                    }
                }
            }
        },
        "/processinfo": {
            "get": {
                "parameters": [],
                "tags": [
                    "default"
                ],
                "operationId": "getProcessInfo",
                "summary": "Get Process Info",
                "description": "lists livestatus sites status. see https://www.naemon.org/documentation/usersguide/livestatus.html#status for details.",
                "responses": {
                    "200": {
                        "description": "successful operation"
                    },
                    "400": {
                        "description": "failed operation"
                    }
                }
            }
        },
        "/ /processinfo/stats": {
            "get": {
                "parameters": [],
                "tags": [
                    "default"
                ],
                "operationId": "getProcessInfoStats",
                "summary": "Get Process Info Stats",
                "description": "lists livestatus sites statistics. see https://www.naemon.org/documentation/usersguide/livestatus.html#status for details.",
                "responses": {
                    "200": {
                        "description": "successful operation"
                    },
                    "400": {
                        "description": "failed operation"
                    }
                }
            }
        },
        "/servicegroups": {
            "get": {
                "parameters": [],
                "tags": [
                    "default"
                ],
                "operationId": "getServiceGroups",
                "summary": "Get Service Groups",
                "description": "lists livestatus servicegroups. see https://www.naemon.org/documentation/usersguide/livestatus.html#servicegroups for details.",
                "responses": {
                    "200": {
                        "description": "successful operation"
                    },
                    "400": {
                        "description": "failed operation"
                    }
                }
            }
        },
        "/servicegroups/{name}": {
            "get": {
                "parameters": [
                    {
                        "name": "name",
                        "in": "path",
                        "description": "name",
                        "required": true,
                        "schema": {
                            "type": "string"
                        }
                    }
                ],
                "tags": [
                    "default"
                ],
                "operationId": "getServiceGroup",
                "summary": "Get Service Group",
                "description": "lists servicegroups for given name. alias for /servicegroups?name=<name>",
                "responses": {
                    "200": {
                        "description": "successful operation"
                    },
                    "400": {
                        "description": "failed operation"
                    }
                }
            }
        },
        "/servicegroups/{name}/config": {
            "get": {
                "parameters": [
                    {
                        "name": "name",
                        "in": "path",
                        "description": "name",
                        "required": true,
                        "schema": {
                            "type": "string"
                        }
                    }
                ],
                "tags": [
                    "default"
                ],
                "operationId": "getServiceGroupConfig",
                "summary": "Get Service Group Config",
                "description": "Returns configuration for given servicegroup. You will find available attributes here: http://www.naemon.org/documentation/usersguide/objectdefinitions.html#servicegroup",
                "responses": {
                    "200": {
                        "description": "successful operation"
                    },
                    "400": {
                        "description": "failed operation"
                    }
                }
            },
            "post": {
                "parameters": [
                    {
                        "name": "name",
                        "in": "path",
                        "description": "name",
                        "required": true,
                        "schema": {
                            "type": "string"
                        }
                    }
                ],
                "requestBody": {
                    "description": "body",
                    "required": true,
                    "content": {
                        "*/*": {
                            "schema": {
                                "type": "object"
                            }
                        }
                    }
                },
                "tags": [
                    "default"
                ],
                "operationId": "postServiceGroupConfig",
                "summary": "Post Service Group Config",
                "description": "Replace servicegroup configuration completely, use PATCH to only update specific attributes.",
                "responses": {
                    "200": {
                        "description": "successful operation"
                    },
                    "400": {
                        "description": "failed operation"
                    }
                }
            },
            "patch": {
                "parameters": [
                    {
                        "name": "name",
                        "in": "path",
                        "description": "name",
                        "required": true,
                        "schema": {
                            "type": "string"
                        }
                    }
                ],
                "requestBody": {
                    "description": "body",
                    "required": true,
                    "content": {
                        "*/*": {
                            "schema": {
                                "type": "object"
                            }
                        }
                    }
                },
                "tags": [
                    "default"
                ],
                "operationId": "patchServiceGroupConfig",
                "summary": "Patch Service Group Config",
                "description": "Update servicegroup configuration partially.",
                "responses": {
                    "200": {
                        "description": "successful operation"
                    },
                    "400": {
                        "description": "failed operation"
                    }
                }
            },
            "delete": {
                "parameters": [
                    {
                        "name": "name",
                        "in": "path",
                        "description": "name",
                        "required": true,
                        "schema": {
                            "type": "string"
                        }
                    }
                ],
                "tags": [
                    "default"
                ],
                "operationId": "deleteServiceGroupConfig",
                "summary": "Delete Service Group Config",
                "description": "Deletes given servicegroup from configuration.",
                "responses": {
                    "200": {
                        "description": "successful operation"
                    },
                    "400": {
                        "description": "failed operation"
                    }
                }
            }
        },
        "/servicegroups/{name}/outages": {
            "get": {
                "parameters": [
                    {
                        "name": "name",
                        "in": "path",
                        "description": "name",
                        "required": true,
                        "schema": {
                            "type": "string"
                        }
                    }
                ],
                "tags": [
                    "default"
                ],
                "operationId": "getServiceGroupOutages",
                "summary": "Get Service Group Outages",
                "description": "list of outages for this servicegroup.",
                "responses": {
                    "200": {
                        "description": "successful operation"
                    },
                    "400": {
                        "description": "failed operation"
                    }
                }
            }
        },
        "/servicegroups/{name}/stats": {
            "get": {
                "parameters": [
                    {
                        "name": "name",
                        "in": "path",
                        "description": "name",
                        "required": true,
                        "schema": {
                            "type": "string"
                        }
                    }
                ],
                "tags": [
                    "default"
                ],
                "operationId": "getServiceGroupStats",
                "summary": "Get Service Group Stats",
                "description": "hash of livestatus servicegroup statistics. alias for /services/stats?service_groups[gte]=<name>",
                "responses": {
                    "200": {
                        "description": "successful operation"
                    },
                    "400": {
                        "description": "failed operation"
                    }
                }
            }
        },
        "/services": {
            "get": {
                "parameters": [],
                "tags": [
                    "default"
                ],
                "operationId": "getServices",
                "summary": "Get Services",
                "description": "lists livestatus services. see https://www.naemon.org/documentation/usersguide/livestatus.html#services for details. there is an alias /services.",
                "responses": {
                    "200": {
                        "description": "successful operation"
                    },
                    "400": {
                        "description": "failed operation"
                    }
                }
            }
        },
        "/services/{host}/{service}": {
            "get": {
                "parameters": [
                    {
                        "name": "host",
                        "in": "path",
                        "description": "host",
                        "required": true,
                        "schema": {
                            "type": "string"
                        }
                    },
                    {
                        "name": "service",
                        "in": "path",
                        "description": "service",
                        "schema": {
                            "type": "string"
                        },
                        "required": true
                    }
                ],
                "tags": [
                    "default"
                ],
                "operationId": "getHostService",
                "summary": "Get Host Service",
                "description": "lists services for given host and name. alias for /services?host_name=<host_name>&description=<service>",
                "responses": {
                    "200": {
                        "description": "successful operation"
                    },
                    "400": {
                        "description": "failed operation"
                    }
                }
            }
        },
        "/services/{host}/{service}/commandline": {
            "get": {
                "parameters": [
                    {
                        "name": "host",
                        "in": "path",
                        "description": "host",
                        "required": true,
                        "schema": {
                            "type": "string"
                        }
                    },
                    {
                        "name": "service",
                        "in": "path",
                        "description": "service",
                        "schema": {
                            "type": "string"
                        },
                        "required": true
                    }
                ],
                "tags": [
                    "default"
                ],
                "operationId": "getHostServiceCommandLine",
                "summary": "Get Host Service Command Line",
                "description": "displays commandline for check command of given services.",
                "responses": {
                    "200": {
                        "description": "successful operation"
                    },
                    "400": {
                        "description": "failed operation"
                    }
                }
            }
        },
        "/services/{host}/{service}/config": {
            "get": {
                "parameters": [
                    {
                        "name": "host",
                        "in": "path",
                        "description": "host",
                        "required": true,
                        "schema": {
                            "type": "string"
                        }
                    },
                    {
                        "name": "service",
                        "in": "path",
                        "description": "service",
                        "required": true,
                        "schema": {
                            "type": "string"
                        }
                    }
                ],
                "tags": [
                    "default"
                ],
                "operationId": "getHostServiceConfig",
                "summary": "Get Host Service Config",
                "description": "Returns configuration for given service. You will find available attributes here: http://www.naemon.org/documentation/usersguide/objectdefinitions.html#service",
                "responses": {
                    "200": {
                        "description": "successful operation"
                    },
                    "400": {
                        "description": "failed operation"
                    }
                }
            },
            "post": {
                "parameters": [
                    {
                        "name": "host",
                        "in": "path",
                        "description": "host",
                        "schema": {
                            "type": "string"
                        },
                        "required": true
                    },
                    {
                        "name": "service",
                        "in": "path",
                        "description": "service",
                        "required": true,
                        "schema": {
                            "type": "string"
                        }
                    }
                ],
                "requestBody": {
                    "description": "body",
                    "required": true,
                    "content": {
                        "*/*": {
                            "schema": {
                                "type": "object"
                            }
                        }
                    }
                },
                "tags": [
                    "default"
                ],
                "operationId": "postHostServiceConfig",
                "summary": "Post Host Service Config",
                "description": "Replace service configuration completely, use PATCH to only update specific attributes.",
                "responses": {
                    "200": {
                        "description": "successful operation"
                    },
                    "400": {
                        "description": "failed operation"
                    }
                }
            },
            "patch": {
                "parameters": [
                    {
                        "name": "host",
                        "in": "path",
                        "description": "host",
                        "required": true,
                        "schema": {
                            "type": "string"
                        }
                    },
                    {
                        "name": "service",
                        "in": "path",
                        "description": "service",
                        "required": true,
                        "schema": {
                            "type": "string"
                        }
                    }
                ],
                "requestBody": {
                    "description": "body",
                    "required": true,
                    "content": {
                        "*/*": {
                            "schema": {
                                "type": "object"
                            }
                        }
                    }
                },
                "tags": [
                    "default"
                ],
                "operationId": "patchHostServiceConfig",
                "summary": "Patch Host Service Config",
                "description": "Update service configuration partially.",
                "responses": {
                    "200": {
                        "description": "successful operation"
                    },
                    "400": {
                        "description": "failed operation"
                    }
                }
            },
            "delete": {
                "parameters": [
                    {
                        "name": "host",
                        "in": "path",
                        "description": "host",
                        "required": true,
                        "schema": {
                            "type": "string"
                        }
                    },
                    {
                        "name": "service",
                        "in": "path",
                        "description": "service",
                        "schema": {
                            "type": "string"
                        },
                        "required": true
                    }
                ],
                "tags": [
                    "default"
                ],
                "operationId": "deleteHostServiceConfig",
                "summary": "Delete Host Service Config",
                "description": "Deletes given service from configuration.",
                "responses": {
                    "200": {
                        "description": "successful operation"
                    },
                    "400": {
                        "description": "failed operation"
                    }
                }
            }
        },
        "/services/{host}/{service}/outages": {
            "get": {
                "parameters": [
                    {
                        "name": "host",
                        "in": "path",
                        "description": "host",
                        "schema": {
                            "type": "string"
                        },
                        "required": true
                    },
                    {
                        "name": "service",
                        "in": "path",
                        "description": "service",
                        "schema": {
                            "type": "string"
                        },
                        "required": true
                    }
                ],
                "tags": [
                    "default"
                ],
                "operationId": "getHostServiceOutages",
                "summary": "Get Host Service Outages",
                "description": "list of outages for this service.",
                "responses": {
                    "200": {
                        "description": "successful operation"
                    },
                    "400": {
                        "description": "failed operation"
                    }
                }
            }
        },
        "/services/outages": {
            "get": {
                "parameters": [],
                "tags": [
                    "default"
                ],
                "operationId": "getServicesOutages",
                "summary": "Get Services Outages",
                "description": "list of outages for all services.",
                "responses": {
                    "200": {
                        "description": "successful operation"
                    },
                    "400": {
                        "description": "failed operation"
                    }
                }
            }
        },
        "/services/stats": {
            "get": {
                "parameters": [],
                "tags": [
                    "default"
                ],
                "operationId": "getServicesStats",
                "summary": "Get Services Stats",
                "description": "livestatus service statistics",
                "responses": {
                    "200": {
                        "description": "successful operation"
                    },
                    "400": {
                        "description": "failed operation"
                    }
                }
            }
        },
        "/services/totals": {
            "get": {
                "parameters": [],
                "tags": [
                    "default"
                ],
                "operationId": "getServicesTotals",
                "summary": "Get Services Totals",
                "description": "livestatus service totals statistics. its basically a reduced set of /services/stats.",
                "responses": {
                    "200": {
                        "description": "successful operation"
                    },
                    "400": {
                        "description": "failed operation"
                    }
                }
            }
        },
        "/sites": {
            "get": {
                "parameters": [],
                "tags": [
                    "default"
                ],
                "operationId": "getSites",
                "summary": "Get Sites",
                "description": "lists configured backends",
                "responses": {
                    "200": {
                        "description": "successful operation"
                    },
                    "400": {
                        "description": "failed operation"
                    }
                }
            }
        },
        "/thruk": {
            "get": {
                "parameters": [],
                "tags": [
                    "default"
                ],
                "operationId": "getThruk",
                "summary": "getThruk",
                "description": "hash of basic information about this thruk instance",
                "responses": {
                    "200": {
                        "description": "successful operation"
                    },
                    "400": {
                        "description": "failed operation"
                    }
                }
            }
        },
        "/thruk/whoami": {
            "get": {
                "parameters": [],
                "tags": [
                    "default"
                ],
                "operationId": "getThrukWhoami",
                "summary": "Get Thruk whoami",
                "description": "show current profile information. alias for /thruk/users?id=<id>",
                "responses": {
                    "200": {
                        "description": "successful operation"
                    },
                    "400": {
                        "description": "failed operation"
                    }
                }
            }
        },
        "/timeperiods": {
            "get": {
                "parameters": [],
                "tags": [
                    "default"
                ],
                "operationId": "getTimePeriods",
                "summary": "Get Time Periods",
                "description": "lists livestatus timeperiods. see https://www.naemon.org/documentation/usersguide/livestatus.html#timeperiods for details.",
                "responses": {
                    "200": {
                        "description": "successful operation"
                    },
                    "400": {
                        "description": "failed operation"
                    }
                }
            }
        },
        "/timeperiods/{name}": {
            "get": {
                "parameters": [
                    {
                        "name": "name",
                        "in": "path",
                        "description": "name",
                        "required": true,
                        "schema": {
                            "type": "string"
                        }
                    }
                ],
                "tags": [
                    "default"
                ],
                "operationId": "getTimePeriod",
                "summary": "Get Time Period",
                "description": "lists timeperiods for given name. alias for /timeperiods?name=<name>",
                "responses": {
                    "200": {
                        "description": "successful operation"
                    },
                    "400": {
                        "description": "failed operation"
                    }
                }
            }
        },
        "/timeperiods/{name}/config": {
            "get": {
                "parameters": [
                    {
                        "name": "name",
                        "in": "path",
                        "description": "name",
                        "required": true,
                        "schema": {
                            "type": "string"
                        }
                    }
                ],
                "tags": [
                    "default"
                ],
                "operationId": "getTimePeriodConfig",
                "summary": "Get Time Period Config",
                "description": "Returns configuration for given timeperiod. You will find available attributes here: http://www.naemon.org/documentation/usersguide/objectdefinitions.html#timeperiod",
                "responses": {
                    "200": {
                        "description": "successful operation"
                    },
                    "400": {
                        "description": "failed operation"
                    }
                }
            },
            "post": {
                "parameters": [
                    {
                        "name": "name",
                        "in": "path",
                        "description": "name",
                        "schema": {
                            "type": "string"
                        },
                        "required": true
                    }
                ],
                "requestBody": {
                    "description": "body",
                    "required": true,
                    "content": {
                        "*/*": {
                            "schema": {
                                "type": "object"
                            }
                        }
                    }
                },
                "tags": [
                    "default"
                ],
                "operationId": "postTimePeriodConfig",
                "summary": "Post Time Period Config",
                "description": "Replace timeperiod configuration completely, use PATCH to only update specific attributes.",
                "responses": {
                    "200": {
                        "description": "successful operation"
                    },
                    "400": {
                        "description": "failed operation"
                    }
                }
            },
            "patch": {
                "parameters": [
                    {
                        "name": "name",
                        "in": "path",
                        "description": "name",
                        "required": true,
                        "schema": {
                            "type": "string"
                        }
                    }
                ],
                "requestBody": {
                    "description": "body",
                    "required": true,
                    "content": {
                        "*/*": {
                            "schema": {
                                "type": "object"
                            }
                        }
                    }
                },
                "tags": [
                    "default"
                ],
                "operationId": "patchTimePeriodConfig",
                "summary": "Patch Time Period Config",
                "description": "Update timeperiods configuration partially.",
                "responses": {
                    "200": {
                        "description": "successful operation"
                    },
                    "400": {
                        "description": "failed operation"
                    }
                }
            },
            "delete": {
                "parameters": [
                    {
                        "name": "name",
                        "in": "path",
                        "description": "name",
                        "required": true,
                        "schema": {
                            "type": "string"
                        }
                    }
                ],
                "tags": [
                    "default"
                ],
                "operationId": "deleteTimePeriodConfig",
                "summary": "Delete Time Period Config",
                "description": "Deletes given timeperiod from configuration.",
                "responses": {
                    "200": {
                        "description": "successful operation"
                    },
                    "400": {
                        "description": "failed operation"
                    }
                }
            }
        }
    },
    "externalDocs": {
        "description": "Find out more about the OpenAPI Initiative",
        "url": "https://www.openapis.org/"
    },
    "tags": [
        {
            "name": "default",
            "description": ""
        }
    ],
    "components": {
        "securitySchemes": {}
    }
}