{
  "ValidationKey": "string",
  "CountOfElements": [
    {
      "EngineId": 7,
      "Count": 3
    },
    {
      "EngineId": 1,
      "Count": 6
    },
    {
      "EngineId": 7,
      "Count": 9
    },
    {
      "EngineId": 7,
      "Count": 5
    },
    {
      "EngineId": 3,
      "Count": 3
    },
    {
      "EngineId": 4,
      "Count": 7
    }
  ]
}