{
  "MultiLineRulePatterns": [
    {
      "EndBracket": "string",
      "PatternType": "string",
      "Condition": "string",
      "Pattern": "string",
      "Criteria": false,
      "BeginBracket": "string",
      "RuleId": "string",
      "PatternId": "string"
    },
    {
      "EndBracket": "string",
      "PatternType": "string",
      "Condition": "string",
      "Pattern": "string",
      "Criteria": false,
      "BeginBracket": "string",
      "RuleId": "string",
      "PatternId": "string"
    },
    {
      "EndBracket": "string",
      "PatternType": "string",
      "Condition": "string",
      "Pattern": "string",
      "Criteria": false,
      "BeginBracket": "string",
      "RuleId": "string",
      "PatternId": "string"
    },
    {
      "EndBracket": "string",
      "PatternType": "string",
      "Condition": "string",
      "Pattern": "string",
      "Criteria": true,
      "BeginBracket": "string",
      "RuleId": "string",
      "PatternId": "string"
    },
    {
      "EndBracket": "string",
      "PatternType": "string",
      "Condition": "string",
      "Pattern": "string",
      "Criteria": false,
      "BeginBracket": "string",
      "RuleId": "string",
      "PatternId": "string"
    },
    {
      "EndBracket": "string",
      "PatternType": "string",
      "Condition": "string",
      "Pattern": "string",
      "Criteria": true,
      "BeginBracket": "string",
      "RuleId": "string",
      "PatternId": "string"
    }
  ],
  "RuleId": "string",
  "RuleName": "string",
  "Comments": "string",
  "Grouping": "string",
  "RemediateScript": "string",
  "ConfigBlockStart": "string",
  "ConfigBlockEnd": "string",
  "ConfigBlockPatternType": "string",
  "ConfigBlockMustExist": false,
  "PatternType": "string",
  "PatternMustExist": true,
  "AdvancedMode": true,
  "ErrorLevel": 5,
  "SimplePatternText": "string",
  "ExecuteScriptAutomatically": false,
  "Owner": "string",
  "RemediateScriptType": "string",
  "ExecuteRemediationScriptPerBlock": true,
  "ExecuteScriptInConfigMode": true
}