{
  "$id": "schema.json",
  "type": "object",
  "schema": "http://json-schema.org/draft-07/schema#",
  "translate": false,
  "dynamicfields": true,
  "properties": {
    "ph_request_type": {
      "type": "string",
      "description": "type of request (internal to adapter)",
      "default": "postInvokeOrionADMNodeInventoryPollNow",
      "enum": [
        "postInvokeOrionADMNodeInventoryPollNow",
        "postInvokeOrionADMNodeInventoryEnable",
        "postInvokeOrionADMNodeInventoryDisable",
        "postInvokeOrionADMNodeInventorySchedulePollNow",
        "postInvokeOrionADMNodeInventoryScheduleEnable",
        "postInvokeOrionADMNodeInventoryUninstallConnectionQualityAgentPlugin",
        "postInvokeOrionAgentManagementAgentDeploy",
        "postInvokeOrionAgentManagementAgentDeployToNode",
        "postInvokeOrionAgentManagementAgentDeployPlugin",
        "postInvokeOrionAgentManagementAgentRedeployPlugin",
        "postInvokeOrionAgentManagementAgentUninstallPlugin",
        "postInvokeOrionAgentManagementAgentUninstall",
        "postInvokeOrionAgentManagementAgentDelete",
        "postInvokeOrionAgentManagementAgentApproveReboot",
        "postInvokeOrionAgentManagementAgentApproveUpdate",
        "postInvokeOrionAgentManagementAgentTestWithEngine",
        "postInvokeOrionAgentManagementAgentAssignToEngine",
        "postInvokeOrionAgentManagementAgentValidateDeploymentCredentials",
        "postInvokeOrionAgentManagementAgentRestartAgent",
        "postInvokeOrionAPMIISSiteStart",
        "postInvokeOrionAPMIISSiteStop",
        "postInvokeOrionAPMIISSiteRestart",
        "postInvokeOrionAPMIISApplicationPoolStart",
        "postInvokeOrionAPMIISApplicationPoolStop",
        "postInvokeOrionAPMIISApplicationPoolRestart",
        "postInvokeOrionAPMApplicationUnmanage",
        "postInvokeOrionAPMApplicationRemanage",
        "postInvokeOrionAPMApplicationCreateApplication",
        "postInvokeOrionAPMApplicationDeleteApplication",
        "postInvokeOrionAPMApplicationPollNow",
        "postInvokeOrionAPMApplicationCustomPropertiesCreateCustomProperty",
        "postInvokeOrionAPMApplicationCustomPropertiesCreateCustomPropertyWithValues",
        "postInvokeOrionAPMApplicationCustomPropertiesModifyCustomProperty",
        "postInvokeOrionAPMApplicationCustomPropertiesDeleteCustomProperty",
        "postInvokeOrionAPMApplicationTemplateUpdateApplicationTemplateSettings",
        "postInvokeOrionAPMApplicationTemplateDeleteTemplate",
        "postInvokeOrionAPMServerManagementStartService",
        "postInvokeOrionAPMServerManagementStopService",
        "postInvokeOrionAPMServerManagementRestartService",
        "postInvokeOrionAPMServerManagementRebootNode",
        "postInvokeOrionStacksRelationTraverse",
        "postInvokeOrionStacksRelationProcessUi",
        "postInvokeOrionASANodeExecuteCliCommand",
        "postInvokeOrionASAInterfacesSetFavorite",
        "postInvokeOrionASAInterfacesRemoveFavorite",
        "postInvokeCirrusNCMNCMJobsGetJob",
        "postInvokeCirrusNCMNCMJobsUpdateJob",
        "postInvokeCirrusNCMNCMJobsAddJob",
        "postInvokeCirrusNCMNCMJobsDeleteJobs",
        "postInvokeCirrusNCMNCMJobsEnableOrDisableJobs",
        "postInvokeCirrusNCMNCMJobsClearJobLog",
        "postInvokeCirrusNCMNCMJobsGetJobStatus",
        "postInvokeCirrusNCMNCMJobsGetJobLog",
        "postInvokeCirrusInventoryQueueStartInventory",
        "postInvokeCirrusInventoryQueueReportError",
        "postInvokeCirrusInventoryQueueCancelInventory",
        "postInvokeCirrusInventoryQueueClearInventory",
        "postInvokeNCMVulnerabilitiesAnnouncementsStartVulnerabilityMatching",
        "postInvokeNCMVulnerabilitiesAnnouncementsIsVulnerabilityMatchingActive",
        "postInvokeNCMVulnerabilitiesAnnouncementsInitVulnerabilitySchedule",
        "postInvokeCirrusConfigSnippetsAddSnippet",
        "postInvokeCirrusConfigSnippetsGetSnippet",
        "postInvokeCirrusConfigSnippetsUpdateSnippet",
        "postInvokeCirrusConfigSnippetsDeleteSnippets",
        "postInvokeCirrusConfigSnippetsImportSnippets",
        "postInvokeCirrusConfigSnippetsCopySnippets",
        "postInvokeCirrusConfigSnippetsGetTagsList",
        "postInvokeCirrusConfigSnippetsGetTagsListForSnippets",
        "postInvokeCirrusConfigSnippetsAddTags",
        "postInvokeCirrusConfigSnippetsDeleteTags",
        "postInvokeCirrusConfigSnippetsSaveSnippetAsCopy",
        "postInvokeCirrusConfigArchiveDownload",
        "postInvokeCirrusConfigArchiveGetStatus",
        "postInvokeCirrusConfigArchiveGetStatusWithLimitations",
        "postInvokeCirrusConfigArchiveUpload",
        "postInvokeCirrusConfigArchiveExecute",
        "postInvokeCirrusConfigArchiveCancelTransfer",
        "postInvokeCirrusConfigArchiveCancelTransferWithLimitations",
        "postInvokeCirrusConfigArchiveClearComplete",
        "postInvokeCirrusConfigArchiveClearCompleteWithLimitations",
        "postInvokeCirrusConfigArchiveClearErrors",
        "postInvokeCirrusConfigArchiveClearErrorsWithLimitations",
        "postInvokeCirrusConfigArchiveClearAll",
        "postInvokeCirrusConfigArchiveClearAllWithLimitations",
        "postInvokeCirrusConfigArchiveGetPermissionsByRole",
        "postInvokeCirrusConfigArchiveDeleteConfigs",
        "postInvokeCirrusConfigArchiveGetConfigTypes",
        "postInvokeCirrusConfigArchiveReportError",
        "postInvokeCirrusConfigArchiveCancelTransfers",
        "postInvokeCirrusConfigArchiveClearTransfers",
        "postInvokeCirrusConfigArchiveExecuteScript",
        "postInvokeCirrusConfigArchiveUploadConfig",
        "postInvokeCirrusConfigArchiveDownloadConfig",
        "postInvokeCirrusConfigArchiveExecuteScriptOnNodes",
        "postInvokeCirrusConfigArchiveDownloadConfigOnNodes",
        "postInvokeCirrusConfigArchiveConfigSearch",
        "postInvokeCirrusConfigArchiveRunIndexOptimization",
        "postInvokeCirrusConfigArchiveUpdateConfig",
        "postInvokeCirrusConfigArchiveCloneConfig",
        "postInvokeCirrusConfigArchiveImportConfig",
        "postInvokeCirrusConfigArchiveSetClearBaseline",
        "postInvokeCirrusConfigArchiveValidateBinaryConfigStorage",
        "postInvokeCirrusConfigArchiveSearchInterfaceConfigSnippet",
        "postInvokeCirrusConfigArchiveGetInterfaceConfigSnippets",
        "postInvokeCirrusSnippetArchiveAddSnippet",
        "postInvokeCirrusSnippetArchiveDeleteSnippet",
        "postInvokeCirrusSnippetArchiveUpdateSnippet",
        "postInvokeCirrusPolicyReportsTestRule",
        "postInvokeCirrusPolicyReportsGetPolicyReport",
        "postInvokeCirrusPolicyReportsUpdatePolicyReport",
        "postInvokeCirrusPolicyReportsAddPolicyReport",
        "postInvokeCirrusPolicyReportsDeletePolicyReports",
        "postInvokeCirrusPolicyReportsGetPolicy",
        "postInvokeCirrusPolicyReportsUpdatePolicy",
        "postInvokeCirrusPolicyReportsAddPolicy",
        "postInvokeCirrusPolicyReportsDeletePolicies",
        "postInvokeCirrusPolicyReportsGetPolicyRule",
        "postInvokeCirrusPolicyReportsUpdatePolicyRule",
        "postInvokeCirrusPolicyReportsAddPolicyRule",
        "postInvokeCirrusPolicyReportsDeletePolicyRules",
        "postInvokeCirrusPolicyReportsStartCaching",
        "postInvokeCirrusPolicyReportsUpdateReportStatus",
        "postInvokeCirrusPolicyReportsGetPagablePoliciesList",
        "postInvokeCirrusPolicyReportsGetPoliciesRowCount",
        "postInvokeCirrusPolicyReportsGetPagablePolicyRulesList",
        "postInvokeCirrusPolicyReportsGetPolicyRulesRowCount",
        "postInvokeCirrusPolicyReportsGetComplianceDataTable",
        "postInvokeCirrusPolicyReportsGetComplianceColumnsInJSON",
        "postInvokeCirrusPolicyReportsGetRowNumber",
        "postInvokeCirrusPolicyReportsGenerateRemediationScriptForNodes",
        "postInvokeNCMEosBeginRefreshAll",
        "postInvokeNCMEosRefreshNow",
        "postInvokeNCMEosIsRefreshingAll",
        "postInvokeNCMEosInitSchedule",
        "postInvokeNCMFirmwareStorageValidateFirmwareStorage",
        "postInvokeNCMFirmwareStorageDeleteFirmwareImages",
        "postInvokeNCMFirmwareDefinitionsGetFirmwareDefinition",
        "postInvokeNCMFirmwareDefinitionsAddFirmwareDefinition",
        "postInvokeNCMFirmwareDefinitionsUpdateFirmwareDefinition",
        "postInvokeNCMFirmwareDefinitionsDeleteFirmwareDefinitions",
        "postInvokeNCMFirmwareOperationsPrepareFirmwareUpgrade",
        "postInvokeNCMFirmwareOperationsPrepareRollBack",
        "postInvokeNCMFirmwareOperationsPrepareReExecuteFailed",
        "postInvokeNCMFirmwareOperationsStartUpgrade",
        "postInvokeNCMFirmwareOperationsCancelUpgrade",
        "postInvokeNCMFirmwareOperationsGenerateScriptPreview",
        "postInvokeCirrusReportsRun",
        "postInvokeCirrusReportsRunPagable",
        "postInvokeCirrusReportsGetRecordsCount",
        "postInvokeCirrusReportsGetDiplayableColumns",
        "postInvokeOrionGroupCustomPropertiesCreateCustomProperty",
        "postInvokeOrionGroupCustomPropertiesCreateCustomPropertyWithValues",
        "postInvokeOrionGroupCustomPropertiesModifyCustomProperty",
        "postInvokeOrionGroupCustomPropertiesDeleteCustomProperty",
        "postInvokeOrionGroupCustomPropertiesValidateCustomProperty",
        "postInvokeOrionContainerMemberDefinitionGetMembers",
        "postInvokeOrionContainerMemberDefinitionGetFirstNMembers",
        "postInvokeCortexManagementPublishEvent",
        "postInvokeCortexOrionCiscoAciApicCoreAssignToEngine",
        "postInvokeCortexOrionCiscoAciApicCoreGetSupportedMetrics",
        "postInvokeCortexOrionCiscoAciApicCoreInventoryNow",
        "postInvokeCortexOrionCiscoAciApicCorePollNow",
        "postInvokeCortexOrionCiscoAciApicCoreSetPolling",
        "postInvokeCortexOrionCiscoAciApicCoreStartRealTimePolling",
        "postInvokeCortexOrionCiscoAciApicCoreStopRealTimePolling",
        "postInvokeCortexOrionCiscoAciApicOrionCiscoAciAssignAciPolling",
        "postInvokeCortexOrionCiscoAciApicOrionCiscoAciGetPollInterval",
        "postInvokeCortexOrionCiscoAciApicOrionCiscoAciIsAciPollingAssigned",
        "postInvokeCortexOrionCiscoAciApicOrionCiscoAciSyncAciCredentialsWithOrion",
        "postInvokeCortexOrionCiscoAciApicOrionCiscoAciTestAciCredentials",
        "postInvokeCortexOrionCiscoAciApicOrionCiscoAciUnassignAciPolling",
        "postInvokeCortexOrionCiscoAciApplicationProfileCoreAssignToEngine",
        "postInvokeCortexOrionCiscoAciApplicationProfileCoreGetSupportedMetrics",
        "postInvokeCortexOrionCiscoAciApplicationProfileCoreInventoryNow",
        "postInvokeCortexOrionCiscoAciApplicationProfileCorePollNow",
        "postInvokeCortexOrionCiscoAciApplicationProfileCoreSetPolling",
        "postInvokeCortexOrionCiscoAciApplicationProfileCoreStartRealTimePolling",
        "postInvokeCortexOrionCiscoAciApplicationProfileCoreStopRealTimePolling",
        "postInvokeCortexOrionCiscoAciEndpointGroupCoreAssignToEngine",
        "postInvokeCortexOrionCiscoAciEndpointGroupCoreGetSupportedMetrics",
        "postInvokeCortexOrionCiscoAciEndpointGroupCoreInventoryNow",
        "postInvokeCortexOrionCiscoAciEndpointGroupCorePollNow",
        "postInvokeCortexOrionCiscoAciEndpointGroupCoreSetPolling",
        "postInvokeCortexOrionCiscoAciEndpointGroupCoreStartRealTimePolling",
        "postInvokeCortexOrionCiscoAciEndpointGroupCoreStopRealTimePolling",
        "postInvokeCortexOrionCiscoAciFabricCoreAssignToEngine",
        "postInvokeCortexOrionCiscoAciFabricCoreGetSupportedMetrics",
        "postInvokeCortexOrionCiscoAciFabricCoreInventoryNow",
        "postInvokeCortexOrionCiscoAciFabricCorePollNow",
        "postInvokeCortexOrionCiscoAciFabricCoreSetPolling",
        "postInvokeCortexOrionCiscoAciFabricCoreStartRealTimePolling",
        "postInvokeCortexOrionCiscoAciFabricCoreStopRealTimePolling",
        "postInvokeCortexOrionCiscoAciPhysicalEntityCoreAssignToEngine",
        "postInvokeCortexOrionCiscoAciPhysicalEntityCoreGetSupportedMetrics",
        "postInvokeCortexOrionCiscoAciPhysicalEntityCoreInventoryNow",
        "postInvokeCortexOrionCiscoAciPhysicalEntityCorePollNow",
        "postInvokeCortexOrionCiscoAciPhysicalEntityCoreSetPolling",
        "postInvokeCortexOrionCiscoAciPhysicalEntityCoreStartRealTimePolling",
        "postInvokeCortexOrionCiscoAciPhysicalEntityCoreStopRealTimePolling",
        "postInvokeCortexOrionCiscoAciTenantCoreAssignToEngine",
        "postInvokeCortexOrionCiscoAciTenantCoreGetSupportedMetrics",
        "postInvokeCortexOrionCiscoAciTenantCoreInventoryNow",
        "postInvokeCortexOrionCiscoAciTenantCorePollNow",
        "postInvokeCortexOrionCiscoAciTenantCoreSetPolling",
        "postInvokeCortexOrionCiscoAciTenantCoreStartRealTimePolling",
        "postInvokeCortexOrionCiscoAciTenantCoreStopRealTimePolling",
        "postInvokeCortexOrionCmanContainerCoreAssignToEngine",
        "postInvokeCortexOrionCmanContainerCoreGetSupportedMetrics",
        "postInvokeCortexOrionCmanContainerCoreInventoryNow",
        "postInvokeCortexOrionCmanContainerCorePollNow",
        "postInvokeCortexOrionCmanContainerCoreSetPolling",
        "postInvokeCortexOrionCmanContainerCoreStartRealTimePolling",
        "postInvokeCortexOrionCmanContainerCoreStopRealTimePolling",
        "postInvokeCortexOrionCmanContainerAgentCoreAssignToEngine",
        "postInvokeCortexOrionCmanContainerAgentCoreGetSupportedMetrics",
        "postInvokeCortexOrionCmanContainerAgentCoreInventoryNow",
        "postInvokeCortexOrionCmanContainerAgentCorePollNow",
        "postInvokeCortexOrionCmanContainerAgentCoreSetPolling",
        "postInvokeCortexOrionCmanContainerAgentCoreStartRealTimePolling",
        "postInvokeCortexOrionCmanContainerAgentCoreStopRealTimePolling",
        "postInvokeCortexOrionCmanContainerEnvironmentVariableCoreAssignToEngine",
        "postInvokeCortexOrionCmanContainerEnvironmentVariableCoreGetSupportedMetrics",
        "postInvokeCortexOrionCmanContainerEnvironmentVariableCoreInventoryNow",
        "postInvokeCortexOrionCmanContainerEnvironmentVariableCorePollNow",
        "postInvokeCortexOrionCmanContainerEnvironmentVariableCoreSetPolling",
        "postInvokeCortexOrionCmanContainerEnvironmentVariableCoreStartRealTimePolling",
        "postInvokeCortexOrionCmanContainerEnvironmentVariableCoreStopRealTimePolling",
        "postInvokeCortexOrionCmanContainerHostCoreAssignToEngine",
        "postInvokeCortexOrionCmanContainerHostCoreGetSupportedMetrics",
        "postInvokeCortexOrionCmanContainerHostCoreInventoryNow",
        "postInvokeCortexOrionCmanContainerHostCorePollNow",
        "postInvokeCortexOrionCmanContainerHostCoreSetPolling",
        "postInvokeCortexOrionCmanContainerHostCoreStartRealTimePolling",
        "postInvokeCortexOrionCmanContainerHostCoreStopRealTimePolling",
        "postInvokeCortexOrionCmanContainerImageCoreAssignToEngine",
        "postInvokeCortexOrionCmanContainerImageCoreGetSupportedMetrics",
        "postInvokeCortexOrionCmanContainerImageCoreInventoryNow",
        "postInvokeCortexOrionCmanContainerImageCorePollNow",
        "postInvokeCortexOrionCmanContainerImageCoreSetPolling",
        "postInvokeCortexOrionCmanContainerImageCoreStartRealTimePolling",
        "postInvokeCortexOrionCmanContainerImageCoreStopRealTimePolling",
        "postInvokeCortexOrionMonitoringElementCoreAssignToEngine",
        "postInvokeCortexOrionMonitoringElementCoreGetSupportedMetrics",
        "postInvokeCortexOrionMonitoringElementCoreInventoryNow",
        "postInvokeCortexOrionMonitoringElementCorePollNow",
        "postInvokeCortexOrionMonitoringElementCoreSetPolling",
        "postInvokeCortexOrionMonitoringElementCoreStartRealTimePolling",
        "postInvokeCortexOrionMonitoringElementCoreStopRealTimePolling",
        "postInvokeCortexOrionInterfaceCoreAddToCortex",
        "postInvokeCortexOrionInterfaceCoreAssignToEngine",
        "postInvokeCortexOrionInterfaceCoreGetSupportedMetrics",
        "postInvokeCortexOrionInterfaceCoreInventoryNow",
        "postInvokeCortexOrionInterfaceCorePollNow",
        "postInvokeCortexOrionInterfaceCoreSetPolling",
        "postInvokeCortexOrionInterfaceCoreStartRealTimePolling",
        "postInvokeCortexOrionInterfaceCoreStopRealTimePolling",
        "postInvokeCortexOrionNodeCoreAddToCortex",
        "postInvokeCortexOrionNodeCoreAssignToEngine",
        "postInvokeCortexOrionNodeCoreGetSupportedMetrics",
        "postInvokeCortexOrionNodeCoreInventoryNow",
        "postInvokeCortexOrionNodeCorePollNow",
        "postInvokeCortexOrionNodeCoreSetPolling",
        "postInvokeCortexOrionNodeCoreStartRealTimePolling",
        "postInvokeCortexOrionNodeCoreStopRealTimePolling",
        "postInvokeCortexOrionPowerControlUnitCoreAssignToEngine",
        "postInvokeCortexOrionPowerControlUnitCoreGetSupportedMetrics",
        "postInvokeCortexOrionPowerControlUnitCoreInventoryNow",
        "postInvokeCortexOrionPowerControlUnitCorePollNow",
        "postInvokeCortexOrionPowerControlUnitCoreSetPolling",
        "postInvokeCortexOrionPowerControlUnitCoreStartRealTimePolling",
        "postInvokeCortexOrionPowerControlUnitCoreStopRealTimePolling",
        "postInvokeCortexOrionVirtualizationClusterCoreAssignToEngine",
        "postInvokeCortexOrionVirtualizationClusterCoreGetSupportedMetrics",
        "postInvokeCortexOrionVirtualizationClusterCoreInventoryNow",
        "postInvokeCortexOrionVirtualizationClusterCorePollNow",
        "postInvokeCortexOrionVirtualizationClusterCoreSetPolling",
        "postInvokeCortexOrionVirtualizationClusterCoreStartRealTimePolling",
        "postInvokeCortexOrionVirtualizationClusterCoreStopRealTimePolling",
        "postInvokeCortexOrionVirtualizationDataCenterCoreAssignToEngine",
        "postInvokeCortexOrionVirtualizationDataCenterCoreGetSupportedMetrics",
        "postInvokeCortexOrionVirtualizationDataCenterCoreInventoryNow",
        "postInvokeCortexOrionVirtualizationDataCenterCorePollNow",
        "postInvokeCortexOrionVirtualizationDataCenterCoreSetPolling",
        "postInvokeCortexOrionVirtualizationDataCenterCoreStartRealTimePolling",
        "postInvokeCortexOrionVirtualizationDataCenterCoreStopRealTimePolling",
        "postInvokeCortexOrionVirtualizationDatastoreCoreAssignToEngine",
        "postInvokeCortexOrionVirtualizationDatastoreCoreGetSupportedMetrics",
        "postInvokeCortexOrionVirtualizationDatastoreCoreInventoryNow",
        "postInvokeCortexOrionVirtualizationDatastoreCorePollNow",
        "postInvokeCortexOrionVirtualizationDatastoreCoreSetPolling",
        "postInvokeCortexOrionVirtualizationDatastoreCoreStartRealTimePolling",
        "postInvokeCortexOrionVirtualizationDatastoreCoreStopRealTimePolling",
        "postInvokeCortexOrionVirtualizationHostCoreAssignToEngine",
        "postInvokeCortexOrionVirtualizationHostCoreGetSupportedMetrics",
        "postInvokeCortexOrionVirtualizationHostCoreInventoryNow",
        "postInvokeCortexOrionVirtualizationHostCorePollNow",
        "postInvokeCortexOrionVirtualizationHostCoreSetPolling",
        "postInvokeCortexOrionVirtualizationHostCoreStartRealTimePolling",
        "postInvokeCortexOrionVirtualizationHostCoreStopRealTimePolling",
        "postInvokeCortexOrionVirtualizationHypervisorEntityCoreAssignToEngine",
        "postInvokeCortexOrionVirtualizationHypervisorEntityCoreGetSupportedMetrics",
        "postInvokeCortexOrionVirtualizationHypervisorEntityCoreInventoryNow",
        "postInvokeCortexOrionVirtualizationHypervisorEntityCorePollNow",
        "postInvokeCortexOrionVirtualizationHypervisorEntityCoreSetPolling",
        "postInvokeCortexOrionVirtualizationHypervisorEntityCoreStartRealTimePolling",
        "postInvokeCortexOrionVirtualizationHypervisorEntityCoreStopRealTimePolling",
        "postInvokeCortexOrionVirtualizationVCenterCoreAssignToEngine",
        "postInvokeCortexOrionVirtualizationVCenterCoreGetSupportedMetrics",
        "postInvokeCortexOrionVirtualizationVCenterCoreInventoryNow",
        "postInvokeCortexOrionVirtualizationVCenterCorePollNow",
        "postInvokeCortexOrionVirtualizationVCenterCoreSetPolling",
        "postInvokeCortexOrionVirtualizationVCenterCoreStartRealTimePolling",
        "postInvokeCortexOrionVirtualizationVCenterCoreStopRealTimePolling",
        "postInvokeCortexOrionVirtualizationVirtualMachineCoreAssignToEngine",
        "postInvokeCortexOrionVirtualizationVirtualMachineCoreGetSupportedMetrics",
        "postInvokeCortexOrionVirtualizationVirtualMachineCoreInventoryNow",
        "postInvokeCortexOrionVirtualizationVirtualMachineCorePollNow",
        "postInvokeCortexOrionVirtualizationVirtualMachineCoreSetPolling",
        "postInvokeCortexOrionVirtualizationVirtualMachineCoreStartRealTimePolling",
        "postInvokeCortexOrionVirtualizationVirtualMachineCoreStopRealTimePolling",
        "postInvokeCortexOrionVirtualizationVirtualMachineDiskCoreAssignToEngine",
        "postInvokeCortexOrionVirtualizationVirtualMachineDiskCoreGetSupportedMetrics",
        "postInvokeCortexOrionVirtualizationVirtualMachineDiskCoreInventoryNow",
        "postInvokeCortexOrionVirtualizationVirtualMachineDiskCorePollNow",
        "postInvokeCortexOrionVirtualizationVirtualMachineDiskCoreSetPolling",
        "postInvokeCortexOrionVirtualizationVirtualMachineDiskCoreStartRealTimePolling",
        "postInvokeCortexOrionVirtualizationVirtualMachineDiskCoreStopRealTimePolling",
        "postInvokeCortexOrionVirtualizationVSanCoreAssignToEngine",
        "postInvokeCortexOrionVirtualizationVSanCoreGetSupportedMetrics",
        "postInvokeCortexOrionVirtualizationVSanCoreInventoryNow",
        "postInvokeCortexOrionVirtualizationVSanCorePollNow",
        "postInvokeCortexOrionVirtualizationVSanCoreSetPolling",
        "postInvokeCortexOrionVirtualizationVSanCoreStartRealTimePolling",
        "postInvokeCortexOrionVirtualizationVSanCoreStopRealTimePolling",
        "postInvokeCortexOrionVolumeCoreAddToCortex",
        "postInvokeCortexOrionVolumeCoreAssignToEngine",
        "postInvokeCortexOrionVolumeCoreGetSupportedMetrics",
        "postInvokeCortexOrionVolumeCoreInventoryNow",
        "postInvokeCortexOrionVolumeCorePollNow",
        "postInvokeCortexOrionVolumeCoreSetPolling",
        "postInvokeCortexOrionVolumeCoreStartRealTimePolling",
        "postInvokeCortexOrionVolumeCoreStopRealTimePolling",
        "postInvokeOrionDPADpaServerRefreshSchema",
        "postInvokeOrionDPIProbesReloadProbeSettings",
        "postInvokeOrionDPIProbesReloadAppDefinitions",
        "postInvokeOrionDPIProbesGetProbeCapabilities",
        "postInvokeOrionDPIProbesDeployLocalTrafficProbe",
        "postInvokeOrionDPIProbesDeploySpanPortProbe",
        "postInvokeOrionESIIncidentIntegrationSetIncidentIntegrationState",
        "postInvokeOrionF5SystemDeviceTestApiPolling",
        "postInvokeOrionF5SystemDeviceEnableApiPolling",
        "postInvokeOrionF5SystemDeviceDisableApiPolling",
        "postInvokeOrionF5LTMServerLinkNode",
        "postInvokeOrionF5LTMServerUnlinkNode",
        "postInvokeOrionHardwareHealthHardwareInfoBaseEnableHardwareHealth",
        "postInvokeOrionHardwareHealthHardwareInfoBaseDisableHardwareHealth",
        "postInvokeOrionHardwareHealthHardwareInfoBaseDeleteHardwareHealth",
        "postInvokeOrionHardwareHealthHardwareInfoBaseIsHardwareHealthEnabled",
        "postInvokeOrionHardwareHealthHardwareItemBaseEnableSensors",
        "postInvokeOrionHardwareHealthHardwareItemBaseDisableSensors",
        "postInvokeOrionHardwareHealthHardwareItemThresholdSetThreshold",
        "postInvokeOrionHardwareHealthHardwareItemThresholdClearThresholds",
        "postInvokeOrionHAPoolsCreatePool",
        "postInvokeOrionHAPoolsEditPool",
        "postInvokeOrionHAPoolsValidateCreatePool",
        "postInvokeOrionHAPoolsValidateEditPool",
        "postInvokeOrionHAPoolsEnablePool",
        "postInvokeOrionHAPoolsDisablePool",
        "postInvokeOrionHAPoolsDeletePool",
        "postInvokeOrionHAPoolsSwitchover",
        "postInvokeOrionHAPoolsDeleteStaleEngine",
        "postInvokeOrionNPMInterfacesSetPowerLevel",
        "postInvokeOrionNPMInterfacesUnmanage",
        "postInvokeOrionNPMInterfacesRemanage",
        "postInvokeOrionNPMInterfacesDiscoverInterfacesOnNode",
        "postInvokeOrionNPMInterfacesAddInterfacesOnNode",
        "postInvokeOrionNPMInterfacesCreateInterfacesPluginConfiguration",
        "postInvokeOrionNPMInterfacesCustomPropertiesCreateCustomProperty",
        "postInvokeOrionNPMInterfacesCustomPropertiesCreateCustomPropertyWithValues",
        "postInvokeOrionNPMInterfacesCustomPropertiesModifyCustomProperty",
        "postInvokeOrionNPMInterfacesCustomPropertiesDeleteCustomProperty",
        "postInvokeIPAMSubnetManagementChangeIpStatus",
        "postInvokeIPAMSubnetManagementChangeIpStatusForGroup",
        "postInvokeIPAMSubnetManagementGetFirstAvailableIp",
        "postInvokeIPAMSubnetManagementGetFirstAvailableIpForGroup",
        "postInvokeIPAMSubnetManagementStartIpReservation",
        "postInvokeIPAMSubnetManagementStartIpReservationForGroup",
        "postInvokeIPAMSubnetManagementCancelIpReservation",
        "postInvokeIPAMSubnetManagementCancelIpReservationForGroup",
        "postInvokeIPAMSubnetManagementFinishIpReservation",
        "postInvokeIPAMSubnetManagementFinishIpReservationForGroup",
        "postInvokeIPAMSubnetManagementCreateSubnet",
        "postInvokeIPAMSubnetManagementCreateSubnetForGroup",
        "postInvokeIPAMSubnetManagementCreateIPv6Subnet",
        "postInvokeIPAMSubnetManagementCreateIPv6SubnetForGroup",
        "postInvokeIPAMSubnetManagementChangeDisableAutoScanning",
        "postInvokeIPAMDhcpDnsManagementCreateIpReservation",
        "postInvokeIPAMDhcpDnsManagementRemoveIpReservation",
        "postInvokeIPAMDhcpDnsManagementGetAandPTRrecordsForDnsZone",
        "postInvokeIPAMIPAddressManagementAddDnsARecord",
        "postInvokeIPAMIPAddressManagementChangeDnsARecord",
        "postInvokeIPAMIPAddressManagementRemoveDnsARecord",
        "postInvokeIPAMIPAddressManagementAddDnsAaaaRecord",
        "postInvokeIPAMIPAddressManagementChangeDnsAaaaRecord",
        "postInvokeIPAMIPAddressManagementRemoveDnsAaaaRecord",
        "postInvokeIPAMIPAddressManagementAddDnsARecordWithPtr",
        "postInvokeIPAMIPAddressManagementAddPtrToDnsARecord",
        "postInvokeIPAMIPAddressManagementAddPtrRecord",
        "postInvokeIPAMIPAddressManagementRemovePtrRecord",
        "postInvokeIPAMAttrDefineAddCustomProperty",
        "postInvokeIPAMAttrDefineUpdateCustomProperty",
        "postInvokeIPAMAttrDefineDeleteCustomProperty",
        "postInvokeIPAMGroupsCustomPropertiesCreateCustomProperty",
        "postInvokeIPAMGroupsCustomPropertiesCreateCustomPropertyWithValues",
        "postInvokeIPAMGroupsCustomPropertiesModifyCustomProperty",
        "postInvokeIPAMGroupsCustomPropertiesDeleteCustomProperty",
        "postInvokeIPAMNodesCustomPropertiesCreateCustomProperty",
        "postInvokeIPAMNodesCustomPropertiesCreateCustomPropertyWithValues",
        "postInvokeIPAMNodesCustomPropertiesModifyCustomProperty",
        "postInvokeIPAMNodesCustomPropertiesDeleteCustomProperty",
        "postInvokeOrionLicensingLicensesActivateOnline",
        "postInvokeOrionLicensingLicensesActivateOffline",
        "postInvokeOrionLicensingLicensesDeactivate",
        "postInvokeOrionLicensingLicensesReAssignExactlyTo",
        "postInvokeOrionLicensingLicensesUnAssignFromAllServers",
        "postInvokeOrionLicensingLicensesFindValidAssignments",
        "postInvokeOrionLicensingLicensesGetEvaluationState",
        "postInvokeOrionLicensingLicensesGetAvailableAssignments",
        "postInvokeOrionNetflowSourceSetManualSamplingRate",
        "postInvokeOrionNetflowSourceSetAutoDetectedSamplingRate",
        "postInvokeOrionOLMLogEntryUidMaxForDate",
        "postInvokeOrionOLMLogEntryUidMinForDate",
        "postInvokeOrionOLMLogEntryUidExtractDate",
        "postInvokeOrionAlertActiveAcknowledge",
        "postInvokeOrionAlertActiveUnacknowledge",
        "postInvokeOrionAlertActiveClearAlert",
        "postInvokeOrionAlertActiveAppendNote",
        "postInvokeOrionAlertsMigrateAllBasicAlerts",
        "postInvokeOrionAlertsMigrateBasicAlert",
        "postInvokeOrionAlertStatusAcknowledge",
        "postInvokeOrionAlertStatusAcknowledgeAlert",
        "postInvokeOrionAlertStatusAddNote",
        "postInvokeOrionAlertConfigurationsMigrateAllAdvancedAlerts",
        "postInvokeOrionAlertConfigurationsMigrateAdvancedAlert",
        "postInvokeOrionAlertConfigurationsMigrateAdvancedAlertFromXML",
        "postInvokeOrionAlertConfigurationsImport",
        "postInvokeOrionAlertConfigurationsExport",
        "postInvokeOrionAlertConfigurationsCustomPropertiesCreateCustomProperty",
        "postInvokeOrionAlertConfigurationsCustomPropertiesCreateCustomPropertyWithValues",
        "postInvokeOrionAlertConfigurationsCustomPropertiesModifyCustomProperty",
        "postInvokeOrionAlertConfigurationsCustomPropertiesDeleteCustomProperty",
        "postInvokeOrionAlertConfigurationsCustomPropertiesValidateCustomProperty",
        "postInvokeOrionAlertDefinitionsRevertMigratedAlert",
        "postInvokeOrionActionsDeleteActionsByAssignments",
        "postInvokeOrionActionsDeleteActionsByAssignmentsAndCategory",
        "postInvokeOrionActionsSaveActionsForAssignments",
        "postInvokeOrionActionsUpdateAction",
        "postInvokeOrionActionsUpdateActionsProperties",
        "postInvokeOrionActionsUpdateActionsDescriptions",
        "postInvokeOrionActionsUpdateActionsFrequencies",
        "postInvokeOrionActionsTestAlertingAction",
        "postInvokeOrionActionsTestReportingAction",
        "postInvokeOrionAlertSuppressionSuppressAlerts",
        "postInvokeOrionAlertSuppressionResumeAlerts",
        "postInvokeOrionAlertSuppressionGetAlertSuppressionState",
        "postInvokeOrionDependenciesRemoveDependencies",
        "postInvokeOrionDeletedAutoDependenciesRemoveIgnoredAutoDependencies",
        "postInvokeOrionEventsAcknowledge",
        "postInvokeOrionMapStudioFilesInsertFile",
        "postInvokeOrionMapStudioFilesUpdateFile",
        "postInvokeOrionMapStudioFilesLockFile",
        "postInvokeOrionMapStudioFilesLockFileTable",
        "postInvokeOrionMapStudioFilesUnlockAllFiles",
        "postInvokeOrionMapStudioFilesDeleteFile",
        "postInvokeOrionMapStudioFilesGetMapStyle",
        "postInvokeOrionNetworkAtlasGetNAVersion",
        "postInvokeOrionNodesUnmanage",
        "postInvokeOrionNodesRemanage",
        "postInvokeOrionNodesPollNow",
        "postInvokeOrionNodesGetCountOfElementsPerEngineForLicensing",
        "postInvokeOrionNodesCustomPropertiesCreateCustomProperty",
        "postInvokeOrionNodesCustomPropertiesCreateCustomPropertyWithValues",
        "postInvokeOrionNodesCustomPropertiesModifyCustomProperty",
        "postInvokeOrionNodesCustomPropertiesDeleteCustomProperty",
        "postInvokeOrionNodesCustomPropertiesValidateCustomProperty",
        "postInvokeOrionResourcesCheckResourceMigration",
        "postInvokeOrionResourcesMigrateClassicToModernResources",
        "postInvokeOrionResourcesMigrateModernToClassicResources",
        "postInvokeOrionResourcesGetModernResourceName",
        "postInvokeOrionVolumesCustomPropertiesCreateCustomProperty",
        "postInvokeOrionVolumesCustomPropertiesCreateCustomPropertyWithValues",
        "postInvokeOrionVolumesCustomPropertiesModifyCustomProperty",
        "postInvokeOrionVolumesCustomPropertiesDeleteCustomProperty",
        "postInvokeOrionVolumesCustomPropertiesValidateCustomProperty",
        "postInvokeOrionEnvironmentCanInstall",
        "postInvokeOrionEnvironmentAuthorizeWindowsAccountForDatabase",
        "postInvokeOrionEnvironmentGetConnectionString",
        "postInvokeOrionEnvironmentGetSqlServerIpAddresses",
        "postInvokeOrionEnvironmentGetDatabaseAccessCredential",
        "postInvokeOrionEnvironmentGetOrionServerCertificate",
        "postInvokeOrionFrequenciesSaveReportFrequencies",
        "postInvokeOrionFrequenciesSaveTimePeriodFrequencies",
        "postInvokeOrionFrequenciesDeleteFrequencies",
        "postInvokeOrionTechnologyPollingAssignmentsEnableAssignments",
        "postInvokeOrionTechnologyPollingAssignmentsDisableAssignments",
        "postInvokeOrionTechnologyPollingAssignmentsEnableAssignmentsOnNetObjects",
        "postInvokeOrionTechnologyPollingAssignmentsDisableAssignmentsOnNetObjects",
        "postInvokeOrionNotificationItemGroupedAcknowledgeAll",
        "postInvokeOrionNotificationItemGroupedAcknowledgeById",
        "postInvokeOrionNotificationItemGroupedUnAcknowledgeById",
        "postInvokeOrionNotificationItemGroupedAcknowledgeByType",
        "postInvokeOrionNotificationItemGroupedUnAcknowledgeByType",
        "postInvokeOrionWebMenuClearCache",
        "postInvokeOrionRemotingRemoteExecutionPackageExecute",
        "postInvokeOrionSCMServerConfigurationPollNow",
        "postInvokeOrionSCMBaselineSetBaseline",
        "postInvokeOrionSEUMRecordingsLoad",
        "postInvokeOrionSEUMRecordingsExists",
        "postInvokeOrionSEUMRecordingsSave",
        "postInvokeOrionSEUMRecordingCustomPropertiesCreateCustomProperty",
        "postInvokeOrionSEUMRecordingCustomPropertiesCreateCustomPropertyWithValues",
        "postInvokeOrionSEUMRecordingCustomPropertiesModifyCustomProperty",
        "postInvokeOrionSEUMRecordingCustomPropertiesDeleteCustomProperty",
        "postInvokeOrionSEUMTransactionsUnmanage",
        "postInvokeOrionSEUMTransactionsRemanage",
        "postInvokeOrionSEUMTransactionCustomPropertiesCreateCustomProperty",
        "postInvokeOrionSEUMTransactionCustomPropertiesCreateCustomPropertyWithValues",
        "postInvokeOrionSEUMTransactionCustomPropertiesModifyCustomProperty",
        "postInvokeOrionSEUMTransactionCustomPropertiesDeleteCustomProperty",
        "postInvokeOrionSEUMSettingsGetRecorderCompatibility",
        "postInvokeOrionSEUMSettingsGetRecorderInstaller",
        "postInvokeOrionSRMSTMIntegrationRefreshLicense",
        "postInvokeOrionSRMSTMIntegrationUpdateLicense",
        "postInvokeOrionSRMSTMIntegrationRemoveSTMIntegration",
        "postInvokeOrionSRMStorageArraysGetLicensedArrays",
        "postInvokeOrionSRMStorageArraysAddSmisCredentials",
        "postInvokeOrionSRMStorageArraysAddExternalProvider",
        "postInvokeOrionSRMStorageArraysAddAllArrays",
        "postInvokeOrionSRMPhysicalDisksGetCountOfElementsPerEngineForLicensing",
        "postInvokeOrionSRMVServersCustomPropertiesCreateCustomProperty",
        "postInvokeOrionSRMVServersCustomPropertiesCreateCustomPropertyWithValues",
        "postInvokeOrionSRMVServersCustomPropertiesModifyCustomProperty",
        "postInvokeOrionSRMVServersCustomPropertiesDeleteCustomProperty",
        "postInvokeOrionSRMVServersCustomPropertiesValidateCustomProperty",
        "postInvokeOrionSRMLUNCustomPropertiesCreateCustomProperty",
        "postInvokeOrionSRMLUNCustomPropertiesCreateCustomPropertyWithValues",
        "postInvokeOrionSRMLUNCustomPropertiesModifyCustomProperty",
        "postInvokeOrionSRMLUNCustomPropertiesDeleteCustomProperty",
        "postInvokeOrionSRMLUNCustomPropertiesValidateCustomProperty",
        "postInvokeOrionSRMVolumeCustomPropertiesCreateCustomProperty",
        "postInvokeOrionSRMVolumeCustomPropertiesCreateCustomPropertyWithValues",
        "postInvokeOrionSRMVolumeCustomPropertiesModifyCustomProperty",
        "postInvokeOrionSRMVolumeCustomPropertiesDeleteCustomProperty",
        "postInvokeOrionSRMVolumeCustomPropertiesValidateCustomProperty",
        "postInvokeOrionSRMFileShareCustomPropertiesCreateCustomProperty",
        "postInvokeOrionSRMFileShareCustomPropertiesCreateCustomPropertyWithValues",
        "postInvokeOrionSRMFileShareCustomPropertiesModifyCustomProperty",
        "postInvokeOrionSRMFileShareCustomPropertiesDeleteCustomProperty",
        "postInvokeOrionSRMFileShareCustomPropertiesValidateCustomProperty",
        "postInvokeOrionSRMStorageArrayCustomPropertiesCreateCustomProperty",
        "postInvokeOrionSRMStorageArrayCustomPropertiesCreateCustomPropertyWithValues",
        "postInvokeOrionSRMStorageArrayCustomPropertiesModifyCustomProperty",
        "postInvokeOrionSRMStorageArrayCustomPropertiesDeleteCustomProperty",
        "postInvokeOrionSRMStorageArrayCustomPropertiesValidateCustomProperty",
        "postInvokeOrionSRMProviderCustomPropertiesCreateCustomProperty",
        "postInvokeOrionSRMProviderCustomPropertiesCreateCustomPropertyWithValues",
        "postInvokeOrionSRMProviderCustomPropertiesModifyCustomProperty",
        "postInvokeOrionSRMProviderCustomPropertiesDeleteCustomProperty",
        "postInvokeOrionSRMProviderCustomPropertiesValidateCustomProperty",
        "postInvokeOrionSRMPoolCustomPropertiesCreateCustomProperty",
        "postInvokeOrionSRMPoolCustomPropertiesCreateCustomPropertyWithValues",
        "postInvokeOrionSRMPoolCustomPropertiesModifyCustomProperty",
        "postInvokeOrionSRMPoolCustomPropertiesDeleteCustomProperty",
        "postInvokeOrionSRMPoolCustomPropertiesValidateCustomProperty",
        "postInvokeOrionSSOValidateUserToken",
        "postInvokeOrionSysLogAcknowledge",
        "postInvokeOrionUDTPortAdministrativeShutdown",
        "postInvokeOrionUDTPortAdministrativeEnable",
        "postInvokeOrionCloudInstancesUnmanage",
        "postInvokeOrionCloudInstancesRemanage",
        "postInvokeOrionCloudInstancesPollNow",
        "postInvokeOrionCloudInstancesStartInstance",
        "postInvokeOrionCloudInstancesStopInstance",
        "postInvokeOrionCloudInstancesRebootInstance",
        "postInvokeOrionCloudInstancesDeleteInstance",
        "postInvokeOrionCloudInstancesDeleteInstanceWithNode",
        "postInvokeOrionCloudAwsInstancesForceStopInstance",
        "postInvokeOrionCloudAwsInstancesTerminateInstance",
        "postInvokeOrionCloudAwsInstancesTerminateInstanceAndRemoveNode",
        "postInvokeOrionVIMClustersCustomPropertiesCreateCustomProperty",
        "postInvokeOrionVIMClustersCustomPropertiesCreateCustomPropertyWithValues",
        "postInvokeOrionVIMClustersCustomPropertiesModifyCustomProperty",
        "postInvokeOrionVIMClustersCustomPropertiesDeleteCustomProperty",
        "postInvokeOrionVIMVirtualMachinesCustomPropertiesCreateCustomProperty",
        "postInvokeOrionVIMVirtualMachinesCustomPropertiesCreateCustomPropertyWithValues",
        "postInvokeOrionVIMVirtualMachinesCustomPropertiesModifyCustomProperty",
        "postInvokeOrionVIMVirtualMachinesCustomPropertiesDeleteCustomProperty",
        "postInvokeOrionVIMHostsCustomPropertiesCreateCustomProperty",
        "postInvokeOrionVIMHostsCustomPropertiesCreateCustomPropertyWithValues",
        "postInvokeOrionVIMHostsCustomPropertiesModifyCustomProperty",
        "postInvokeOrionVIMHostsCustomPropertiesDeleteCustomProperty",
        "postInvokeOrionVIMDatastoresCustomPropertiesCreateCustomProperty",
        "postInvokeOrionVIMDatastoresCustomPropertiesCreateCustomPropertyWithValues",
        "postInvokeOrionVIMDatastoresCustomPropertiesModifyCustomProperty",
        "postInvokeOrionVIMDatastoresCustomPropertiesDeleteCustomProperty",
        "postInvokeOrionVPNL2LTunnelSetFavorite",
        "postInvokeOrionVPNL2LTunnelRemoveFavorite",
        "postInvokeOrionWirelessHeatMapMapInsertMap",
        "postInvokeOrionWirelessHeatMapMapDeleteMap",
        "postInvokeOrionWirelessHeatMapMapSetMapError",
        "postInvokeOrionWirelessHeatMapMapFireMapGenerationIndication",
        "postInvokeOrionWirelessHeatMapMapPollAPSignalStrengthNow",
        "postInvokeOrionWirelessHeatMapMapPollRPSignalStrengthNow",
        "postInvokeOrionWirelessHeatMapMapStartClientSignalPoll",
        "postInvokeOrionWirelessHeatMapMapGetProgress",
        "postInvokeOrionWirelessHeatMapMapDeleteReferencePoints",
        "postInvokeOrionWirelessHeatMapMapPointInsertMapPoint",
        "postInvokeOrionWirelessHeatMapMapPointDeleteMapPoints",
        "postInvokeOrionWirelessHeatMapMapPointDeleteMapPoint",
        "postInvokeOrionWirelessHeatMapMapPointSyncMapPoints",
        "postInvokeOrionWirelessHeatMapResourceLimitationInsertResourceLimitation",
        "postInvokeSystemIndicationReportIndication",
        "postInvokeMetadataEntityGetAliases",
        "postInvokeMetadataEntityGetSchemaLoadTime",
        "postInvokeSystemQueryPlanCacheClear",
        "postInvokeSystemActiveQueryCancelByClientSessionID"
      ],
      "external_name": "ph_request_type"
    }
  },
  "definitions": {}
}