{
  "JobID": 6,
  "JobName": "string",
  "JobType": "PolicyReport",
  "JobDefinition": {
    "Name": "string",
    "OwnerSID": "string",
    "LastModification": "string",
    "Comments": "string",
    "JobType": "ConfigChangeReport",
    "Nodes": {
      "SelectedCriteriaType": "DesktopCriteria",
      "WebNodesSelectionCriterias": [
        {
          "Id": "string",
          "LogicalCondition": "string",
          "SelectedColumn": "string",
          "MatchType": "string",
          "SelectedValue": "string"
        },
        {
          "Id": "string",
          "LogicalCondition": "string",
          "SelectedColumn": "string",
          "MatchType": "string",
          "SelectedValue": "string"
        },
        {
          "Id": "string",
          "LogicalCondition": "string",
          "SelectedColumn": "string",
          "MatchType": "string",
          "SelectedValue": "string"
        },
        {
          "Id": "string",
          "LogicalCondition": "string",
          "SelectedColumn": "string",
          "MatchType": "string",
          "SelectedValue": "string"
        },
        {
          "Id": "string",
          "LogicalCondition": "string",
          "SelectedColumn": "string",
          "MatchType": "string",
          "SelectedValue": "string"
        },
        {
          "Id": "string",
          "LogicalCondition": "string",
          "SelectedColumn": "string",
          "MatchType": "string",
          "SelectedValue": "string"
        },
        {
          "Id": "string",
          "LogicalCondition": "string",
          "SelectedColumn": "string",
          "MatchType": "string",
          "SelectedValue": "string"
        },
        {
          "Id": "string",
          "LogicalCondition": "string",
          "SelectedColumn": "string",
          "MatchType": "string",
          "SelectedValue": "string"
        },
        {
          "Id": "string",
          "LogicalCondition": "string",
          "SelectedColumn": "string",
          "MatchType": "string",
          "SelectedValue": "string"
        }
      ],
      "NetworkNodes": [
        {
          "NodeCaption": "string",
          "NodeID": "string",
          "Script": "string"
        }
      ],
      "QueryString": "string"
    },
    "Parameters": {
      "Script": "string",
      "ScriptFilterPattern": "string",
      "ExecuteFilterResults": true,
      "ExecuteShowCommands": true,
      "WriteToNVRAM": false,
      "Reboot": true,
      "ConfigText": "string",
      "ChangeReportType": "string",
      "ChangeReportDetails": true,
      "ChangeReportTargetDate": "string",
      "ChangeReportPastXXDays": 5,
      "ChangeReportStartDate": "string",
      "ChangeReportEndDate": "string",
      "CompareLastDownloaded": 6,
      "LastConfigType": "string",
      "OnConfigType": "string",
      "GenerateOnConfigType": false,
      "OnlySendDevicesThatHadChanges": true,
      "Report": "string",
      "ReportTitle": "string",
      "LimitNumberOfRecords": false,
      "NumberOfRecords": 10,
      "Path": "string",
      "AllConfigs": true,
      "ConfigTemplate": "string",
      "ConfigTypes": "string",
      "OnlySaveChangedConfigs": false,
      "NotifyChangedLast": false,
      "NotifyChangedBaseline": true,
      "NotifyChangedStartup": true,
      "NotifySeparateTextEmail": false,
      "NotifySeparateHtmlEmail": true,
      "CacheDiffResults": true,
      "ObjectID": "string",
      "GroupingPolicyReports": true,
      "NotifyOnlyOnPolicyViolations": false,
      "InventorySettings": "string",
      "PurgeConfigByDate": false,
      "PurgeConfigIncludeTime": true,
      "PurgeConfigBaseline": true,
      "PurgeConfigDate": "string",
      "PurgeConfigCount": 10,
      "PurgeConfigByTimeRange": false,
      "PurgeConfigTimeRange": "string",
      "PurgeConfigArchive": true,
      "PurgeConfigArchiveTimeRange": "string",
      "PurgeConfigCache": true,
      "PurgeConfigCacheTimeRange": "string",
      "PurgeApprovalRequests": false,
      "PurgeApprovalRequestsTimeRange": "string",
      "PurgeTransferRequests": false,
      "PurgeTransferRequestsTimeRange": "string",
      "PurgeJobLog": false,
      "PurgeJobLogType": "string",
      "PurgeJobLogTypeValue": "string",
      "BaselineNetworkType": "string",
      "BaselineNetworkTargetDate": "string",
      "FilePathList": [
        {
          "EngineID": 10,
          "File_Path": "string"
        },
        {
          "EngineID": 3,
          "File_Path": "string"
        },
        {
          "EngineID": 7,
          "File_Path": "string"
        },
        {
          "EngineID": 10,
          "File_Path": "string"
        },
        {
          "EngineID": 3,
          "File_Path": "string"
        },
        {
          "EngineID": 9,
          "File_Path": "string"
        },
        {
          "EngineID": 9,
          "File_Path": "string"
        },
        {
          "EngineID": 6,
          "File_Path": "string"
        },
        {
          "EngineID": 2,
          "File_Path": "string"
        }
      ]
    },
    "Notifications": {
      "EmailOnlyOnError": false,
      "EmailResults": false,
      "EmailCC": "string",
      "EmailRecipient": "string",
      "EmailBCC": "string",
      "EmailSubject": "string",
      "EmailFrom": "string",
      "EmailReplyAddress": "string",
      "EmailAttachment": false,
      "AttachmentFileName": "string",
      "LogSteps": true,
      "SMTPServer": "string",
      "SMTPPort": 4,
      "SMTPUseAuthentication": false,
      "SMTPAuthUserName": "string",
      "SMTPAuthPassword": "string",
      "SMTPUseSSL": true,
      "SMTPSSLPortNumber": 1,
      "SaveToFileName": "string",
      "SaveResultsToFile": false,
      "SaveToFileOnError": true
    },
    "NcmRunOnce": true
  },
  "JobSchedule": {
    "TriggerType": "Monthly",
    "StartTime": "string",
    "StartDate": "string",
    "Day": 7,
    "DaysOfTheWeek": [
      "Saturday",
      "Sunday",
      "Sunday",
      "Friday",
      "Sunday",
      "Monday",
      "Wednesday",
      "Monday"
    ],
    "Months": [
      "January",
      "November",
      "September",
      "June",
      "March",
      "May",
      "November",
      "August",
      "January",
      "July"
    ],
    "Weeks": 2,
    "AdvancedCRONExpression": "string",
    "StartingOn": "string",
    "EndingOn": "string",
    "ExecuteImmediately": true
  },
  "Enabled": true,
  "JobStatus": "Running",
  "CreationDate": "string",
  "Author": "string",
  "IsHidden": true,
  "IsPrePolulated": false
}