{
  "keyHeaders": [
    {
      "aggregation": "string",
      "dataUnits": "string",
      "field": 2,
      "fieldType": "string",
      "isRate": true,
      "key": false,
      "name": "string"
    },
    {
      "aggregation": "string",
      "dataUnits": "string",
      "field": 8,
      "fieldType": "string",
      "isRate": true,
      "key": true,
      "name": "string"
    },
    {
      "aggregation": "string",
      "dataUnits": "string",
      "field": 8,
      "fieldType": "string",
      "isRate": false,
      "key": false,
      "name": "string"
    }
  ],
  "maximumSampleRate": 7,
  "noTemplateMatch": true,
  "nodes": [
    {
      "counts": [
        1,
        3
      ],
      "keys": [
        "string",
        "string",
        "string",
        "string",
        "string",
        "string",
        "string",
        "string",
        "string"
      ],
      "rawKeys": [
        "string",
        "string",
        "string",
        "string",
        "string",
        "string",
        "string",
        "string",
        "string"
      ],
      "times": [
        9,
        5
      ],
      "values": [
        5,
        3,
        9,
        9,
        5,
        5,
        7
      ]
    },
    {
      "counts": [
        1,
        6,
        8,
        8,
        9,
        7,
        8,
        7,
        2,
        7
      ],
      "keys": [
        "string",
        "string",
        "string",
        "string",
        "string",
        "string"
      ],
      "rawKeys": [
        "string",
        "string",
        "string",
        "string"
      ],
      "times": [
        8
      ],
      "values": [
        5
      ]
    },
    {
      "counts": [
        9,
        9,
        4,
        2,
        8,
        3,
        10,
        2,
        5,
        7
      ],
      "keys": [
        "string",
        "string",
        "string",
        "string"
      ],
      "rawKeys": [
        "string",
        "string",
        "string",
        "string",
        "string",
        "string",
        "string",
        "string"
      ],
      "times": [
        7,
        2,
        2
      ],
      "values": [
        1,
        7,
        4,
        1,
        1,
        8,
        2,
        3,
        4,
        6
      ]
    },
    {
      "counts": [
        6,
        4
      ],
      "keys": [
        "string",
        "string",
        "string",
        "string",
        "string",
        "string",
        "string"
      ],
      "rawKeys": [
        "string",
        "string",
        "string",
        "string",
        "string",
        "string",
        "string",
        "string",
        "string",
        "string"
      ],
      "times": [
        3,
        7,
        1,
        3,
        1,
        10,
        3,
        7,
        9
      ],
      "values": [
        9,
        2,
        1,
        5
      ]
    }
  ],
  "otherTraffic": {
    "counts": [
      7,
      3,
      8
    ],
    "keys": [
      "string",
      "string",
      "string",
      "string",
      "string"
    ],
    "rawKeys": [
      "string",
      "string",
      "string",
      "string",
      "string",
      "string",
      "string",
      "string",
      "string",
      "string"
    ],
    "times": [
      6
    ],
    "values": [
      1,
      8,
      7,
      7
    ]
  },
  "totalTraffic": {
    "counts": [
      7,
      5,
      2
    ],
    "keys": [
      "string",
      "string",
      "string",
      "string",
      "string",
      "string",
      "string",
      "string"
    ],
    "rawKeys": [
      "string",
      "string",
      "string",
      "string",
      "string",
      "string",
      "string"
    ],
    "times": [
      2,
      8,
      3,
      6
    ],
    "values": [
      4,
      6,
      3,
      2,
      1,
      10,
      9
    ]
  },
  "valueHeaders": [
    {
      "aggregation": "string",
      "dataUnits": "string",
      "field": 9,
      "fieldType": "string",
      "isRate": false,
      "key": true,
      "name": "string"
    },
    {
      "aggregation": "string",
      "dataUnits": "string",
      "field": 5,
      "fieldType": "string",
      "isRate": true,
      "key": false,
      "name": "string"
    },
    {
      "aggregation": "string",
      "dataUnits": "string",
      "field": 3,
      "fieldType": "string",
      "isRate": false,
      "key": true,
      "name": "string"
    },
    {
      "aggregation": "string",
      "dataUnits": "string",
      "field": 2,
      "fieldType": "string",
      "isRate": true,
      "key": true,
      "name": "string"
    },
    {
      "aggregation": "string",
      "dataUnits": "string",
      "field": 6,
      "fieldType": "string",
      "isRate": false,
      "key": true,
      "name": "string"
    },
    {
      "aggregation": "string",
      "dataUnits": "string",
      "field": 1,
      "fieldType": "string",
      "isRate": true,
      "key": false,
      "name": "string"
    }
  ]
}