{
  "activeAppliance": "PRIMARY",
  "capacity": 5,
  "disabled": true,
  "droppedFlowsPerSecond": 7,
  "flowLimit": 5,
  "flowLoad": 2,
  "flowsPerSecond": 7,
  "interfaceLimit": 5,
  "ip": "string",
  "master": false,
  "model": "string",
  "name": "string",
  "netflowDeviceCount": 1,
  "netflowInterfaceCount": 7,
  "primaryIp": "string",
  "processedFlowsPerSecond": 2,
  "secondaryIp": "string",
  "serverId": 6,
  "serverLoad": 8,
  "telephonyActiveCallsLimit": 6,
  "telephonyPhones": 9,
  "telephonyPhonesLimit": 9,
  "totalCapacity": 6,
  "totalLoad": 3,
  "virtualIp": "string"
}