{
  "attachmentType": "PERFORMANCE_METRICS",
  "result": [
    {
      "data": [
        {
          "percentValue": 8,
          "rvalue": 4,
          "value": 8
        },
        {
          "percentValue": 9,
          "rvalue": 7,
          "value": 5
        }
      ],
      "deviceGroupId": 8,
      "deviceId": 3,
      "deviceName": "string",
      "extraIndicators": [
        {
          "data": [
            {
              "percentValue": 8,
              "rvalue": 1,
              "value": 4
            },
            {
              "percentValue": 9,
              "rvalue": 8,
              "value": 1
            },
            {
              "percentValue": 6,
              "rvalue": 10,
              "value": 7
            },
            {
              "percentValue": 5,
              "rvalue": 7,
              "value": 5
            },
            {
              "percentValue": 5,
              "rvalue": 4,
              "value": 1
            },
            {
              "percentValue": 2,
              "rvalue": 2,
              "value": 3
            },
            {
              "percentValue": 9,
              "rvalue": 4,
              "value": 6
            },
            {
              "percentValue": 10,
              "rvalue": 4,
              "value": 6
            },
            {
              "percentValue": 10,
              "rvalue": 3,
              "value": 2
            },
            {
              "percentValue": 3,
              "rvalue": 3,
              "value": 7
            }
          ],
          "indicatorAlias": "string",
          "indicatorId": 3,
          "indicatorTypeDescription": "string",
          "indicatorTypeId": 6,
          "indicatorTypeName": "string",
          "isChildIndicatorType": false,
          "unit": "string"
        },
        {
          "data": [
            {
              "percentValue": 10,
              "rvalue": 7,
              "value": 3
            },
            {
              "percentValue": 10,
              "rvalue": 3,
              "value": 5
            },
            {
              "percentValue": 9,
              "rvalue": 1,
              "value": 6
            },
            {
              "percentValue": 10,
              "rvalue": 1,
              "value": 7
            }
          ],
          "indicatorAlias": "string",
          "indicatorId": 8,
          "indicatorTypeDescription": "string",
          "indicatorTypeId": 3,
          "indicatorTypeName": "string",
          "isChildIndicatorType": false,
          "unit": "string"
        },
        {
          "data": [
            {
              "percentValue": 6,
              "rvalue": 5,
              "value": 10
            },
            {
              "percentValue": 8,
              "rvalue": 2,
              "value": 3
            },
            {
              "percentValue": 5,
              "rvalue": 2,
              "value": 8
            },
            {
              "percentValue": 4,
              "rvalue": 6,
              "value": 4
            },
            {
              "percentValue": 1,
              "rvalue": 10,
              "value": 7
            }
          ],
          "indicatorAlias": "string",
          "indicatorId": 2,
          "indicatorTypeDescription": "string",
          "indicatorTypeId": 1,
          "indicatorTypeName": "string",
          "isChildIndicatorType": true,
          "unit": "string"
        }
      ],
      "indicatorAlias": "string",
      "indicatorId": 3,
      "indicatorTypeDescription": "string",
      "indicatorTypeId": 2,
      "indicatorTypeName": "string",
      "objectDescription": "string",
      "objectGroupId": 1,
      "objectId": 7,
      "objectName": "string",
      "pluginId": 10,
      "unit": "string"
    },
    {
      "data": [
        {
          "percentValue": 4,
          "rvalue": 10,
          "value": 5
        },
        {
          "percentValue": 8,
          "rvalue": 10,
          "value": 10
        },
        {
          "percentValue": 5,
          "rvalue": 6,
          "value": 2
        },
        {
          "percentValue": 4,
          "rvalue": 2,
          "value": 8
        }
      ],
      "deviceGroupId": 10,
      "deviceId": 1,
      "deviceName": "string",
      "extraIndicators": [
        {
          "data": [
            {
              "percentValue": 6,
              "rvalue": 10,
              "value": 9
            },
            {
              "percentValue": 1,
              "rvalue": 3,
              "value": 7
            },
            {
              "percentValue": 10,
              "rvalue": 8,
              "value": 6
            },
            {
              "percentValue": 2,
              "rvalue": 10,
              "value": 5
            },
            {
              "percentValue": 10,
              "rvalue": 9,
              "value": 7
            },
            {
              "percentValue": 4,
              "rvalue": 10,
              "value": 10
            }
          ],
          "indicatorAlias": "string",
          "indicatorId": 4,
          "indicatorTypeDescription": "string",
          "indicatorTypeId": 1,
          "indicatorTypeName": "string",
          "isChildIndicatorType": true,
          "unit": "string"
        }
      ],
      "indicatorAlias": "string",
      "indicatorId": 10,
      "indicatorTypeDescription": "string",
      "indicatorTypeId": 1,
      "indicatorTypeName": "string",
      "objectDescription": "string",
      "objectGroupId": 1,
      "objectId": 2,
      "objectName": "string",
      "pluginId": 1,
      "unit": "string"
    },
    {
      "data": [
        {
          "percentValue": 3,
          "rvalue": 7,
          "value": 6
        }
      ],
      "deviceGroupId": 2,
      "deviceId": 3,
      "deviceName": "string",
      "extraIndicators": [
        {
          "data": [
            {
              "percentValue": 10,
              "rvalue": 5,
              "value": 5
            },
            {
              "percentValue": 1,
              "rvalue": 5,
              "value": 10
            },
            {
              "percentValue": 1,
              "rvalue": 4,
              "value": 4
            },
            {
              "percentValue": 4,
              "rvalue": 10,
              "value": 5
            }
          ],
          "indicatorAlias": "string",
          "indicatorId": 6,
          "indicatorTypeDescription": "string",
          "indicatorTypeId": 9,
          "indicatorTypeName": "string",
          "isChildIndicatorType": false,
          "unit": "string"
        },
        {
          "data": [
            {
              "percentValue": 4,
              "rvalue": 8,
              "value": 8
            },
            {
              "percentValue": 5,
              "rvalue": 10,
              "value": 2
            }
          ],
          "indicatorAlias": "string",
          "indicatorId": 6,
          "indicatorTypeDescription": "string",
          "indicatorTypeId": 7,
          "indicatorTypeName": "string",
          "isChildIndicatorType": true,
          "unit": "string"
        },
        {
          "data": [
            {
              "percentValue": 5,
              "rvalue": 9,
              "value": 2
            },
            {
              "percentValue": 7,
              "rvalue": 5,
              "value": 6
            },
            {
              "percentValue": 2,
              "rvalue": 4,
              "value": 5
            },
            {
              "percentValue": 10,
              "rvalue": 1,
              "value": 5
            }
          ],
          "indicatorAlias": "string",
          "indicatorId": 3,
          "indicatorTypeDescription": "string",
          "indicatorTypeId": 10,
          "indicatorTypeName": "string",
          "isChildIndicatorType": true,
          "unit": "string"
        },
        {
          "data": [
            {
              "percentValue": 7,
              "rvalue": 1,
              "value": 9
            },
            {
              "percentValue": 10,
              "rvalue": 10,
              "value": 5
            },
            {
              "percentValue": 1,
              "rvalue": 9,
              "value": 1
            },
            {
              "percentValue": 10,
              "rvalue": 4,
              "value": 10
            },
            {
              "percentValue": 4,
              "rvalue": 6,
              "value": 6
            },
            {
              "percentValue": 2,
              "rvalue": 5,
              "value": 7
            },
            {
              "percentValue": 3,
              "rvalue": 6,
              "value": 6
            },
            {
              "percentValue": 8,
              "rvalue": 3,
              "value": 1
            },
            {
              "percentValue": 4,
              "rvalue": 4,
              "value": 8
            },
            {
              "percentValue": 5,
              "rvalue": 10,
              "value": 1
            }
          ],
          "indicatorAlias": "string",
          "indicatorId": 3,
          "indicatorTypeDescription": "string",
          "indicatorTypeId": 9,
          "indicatorTypeName": "string",
          "isChildIndicatorType": true,
          "unit": "string"
        },
        {
          "data": [
            {
              "percentValue": 2,
              "rvalue": 9,
              "value": 10
            },
            {
              "percentValue": 2,
              "rvalue": 10,
              "value": 6
            },
            {
              "percentValue": 5,
              "rvalue": 6,
              "value": 4
            },
            {
              "percentValue": 4,
              "rvalue": 3,
              "value": 8
            }
          ],
          "indicatorAlias": "string",
          "indicatorId": 3,
          "indicatorTypeDescription": "string",
          "indicatorTypeId": 5,
          "indicatorTypeName": "string",
          "isChildIndicatorType": false,
          "unit": "string"
        },
        {
          "data": [
            {
              "percentValue": 8,
              "rvalue": 10,
              "value": 6
            },
            {
              "percentValue": 7,
              "rvalue": 8,
              "value": 7
            },
            {
              "percentValue": 7,
              "rvalue": 8,
              "value": 2
            },
            {
              "percentValue": 2,
              "rvalue": 5,
              "value": 9
            }
          ],
          "indicatorAlias": "string",
          "indicatorId": 7,
          "indicatorTypeDescription": "string",
          "indicatorTypeId": 7,
          "indicatorTypeName": "string",
          "isChildIndicatorType": true,
          "unit": "string"
        },
        {
          "data": [
            {
              "percentValue": 10,
              "rvalue": 5,
              "value": 2
            },
            {
              "percentValue": 7,
              "rvalue": 1,
              "value": 7
            },
            {
              "percentValue": 5,
              "rvalue": 10,
              "value": 2
            },
            {
              "percentValue": 1,
              "rvalue": 1,
              "value": 4
            },
            {
              "percentValue": 4,
              "rvalue": 2,
              "value": 3
            },
            {
              "percentValue": 10,
              "rvalue": 5,
              "value": 4
            }
          ],
          "indicatorAlias": "string",
          "indicatorId": 6,
          "indicatorTypeDescription": "string",
          "indicatorTypeId": 6,
          "indicatorTypeName": "string",
          "isChildIndicatorType": false,
          "unit": "string"
        },
        {
          "data": [
            {
              "percentValue": 1,
              "rvalue": 10,
              "value": 4
            },
            {
              "percentValue": 2,
              "rvalue": 10,
              "value": 8
            },
            {
              "percentValue": 1,
              "rvalue": 7,
              "value": 6
            },
            {
              "percentValue": 5,
              "rvalue": 4,
              "value": 7
            },
            {
              "percentValue": 2,
              "rvalue": 10,
              "value": 8
            },
            {
              "percentValue": 8,
              "rvalue": 1,
              "value": 8
            }
          ],
          "indicatorAlias": "string",
          "indicatorId": 10,
          "indicatorTypeDescription": "string",
          "indicatorTypeId": 5,
          "indicatorTypeName": "string",
          "isChildIndicatorType": true,
          "unit": "string"
        },
        {
          "data": [
            {
              "percentValue": 2,
              "rvalue": 8,
              "value": 2
            }
          ],
          "indicatorAlias": "string",
          "indicatorId": 8,
          "indicatorTypeDescription": "string",
          "indicatorTypeId": 7,
          "indicatorTypeName": "string",
          "isChildIndicatorType": false,
          "unit": "string"
        }
      ],
      "indicatorAlias": "string",
      "indicatorId": 7,
      "indicatorTypeDescription": "string",
      "indicatorTypeId": 10,
      "indicatorTypeName": "string",
      "objectDescription": "string",
      "objectGroupId": 9,
      "objectId": 8,
      "objectName": "string",
      "pluginId": 1,
      "unit": "string"
    },
    {
      "data": [
        {
          "percentValue": 8,
          "rvalue": 9,
          "value": 3
        },
        {
          "percentValue": 4,
          "rvalue": 7,
          "value": 2
        },
        {
          "percentValue": 5,
          "rvalue": 3,
          "value": 7
        },
        {
          "percentValue": 10,
          "rvalue": 8,
          "value": 6
        },
        {
          "percentValue": 7,
          "rvalue": 9,
          "value": 3
        },
        {
          "percentValue": 7,
          "rvalue": 10,
          "value": 7
        },
        {
          "percentValue": 4,
          "rvalue": 5,
          "value": 8
        },
        {
          "percentValue": 8,
          "rvalue": 6,
          "value": 4
        }
      ],
      "deviceGroupId": 5,
      "deviceId": 1,
      "deviceName": "string",
      "extraIndicators": [
        {
          "data": [
            {
              "percentValue": 3,
              "rvalue": 1,
              "value": 9
            },
            {
              "percentValue": 10,
              "rvalue": 1,
              "value": 8
            },
            {
              "percentValue": 2,
              "rvalue": 2,
              "value": 8
            },
            {
              "percentValue": 7,
              "rvalue": 4,
              "value": 9
            },
            {
              "percentValue": 8,
              "rvalue": 9,
              "value": 1
            }
          ],
          "indicatorAlias": "string",
          "indicatorId": 7,
          "indicatorTypeDescription": "string",
          "indicatorTypeId": 7,
          "indicatorTypeName": "string",
          "isChildIndicatorType": false,
          "unit": "string"
        },
        {
          "data": [
            {
              "percentValue": 6,
              "rvalue": 4,
              "value": 7
            }
          ],
          "indicatorAlias": "string",
          "indicatorId": 4,
          "indicatorTypeDescription": "string",
          "indicatorTypeId": 1,
          "indicatorTypeName": "string",
          "isChildIndicatorType": false,
          "unit": "string"
        },
        {
          "data": [
            {
              "percentValue": 5,
              "rvalue": 9,
              "value": 1
            },
            {
              "percentValue": 2,
              "rvalue": 3,
              "value": 9
            },
            {
              "percentValue": 2,
              "rvalue": 1,
              "value": 1
            },
            {
              "percentValue": 9,
              "rvalue": 9,
              "value": 9
            },
            {
              "percentValue": 9,
              "rvalue": 1,
              "value": 9
            },
            {
              "percentValue": 3,
              "rvalue": 4,
              "value": 7
            }
          ],
          "indicatorAlias": "string",
          "indicatorId": 8,
          "indicatorTypeDescription": "string",
          "indicatorTypeId": 2,
          "indicatorTypeName": "string",
          "isChildIndicatorType": false,
          "unit": "string"
        },
        {
          "data": [
            {
              "percentValue": 6,
              "rvalue": 5,
              "value": 4
            },
            {
              "percentValue": 9,
              "rvalue": 9,
              "value": 8
            }
          ],
          "indicatorAlias": "string",
          "indicatorId": 9,
          "indicatorTypeDescription": "string",
          "indicatorTypeId": 6,
          "indicatorTypeName": "string",
          "isChildIndicatorType": true,
          "unit": "string"
        },
        {
          "data": [
            {
              "percentValue": 10,
              "rvalue": 6,
              "value": 8
            },
            {
              "percentValue": 8,
              "rvalue": 7,
              "value": 4
            },
            {
              "percentValue": 6,
              "rvalue": 10,
              "value": 2
            },
            {
              "percentValue": 3,
              "rvalue": 6,
              "value": 9
            },
            {
              "percentValue": 5,
              "rvalue": 6,
              "value": 2
            },
            {
              "percentValue": 1,
              "rvalue": 2,
              "value": 6
            },
            {
              "percentValue": 7,
              "rvalue": 6,
              "value": 9
            },
            {
              "percentValue": 9,
              "rvalue": 9,
              "value": 10
            },
            {
              "percentValue": 4,
              "rvalue": 5,
              "value": 6
            },
            {
              "percentValue": 10,
              "rvalue": 7,
              "value": 2
            }
          ],
          "indicatorAlias": "string",
          "indicatorId": 10,
          "indicatorTypeDescription": "string",
          "indicatorTypeId": 4,
          "indicatorTypeName": "string",
          "isChildIndicatorType": true,
          "unit": "string"
        },
        {
          "data": [
            {
              "percentValue": 6,
              "rvalue": 8,
              "value": 2
            },
            {
              "percentValue": 2,
              "rvalue": 6,
              "value": 6
            },
            {
              "percentValue": 2,
              "rvalue": 10,
              "value": 8
            }
          ],
          "indicatorAlias": "string",
          "indicatorId": 1,
          "indicatorTypeDescription": "string",
          "indicatorTypeId": 10,
          "indicatorTypeName": "string",
          "isChildIndicatorType": true,
          "unit": "string"
        },
        {
          "data": [
            {
              "percentValue": 7,
              "rvalue": 9,
              "value": 7
            },
            {
              "percentValue": 5,
              "rvalue": 6,
              "value": 8
            },
            {
              "percentValue": 7,
              "rvalue": 4,
              "value": 1
            }
          ],
          "indicatorAlias": "string",
          "indicatorId": 9,
          "indicatorTypeDescription": "string",
          "indicatorTypeId": 8,
          "indicatorTypeName": "string",
          "isChildIndicatorType": true,
          "unit": "string"
        },
        {
          "data": [
            {
              "percentValue": 6,
              "rvalue": 4,
              "value": 6
            },
            {
              "percentValue": 2,
              "rvalue": 8,
              "value": 2
            },
            {
              "percentValue": 5,
              "rvalue": 4,
              "value": 4
            },
            {
              "percentValue": 8,
              "rvalue": 2,
              "value": 6
            },
            {
              "percentValue": 9,
              "rvalue": 4,
              "value": 4
            }
          ],
          "indicatorAlias": "string",
          "indicatorId": 6,
          "indicatorTypeDescription": "string",
          "indicatorTypeId": 10,
          "indicatorTypeName": "string",
          "isChildIndicatorType": false,
          "unit": "string"
        },
        {
          "data": [
            {
              "percentValue": 8,
              "rvalue": 4,
              "value": 6
            },
            {
              "percentValue": 9,
              "rvalue": 10,
              "value": 1
            },
            {
              "percentValue": 3,
              "rvalue": 3,
              "value": 8
            },
            {
              "percentValue": 5,
              "rvalue": 2,
              "value": 1
            },
            {
              "percentValue": 10,
              "rvalue": 9,
              "value": 3
            },
            {
              "percentValue": 6,
              "rvalue": 1,
              "value": 4
            },
            {
              "percentValue": 7,
              "rvalue": 2,
              "value": 7
            },
            {
              "percentValue": 4,
              "rvalue": 4,
              "value": 10
            }
          ],
          "indicatorAlias": "string",
          "indicatorId": 7,
          "indicatorTypeDescription": "string",
          "indicatorTypeId": 1,
          "indicatorTypeName": "string",
          "isChildIndicatorType": true,
          "unit": "string"
        }
      ],
      "indicatorAlias": "string",
      "indicatorId": 1,
      "indicatorTypeDescription": "string",
      "indicatorTypeId": 8,
      "indicatorTypeName": "string",
      "objectDescription": "string",
      "objectGroupId": 9,
      "objectId": 8,
      "objectName": "string",
      "pluginId": 7,
      "unit": "string"
    },
    {
      "data": [
        {
          "percentValue": 8,
          "rvalue": 2,
          "value": 4
        },
        {
          "percentValue": 9,
          "rvalue": 5,
          "value": 7
        }
      ],
      "deviceGroupId": 10,
      "deviceId": 3,
      "deviceName": "string",
      "extraIndicators": [
        {
          "data": [
            {
              "percentValue": 7,
              "rvalue": 8,
              "value": 3
            },
            {
              "percentValue": 6,
              "rvalue": 3,
              "value": 3
            },
            {
              "percentValue": 5,
              "rvalue": 5,
              "value": 1
            },
            {
              "percentValue": 9,
              "rvalue": 4,
              "value": 4
            },
            {
              "percentValue": 7,
              "rvalue": 6,
              "value": 8
            },
            {
              "percentValue": 4,
              "rvalue": 7,
              "value": 9
            },
            {
              "percentValue": 9,
              "rvalue": 10,
              "value": 4
            },
            {
              "percentValue": 5,
              "rvalue": 1,
              "value": 1
            }
          ],
          "indicatorAlias": "string",
          "indicatorId": 9,
          "indicatorTypeDescription": "string",
          "indicatorTypeId": 2,
          "indicatorTypeName": "string",
          "isChildIndicatorType": false,
          "unit": "string"
        },
        {
          "data": [
            {
              "percentValue": 10,
              "rvalue": 8,
              "value": 3
            }
          ],
          "indicatorAlias": "string",
          "indicatorId": 9,
          "indicatorTypeDescription": "string",
          "indicatorTypeId": 5,
          "indicatorTypeName": "string",
          "isChildIndicatorType": true,
          "unit": "string"
        },
        {
          "data": [
            {
              "percentValue": 6,
              "rvalue": 10,
              "value": 2
            },
            {
              "percentValue": 3,
              "rvalue": 3,
              "value": 8
            },
            {
              "percentValue": 10,
              "rvalue": 1,
              "value": 10
            }
          ],
          "indicatorAlias": "string",
          "indicatorId": 8,
          "indicatorTypeDescription": "string",
          "indicatorTypeId": 1,
          "indicatorTypeName": "string",
          "isChildIndicatorType": true,
          "unit": "string"
        },
        {
          "data": [
            {
              "percentValue": 2,
              "rvalue": 8,
              "value": 7
            },
            {
              "percentValue": 9,
              "rvalue": 1,
              "value": 8
            },
            {
              "percentValue": 9,
              "rvalue": 4,
              "value": 1
            },
            {
              "percentValue": 9,
              "rvalue": 5,
              "value": 9
            },
            {
              "percentValue": 7,
              "rvalue": 6,
              "value": 9
            },
            {
              "percentValue": 10,
              "rvalue": 6,
              "value": 7
            }
          ],
          "indicatorAlias": "string",
          "indicatorId": 3,
          "indicatorTypeDescription": "string",
          "indicatorTypeId": 10,
          "indicatorTypeName": "string",
          "isChildIndicatorType": false,
          "unit": "string"
        }
      ],
      "indicatorAlias": "string",
      "indicatorId": 5,
      "indicatorTypeDescription": "string",
      "indicatorTypeId": 8,
      "indicatorTypeName": "string",
      "objectDescription": "string",
      "objectGroupId": 10,
      "objectId": 6,
      "objectName": "string",
      "pluginId": 9,
      "unit": "string"
    },
    {
      "data": [
        {
          "percentValue": 7,
          "rvalue": 3,
          "value": 3
        },
        {
          "percentValue": 4,
          "rvalue": 2,
          "value": 6
        }
      ],
      "deviceGroupId": 3,
      "deviceId": 7,
      "deviceName": "string",
      "extraIndicators": [
        {
          "data": [
            {
              "percentValue": 4,
              "rvalue": 3,
              "value": 8
            },
            {
              "percentValue": 10,
              "rvalue": 3,
              "value": 10
            },
            {
              "percentValue": 10,
              "rvalue": 10,
              "value": 9
            },
            {
              "percentValue": 1,
              "rvalue": 7,
              "value": 2
            }
          ],
          "indicatorAlias": "string",
          "indicatorId": 8,
          "indicatorTypeDescription": "string",
          "indicatorTypeId": 7,
          "indicatorTypeName": "string",
          "isChildIndicatorType": true,
          "unit": "string"
        },
        {
          "data": [
            {
              "percentValue": 9,
              "rvalue": 8,
              "value": 2
            },
            {
              "percentValue": 1,
              "rvalue": 7,
              "value": 4
            },
            {
              "percentValue": 8,
              "rvalue": 3,
              "value": 5
            },
            {
              "percentValue": 1,
              "rvalue": 5,
              "value": 5
            }
          ],
          "indicatorAlias": "string",
          "indicatorId": 5,
          "indicatorTypeDescription": "string",
          "indicatorTypeId": 9,
          "indicatorTypeName": "string",
          "isChildIndicatorType": true,
          "unit": "string"
        },
        {
          "data": [
            {
              "percentValue": 2,
              "rvalue": 6,
              "value": 3
            },
            {
              "percentValue": 9,
              "rvalue": 2,
              "value": 10
            },
            {
              "percentValue": 8,
              "rvalue": 4,
              "value": 4
            },
            {
              "percentValue": 7,
              "rvalue": 6,
              "value": 3
            }
          ],
          "indicatorAlias": "string",
          "indicatorId": 6,
          "indicatorTypeDescription": "string",
          "indicatorTypeId": 6,
          "indicatorTypeName": "string",
          "isChildIndicatorType": false,
          "unit": "string"
        },
        {
          "data": [
            {
              "percentValue": 5,
              "rvalue": 6,
              "value": 6
            }
          ],
          "indicatorAlias": "string",
          "indicatorId": 8,
          "indicatorTypeDescription": "string",
          "indicatorTypeId": 8,
          "indicatorTypeName": "string",
          "isChildIndicatorType": false,
          "unit": "string"
        },
        {
          "data": [
            {
              "percentValue": 7,
              "rvalue": 4,
              "value": 3
            },
            {
              "percentValue": 2,
              "rvalue": 3,
              "value": 5
            },
            {
              "percentValue": 5,
              "rvalue": 4,
              "value": 9
            },
            {
              "percentValue": 9,
              "rvalue": 2,
              "value": 10
            }
          ],
          "indicatorAlias": "string",
          "indicatorId": 5,
          "indicatorTypeDescription": "string",
          "indicatorTypeId": 1,
          "indicatorTypeName": "string",
          "isChildIndicatorType": true,
          "unit": "string"
        },
        {
          "data": [
            {
              "percentValue": 8,
              "rvalue": 4,
              "value": 2
            },
            {
              "percentValue": 2,
              "rvalue": 6,
              "value": 5
            },
            {
              "percentValue": 5,
              "rvalue": 4,
              "value": 3
            },
            {
              "percentValue": 1,
              "rvalue": 9,
              "value": 9
            },
            {
              "percentValue": 4,
              "rvalue": 4,
              "value": 7
            },
            {
              "percentValue": 5,
              "rvalue": 10,
              "value": 7
            },
            {
              "percentValue": 8,
              "rvalue": 3,
              "value": 6
            },
            {
              "percentValue": 2,
              "rvalue": 8,
              "value": 6
            }
          ],
          "indicatorAlias": "string",
          "indicatorId": 10,
          "indicatorTypeDescription": "string",
          "indicatorTypeId": 2,
          "indicatorTypeName": "string",
          "isChildIndicatorType": false,
          "unit": "string"
        }
      ],
      "indicatorAlias": "string",
      "indicatorId": 9,
      "indicatorTypeDescription": "string",
      "indicatorTypeId": 7,
      "indicatorTypeName": "string",
      "objectDescription": "string",
      "objectGroupId": 10,
      "objectId": 9,
      "objectName": "string",
      "pluginId": 3,
      "unit": "string"
    },
    {
      "data": [
        {
          "percentValue": 8,
          "rvalue": 7,
          "value": 4
        }
      ],
      "deviceGroupId": 6,
      "deviceId": 7,
      "deviceName": "string",
      "extraIndicators": [
        {
          "data": [
            {
              "percentValue": 9,
              "rvalue": 4,
              "value": 5
            },
            {
              "percentValue": 2,
              "rvalue": 9,
              "value": 3
            },
            {
              "percentValue": 8,
              "rvalue": 6,
              "value": 8
            },
            {
              "percentValue": 1,
              "rvalue": 2,
              "value": 7
            },
            {
              "percentValue": 8,
              "rvalue": 7,
              "value": 5
            },
            {
              "percentValue": 9,
              "rvalue": 9,
              "value": 2
            },
            {
              "percentValue": 8,
              "rvalue": 6,
              "value": 7
            },
            {
              "percentValue": 10,
              "rvalue": 6,
              "value": 8
            },
            {
              "percentValue": 5,
              "rvalue": 3,
              "value": 1
            }
          ],
          "indicatorAlias": "string",
          "indicatorId": 4,
          "indicatorTypeDescription": "string",
          "indicatorTypeId": 6,
          "indicatorTypeName": "string",
          "isChildIndicatorType": true,
          "unit": "string"
        },
        {
          "data": [
            {
              "percentValue": 1,
              "rvalue": 3,
              "value": 4
            },
            {
              "percentValue": 1,
              "rvalue": 1,
              "value": 9
            },
            {
              "percentValue": 2,
              "rvalue": 6,
              "value": 10
            },
            {
              "percentValue": 6,
              "rvalue": 3,
              "value": 7
            },
            {
              "percentValue": 1,
              "rvalue": 8,
              "value": 1
            }
          ],
          "indicatorAlias": "string",
          "indicatorId": 4,
          "indicatorTypeDescription": "string",
          "indicatorTypeId": 1,
          "indicatorTypeName": "string",
          "isChildIndicatorType": true,
          "unit": "string"
        },
        {
          "data": [
            {
              "percentValue": 8,
              "rvalue": 6,
              "value": 2
            },
            {
              "percentValue": 1,
              "rvalue": 4,
              "value": 4
            },
            {
              "percentValue": 2,
              "rvalue": 5,
              "value": 4
            },
            {
              "percentValue": 9,
              "rvalue": 9,
              "value": 7
            },
            {
              "percentValue": 4,
              "rvalue": 4,
              "value": 8
            },
            {
              "percentValue": 9,
              "rvalue": 4,
              "value": 1
            }
          ],
          "indicatorAlias": "string",
          "indicatorId": 3,
          "indicatorTypeDescription": "string",
          "indicatorTypeId": 6,
          "indicatorTypeName": "string",
          "isChildIndicatorType": false,
          "unit": "string"
        },
        {
          "data": [
            {
              "percentValue": 6,
              "rvalue": 8,
              "value": 1
            },
            {
              "percentValue": 5,
              "rvalue": 9,
              "value": 7
            },
            {
              "percentValue": 5,
              "rvalue": 2,
              "value": 2
            },
            {
              "percentValue": 6,
              "rvalue": 1,
              "value": 6
            },
            {
              "percentValue": 1,
              "rvalue": 8,
              "value": 5
            },
            {
              "percentValue": 10,
              "rvalue": 4,
              "value": 2
            },
            {
              "percentValue": 7,
              "rvalue": 4,
              "value": 7
            }
          ],
          "indicatorAlias": "string",
          "indicatorId": 6,
          "indicatorTypeDescription": "string",
          "indicatorTypeId": 9,
          "indicatorTypeName": "string",
          "isChildIndicatorType": false,
          "unit": "string"
        },
        {
          "data": [
            {
              "percentValue": 9,
              "rvalue": 2,
              "value": 1
            },
            {
              "percentValue": 6,
              "rvalue": 9,
              "value": 4
            },
            {
              "percentValue": 5,
              "rvalue": 2,
              "value": 6
            },
            {
              "percentValue": 10,
              "rvalue": 9,
              "value": 4
            },
            {
              "percentValue": 9,
              "rvalue": 6,
              "value": 1
            },
            {
              "percentValue": 3,
              "rvalue": 3,
              "value": 9
            },
            {
              "percentValue": 7,
              "rvalue": 9,
              "value": 9
            },
            {
              "percentValue": 6,
              "rvalue": 10,
              "value": 1
            },
            {
              "percentValue": 3,
              "rvalue": 6,
              "value": 4
            }
          ],
          "indicatorAlias": "string",
          "indicatorId": 5,
          "indicatorTypeDescription": "string",
          "indicatorTypeId": 10,
          "indicatorTypeName": "string",
          "isChildIndicatorType": true,
          "unit": "string"
        },
        {
          "data": [
            {
              "percentValue": 8,
              "rvalue": 4,
              "value": 9
            },
            {
              "percentValue": 4,
              "rvalue": 4,
              "value": 8
            }
          ],
          "indicatorAlias": "string",
          "indicatorId": 2,
          "indicatorTypeDescription": "string",
          "indicatorTypeId": 2,
          "indicatorTypeName": "string",
          "isChildIndicatorType": false,
          "unit": "string"
        },
        {
          "data": [
            {
              "percentValue": 2,
              "rvalue": 9,
              "value": 7
            },
            {
              "percentValue": 6,
              "rvalue": 8,
              "value": 1
            },
            {
              "percentValue": 10,
              "rvalue": 8,
              "value": 2
            },
            {
              "percentValue": 7,
              "rvalue": 9,
              "value": 8
            },
            {
              "percentValue": 5,
              "rvalue": 10,
              "value": 5
            },
            {
              "percentValue": 3,
              "rvalue": 2,
              "value": 1
            }
          ],
          "indicatorAlias": "string",
          "indicatorId": 5,
          "indicatorTypeDescription": "string",
          "indicatorTypeId": 8,
          "indicatorTypeName": "string",
          "isChildIndicatorType": false,
          "unit": "string"
        }
      ],
      "indicatorAlias": "string",
      "indicatorId": 9,
      "indicatorTypeDescription": "string",
      "indicatorTypeId": 7,
      "indicatorTypeName": "string",
      "objectDescription": "string",
      "objectGroupId": 1,
      "objectId": 8,
      "objectName": "string",
      "pluginId": 8,
      "unit": "string"
    },
    {
      "data": [
        {
          "percentValue": 9,
          "rvalue": 3,
          "value": 5
        },
        {
          "percentValue": 9,
          "rvalue": 7,
          "value": 10
        },
        {
          "percentValue": 7,
          "rvalue": 1,
          "value": 4
        }
      ],
      "deviceGroupId": 2,
      "deviceId": 8,
      "deviceName": "string",
      "extraIndicators": [
        {
          "data": [
            {
              "percentValue": 2,
              "rvalue": 4,
              "value": 7
            },
            {
              "percentValue": 2,
              "rvalue": 6,
              "value": 10
            },
            {
              "percentValue": 9,
              "rvalue": 4,
              "value": 7
            },
            {
              "percentValue": 10,
              "rvalue": 7,
              "value": 10
            },
            {
              "percentValue": 2,
              "rvalue": 6,
              "value": 8
            },
            {
              "percentValue": 1,
              "rvalue": 8,
              "value": 3
            },
            {
              "percentValue": 5,
              "rvalue": 4,
              "value": 8
            },
            {
              "percentValue": 10,
              "rvalue": 9,
              "value": 7
            }
          ],
          "indicatorAlias": "string",
          "indicatorId": 1,
          "indicatorTypeDescription": "string",
          "indicatorTypeId": 7,
          "indicatorTypeName": "string",
          "isChildIndicatorType": true,
          "unit": "string"
        },
        {
          "data": [
            {
              "percentValue": 4,
              "rvalue": 1,
              "value": 6
            },
            {
              "percentValue": 8,
              "rvalue": 3,
              "value": 4
            },
            {
              "percentValue": 8,
              "rvalue": 2,
              "value": 7
            },
            {
              "percentValue": 6,
              "rvalue": 4,
              "value": 4
            },
            {
              "percentValue": 4,
              "rvalue": 3,
              "value": 2
            },
            {
              "percentValue": 4,
              "rvalue": 10,
              "value": 4
            },
            {
              "percentValue": 1,
              "rvalue": 4,
              "value": 4
            }
          ],
          "indicatorAlias": "string",
          "indicatorId": 10,
          "indicatorTypeDescription": "string",
          "indicatorTypeId": 6,
          "indicatorTypeName": "string",
          "isChildIndicatorType": true,
          "unit": "string"
        },
        {
          "data": [
            {
              "percentValue": 9,
              "rvalue": 9,
              "value": 1
            }
          ],
          "indicatorAlias": "string",
          "indicatorId": 5,
          "indicatorTypeDescription": "string",
          "indicatorTypeId": 5,
          "indicatorTypeName": "string",
          "isChildIndicatorType": true,
          "unit": "string"
        },
        {
          "data": [
            {
              "percentValue": 8,
              "rvalue": 3,
              "value": 9
            },
            {
              "percentValue": 6,
              "rvalue": 10,
              "value": 8
            },
            {
              "percentValue": 5,
              "rvalue": 6,
              "value": 1
            },
            {
              "percentValue": 2,
              "rvalue": 3,
              "value": 1
            },
            {
              "percentValue": 7,
              "rvalue": 4,
              "value": 3
            }
          ],
          "indicatorAlias": "string",
          "indicatorId": 6,
          "indicatorTypeDescription": "string",
          "indicatorTypeId": 2,
          "indicatorTypeName": "string",
          "isChildIndicatorType": true,
          "unit": "string"
        },
        {
          "data": [
            {
              "percentValue": 3,
              "rvalue": 8,
              "value": 2
            },
            {
              "percentValue": 5,
              "rvalue": 3,
              "value": 10
            },
            {
              "percentValue": 1,
              "rvalue": 2,
              "value": 3
            },
            {
              "percentValue": 1,
              "rvalue": 3,
              "value": 8
            },
            {
              "percentValue": 3,
              "rvalue": 3,
              "value": 10
            },
            {
              "percentValue": 4,
              "rvalue": 2,
              "value": 6
            },
            {
              "percentValue": 6,
              "rvalue": 7,
              "value": 1
            },
            {
              "percentValue": 5,
              "rvalue": 2,
              "value": 9
            },
            {
              "percentValue": 5,
              "rvalue": 2,
              "value": 9
            },
            {
              "percentValue": 3,
              "rvalue": 6,
              "value": 8
            }
          ],
          "indicatorAlias": "string",
          "indicatorId": 2,
          "indicatorTypeDescription": "string",
          "indicatorTypeId": 7,
          "indicatorTypeName": "string",
          "isChildIndicatorType": true,
          "unit": "string"
        },
        {
          "data": [
            {
              "percentValue": 6,
              "rvalue": 3,
              "value": 7
            },
            {
              "percentValue": 5,
              "rvalue": 3,
              "value": 4
            },
            {
              "percentValue": 2,
              "rvalue": 9,
              "value": 4
            },
            {
              "percentValue": 1,
              "rvalue": 8,
              "value": 1
            },
            {
              "percentValue": 1,
              "rvalue": 9,
              "value": 6
            },
            {
              "percentValue": 1,
              "rvalue": 7,
              "value": 9
            }
          ],
          "indicatorAlias": "string",
          "indicatorId": 2,
          "indicatorTypeDescription": "string",
          "indicatorTypeId": 2,
          "indicatorTypeName": "string",
          "isChildIndicatorType": false,
          "unit": "string"
        }
      ],
      "indicatorAlias": "string",
      "indicatorId": 6,
      "indicatorTypeDescription": "string",
      "indicatorTypeId": 10,
      "indicatorTypeName": "string",
      "objectDescription": "string",
      "objectGroupId": 10,
      "objectId": 5,
      "objectName": "string",
      "pluginId": 7,
      "unit": "string"
    },
    {
      "data": [
        {
          "percentValue": 10,
          "rvalue": 2,
          "value": 2
        },
        {
          "percentValue": 2,
          "rvalue": 4,
          "value": 10
        },
        {
          "percentValue": 7,
          "rvalue": 3,
          "value": 1
        },
        {
          "percentValue": 2,
          "rvalue": 7,
          "value": 7
        },
        {
          "percentValue": 8,
          "rvalue": 5,
          "value": 5
        },
        {
          "percentValue": 3,
          "rvalue": 1,
          "value": 7
        },
        {
          "percentValue": 10,
          "rvalue": 7,
          "value": 6
        },
        {
          "percentValue": 6,
          "rvalue": 5,
          "value": 3
        }
      ],
      "deviceGroupId": 9,
      "deviceId": 4,
      "deviceName": "string",
      "extraIndicators": [
        {
          "data": [
            {
              "percentValue": 6,
              "rvalue": 6,
              "value": 8
            }
          ],
          "indicatorAlias": "string",
          "indicatorId": 10,
          "indicatorTypeDescription": "string",
          "indicatorTypeId": 6,
          "indicatorTypeName": "string",
          "isChildIndicatorType": false,
          "unit": "string"
        },
        {
          "data": [
            {
              "percentValue": 7,
              "rvalue": 9,
              "value": 10
            },
            {
              "percentValue": 7,
              "rvalue": 9,
              "value": 5
            },
            {
              "percentValue": 1,
              "rvalue": 10,
              "value": 3
            },
            {
              "percentValue": 5,
              "rvalue": 6,
              "value": 10
            },
            {
              "percentValue": 3,
              "rvalue": 7,
              "value": 2
            },
            {
              "percentValue": 6,
              "rvalue": 10,
              "value": 10
            }
          ],
          "indicatorAlias": "string",
          "indicatorId": 8,
          "indicatorTypeDescription": "string",
          "indicatorTypeId": 7,
          "indicatorTypeName": "string",
          "isChildIndicatorType": false,
          "unit": "string"
        },
        {
          "data": [
            {
              "percentValue": 6,
              "rvalue": 7,
              "value": 6
            },
            {
              "percentValue": 2,
              "rvalue": 1,
              "value": 1
            },
            {
              "percentValue": 8,
              "rvalue": 4,
              "value": 3
            },
            {
              "percentValue": 2,
              "rvalue": 4,
              "value": 4
            },
            {
              "percentValue": 5,
              "rvalue": 6,
              "value": 6
            }
          ],
          "indicatorAlias": "string",
          "indicatorId": 7,
          "indicatorTypeDescription": "string",
          "indicatorTypeId": 1,
          "indicatorTypeName": "string",
          "isChildIndicatorType": false,
          "unit": "string"
        },
        {
          "data": [
            {
              "percentValue": 6,
              "rvalue": 6,
              "value": 3
            },
            {
              "percentValue": 7,
              "rvalue": 5,
              "value": 2
            }
          ],
          "indicatorAlias": "string",
          "indicatorId": 4,
          "indicatorTypeDescription": "string",
          "indicatorTypeId": 10,
          "indicatorTypeName": "string",
          "isChildIndicatorType": false,
          "unit": "string"
        },
        {
          "data": [
            {
              "percentValue": 5,
              "rvalue": 10,
              "value": 5
            },
            {
              "percentValue": 9,
              "rvalue": 5,
              "value": 9
            },
            {
              "percentValue": 6,
              "rvalue": 7,
              "value": 3
            },
            {
              "percentValue": 6,
              "rvalue": 3,
              "value": 8
            }
          ],
          "indicatorAlias": "string",
          "indicatorId": 1,
          "indicatorTypeDescription": "string",
          "indicatorTypeId": 1,
          "indicatorTypeName": "string",
          "isChildIndicatorType": true,
          "unit": "string"
        },
        {
          "data": [
            {
              "percentValue": 2,
              "rvalue": 2,
              "value": 7
            },
            {
              "percentValue": 10,
              "rvalue": 3,
              "value": 4
            },
            {
              "percentValue": 1,
              "rvalue": 1,
              "value": 6
            },
            {
              "percentValue": 2,
              "rvalue": 7,
              "value": 6
            },
            {
              "percentValue": 4,
              "rvalue": 7,
              "value": 1
            },
            {
              "percentValue": 5,
              "rvalue": 8,
              "value": 5
            },
            {
              "percentValue": 4,
              "rvalue": 9,
              "value": 9
            }
          ],
          "indicatorAlias": "string",
          "indicatorId": 2,
          "indicatorTypeDescription": "string",
          "indicatorTypeId": 7,
          "indicatorTypeName": "string",
          "isChildIndicatorType": false,
          "unit": "string"
        }
      ],
      "indicatorAlias": "string",
      "indicatorId": 10,
      "indicatorTypeDescription": "string",
      "indicatorTypeId": 6,
      "indicatorTypeName": "string",
      "objectDescription": "string",
      "objectGroupId": 8,
      "objectId": 1,
      "objectName": "string",
      "pluginId": 8,
      "unit": "string"
    },
    {
      "data": [
        {
          "percentValue": 1,
          "rvalue": 10,
          "value": 10
        },
        {
          "percentValue": 4,
          "rvalue": 3,
          "value": 8
        },
        {
          "percentValue": 10,
          "rvalue": 9,
          "value": 5
        },
        {
          "percentValue": 3,
          "rvalue": 7,
          "value": 7
        }
      ],
      "deviceGroupId": 10,
      "deviceId": 10,
      "deviceName": "string",
      "extraIndicators": [
        {
          "data": [
            {
              "percentValue": 9,
              "rvalue": 4,
              "value": 4
            },
            {
              "percentValue": 4,
              "rvalue": 6,
              "value": 2
            },
            {
              "percentValue": 10,
              "rvalue": 7,
              "value": 1
            }
          ],
          "indicatorAlias": "string",
          "indicatorId": 8,
          "indicatorTypeDescription": "string",
          "indicatorTypeId": 7,
          "indicatorTypeName": "string",
          "isChildIndicatorType": true,
          "unit": "string"
        },
        {
          "data": [
            {
              "percentValue": 2,
              "rvalue": 1,
              "value": 1
            },
            {
              "percentValue": 2,
              "rvalue": 7,
              "value": 6
            },
            {
              "percentValue": 10,
              "rvalue": 6,
              "value": 4
            },
            {
              "percentValue": 1,
              "rvalue": 10,
              "value": 8
            },
            {
              "percentValue": 4,
              "rvalue": 2,
              "value": 6
            },
            {
              "percentValue": 6,
              "rvalue": 10,
              "value": 2
            },
            {
              "percentValue": 7,
              "rvalue": 1,
              "value": 1
            }
          ],
          "indicatorAlias": "string",
          "indicatorId": 1,
          "indicatorTypeDescription": "string",
          "indicatorTypeId": 10,
          "indicatorTypeName": "string",
          "isChildIndicatorType": false,
          "unit": "string"
        },
        {
          "data": [
            {
              "percentValue": 2,
              "rvalue": 1,
              "value": 4
            },
            {
              "percentValue": 8,
              "rvalue": 9,
              "value": 10
            },
            {
              "percentValue": 4,
              "rvalue": 4,
              "value": 7
            },
            {
              "percentValue": 9,
              "rvalue": 4,
              "value": 10
            },
            {
              "percentValue": 10,
              "rvalue": 10,
              "value": 3
            },
            {
              "percentValue": 10,
              "rvalue": 8,
              "value": 3
            },
            {
              "percentValue": 3,
              "rvalue": 9,
              "value": 5
            },
            {
              "percentValue": 3,
              "rvalue": 6,
              "value": 3
            },
            {
              "percentValue": 1,
              "rvalue": 9,
              "value": 6
            }
          ],
          "indicatorAlias": "string",
          "indicatorId": 8,
          "indicatorTypeDescription": "string",
          "indicatorTypeId": 5,
          "indicatorTypeName": "string",
          "isChildIndicatorType": false,
          "unit": "string"
        },
        {
          "data": [
            {
              "percentValue": 9,
              "rvalue": 8,
              "value": 6
            },
            {
              "percentValue": 10,
              "rvalue": 5,
              "value": 5
            },
            {
              "percentValue": 2,
              "rvalue": 4,
              "value": 10
            },
            {
              "percentValue": 9,
              "rvalue": 1,
              "value": 5
            },
            {
              "percentValue": 7,
              "rvalue": 7,
              "value": 1
            },
            {
              "percentValue": 8,
              "rvalue": 10,
              "value": 6
            },
            {
              "percentValue": 10,
              "rvalue": 2,
              "value": 3
            },
            {
              "percentValue": 6,
              "rvalue": 10,
              "value": 7
            },
            {
              "percentValue": 6,
              "rvalue": 10,
              "value": 9
            },
            {
              "percentValue": 9,
              "rvalue": 5,
              "value": 10
            }
          ],
          "indicatorAlias": "string",
          "indicatorId": 2,
          "indicatorTypeDescription": "string",
          "indicatorTypeId": 9,
          "indicatorTypeName": "string",
          "isChildIndicatorType": false,
          "unit": "string"
        },
        {
          "data": [
            {
              "percentValue": 10,
              "rvalue": 8,
              "value": 8
            },
            {
              "percentValue": 10,
              "rvalue": 5,
              "value": 9
            },
            {
              "percentValue": 3,
              "rvalue": 6,
              "value": 6
            },
            {
              "percentValue": 10,
              "rvalue": 9,
              "value": 7
            },
            {
              "percentValue": 8,
              "rvalue": 5,
              "value": 10
            },
            {
              "percentValue": 8,
              "rvalue": 8,
              "value": 5
            },
            {
              "percentValue": 9,
              "rvalue": 7,
              "value": 9
            },
            {
              "percentValue": 1,
              "rvalue": 6,
              "value": 1
            },
            {
              "percentValue": 2,
              "rvalue": 8,
              "value": 5
            },
            {
              "percentValue": 1,
              "rvalue": 10,
              "value": 1
            }
          ],
          "indicatorAlias": "string",
          "indicatorId": 9,
          "indicatorTypeDescription": "string",
          "indicatorTypeId": 9,
          "indicatorTypeName": "string",
          "isChildIndicatorType": true,
          "unit": "string"
        },
        {
          "data": [
            {
              "percentValue": 2,
              "rvalue": 6,
              "value": 9
            },
            {
              "percentValue": 2,
              "rvalue": 8,
              "value": 9
            },
            {
              "percentValue": 5,
              "rvalue": 4,
              "value": 1
            },
            {
              "percentValue": 9,
              "rvalue": 3,
              "value": 7
            }
          ],
          "indicatorAlias": "string",
          "indicatorId": 3,
          "indicatorTypeDescription": "string",
          "indicatorTypeId": 7,
          "indicatorTypeName": "string",
          "isChildIndicatorType": false,
          "unit": "string"
        }
      ],
      "indicatorAlias": "string",
      "indicatorId": 3,
      "indicatorTypeDescription": "string",
      "indicatorTypeId": 3,
      "indicatorTypeName": "string",
      "objectDescription": "string",
      "objectGroupId": 5,
      "objectId": 6,
      "objectName": "string",
      "pluginId": 1,
      "unit": "string"
    }
  ],
  "timeRanges": [
    {
      "endTime": 3,
      "name": "string",
      "startTime": 1
    },
    {
      "endTime": 8,
      "name": "string",
      "startTime": 10
    },
    {
      "endTime": 9,
      "name": "string",
      "startTime": 1
    },
    {
      "endTime": 6,
      "name": "string",
      "startTime": 5
    },
    {
      "endTime": 4,
      "name": "string",
      "startTime": 7
    },
    {
      "endTime": 7,
      "name": "string",
      "startTime": 5
    }
  ]
}