[
  {
    "focus": 3,
    "time": 6,
    "value": 10
  },
  {
    "focus": 9,
    "time": 5,
    "value": 8
  },
  {
    "focus": 8,
    "time": 4,
    "value": 6
  },
  {
    "focus": 7,
    "time": 6,
    "value": 8
  }
]