{
  "authentication": "SEVONE",
  "customTimeout": 9,
  "dateFormat": "string",
  "email": "string",
  "firstName": "string",
  "forcePasswordChange": true,
  "id": 5,
  "isActive": true,
  "lastName": "string",
  "password": "string",
  "passwordNeverExpires": true,
  "roleIds": [
    8
  ],
  "timezone": "string",
  "timezoneStartupCheck": true,
  "username": "string"
}