{
  "id": 5,
  "members": [
    {
      "alternateName": "string",
      "dateAdded": 2,
      "description": "string",
      "deviceId": 10,
      "enabled": "AUTO",
      "extendedInfo": {},
      "id": 10,
      "indicators": [
        {
          "dataUnits": "string",
          "description": "string",
          "deviceId": 10,
          "displayUnits": "string",
          "evaluationOrder": 3,
          "extendedInfo": {},
          "firstSeen": 2,
          "format": "COUNTER32",
          "id": 2,
          "isBaselining": false,
          "isDeleted": false,
          "isEnabled": true,
          "lastInvalidationTime": 3,
          "lastSeen": 2,
          "maxValue": 9,
          "name": "string",
          "objectId": 7,
          "pluginId": 6,
          "pluginIndicatorTypeId": 3,
          "syntheticExpression": "string",
          "systemIsBaselining": true,
          "systemIsEnabled": true,
          "systemMaxValue": 6
        },
        {
          "dataUnits": "string",
          "description": "string",
          "deviceId": 4,
          "displayUnits": "string",
          "evaluationOrder": 6,
          "extendedInfo": {},
          "firstSeen": 8,
          "format": "COUNTER64",
          "id": 7,
          "isBaselining": true,
          "isDeleted": false,
          "isEnabled": true,
          "lastInvalidationTime": 9,
          "lastSeen": 10,
          "maxValue": 1,
          "name": "string",
          "objectId": 4,
          "pluginId": 1,
          "pluginIndicatorTypeId": 2,
          "syntheticExpression": "string",
          "systemIsBaselining": false,
          "systemIsEnabled": true,
          "systemMaxValue": 4
        },
        {
          "dataUnits": "string",
          "description": "string",
          "deviceId": 1,
          "displayUnits": "string",
          "evaluationOrder": 6,
          "extendedInfo": {},
          "firstSeen": 5,
          "format": "COUNTER32",
          "id": 1,
          "isBaselining": true,
          "isDeleted": true,
          "isEnabled": true,
          "lastInvalidationTime": 10,
          "lastSeen": 7,
          "maxValue": 7,
          "name": "string",
          "objectId": 3,
          "pluginId": 7,
          "pluginIndicatorTypeId": 1,
          "syntheticExpression": "string",
          "systemIsBaselining": false,
          "systemIsEnabled": false,
          "systemMaxValue": 4
        },
        {
          "dataUnits": "string",
          "description": "string",
          "deviceId": 1,
          "displayUnits": "string",
          "evaluationOrder": 2,
          "extendedInfo": {},
          "firstSeen": 7,
          "format": "COUNTER32",
          "id": 2,
          "isBaselining": true,
          "isDeleted": true,
          "isEnabled": true,
          "lastInvalidationTime": 8,
          "lastSeen": 5,
          "maxValue": 5,
          "name": "string",
          "objectId": 3,
          "pluginId": 9,
          "pluginIndicatorTypeId": 7,
          "syntheticExpression": "string",
          "systemIsBaselining": true,
          "systemIsEnabled": false,
          "systemMaxValue": 10
        },
        {
          "dataUnits": "string",
          "description": "string",
          "deviceId": 10,
          "displayUnits": "string",
          "evaluationOrder": 8,
          "extendedInfo": {},
          "firstSeen": 4,
          "format": "GAUGE",
          "id": 1,
          "isBaselining": true,
          "isDeleted": true,
          "isEnabled": false,
          "lastInvalidationTime": 10,
          "lastSeen": 5,
          "maxValue": 1,
          "name": "string",
          "objectId": 1,
          "pluginId": 8,
          "pluginIndicatorTypeId": 6,
          "syntheticExpression": "string",
          "systemIsBaselining": false,
          "systemIsEnabled": false,
          "systemMaxValue": 7
        },
        {
          "dataUnits": "string",
          "description": "string",
          "deviceId": 2,
          "displayUnits": "string",
          "evaluationOrder": 4,
          "extendedInfo": {},
          "firstSeen": 10,
          "format": "COUNTER32",
          "id": 8,
          "isBaselining": true,
          "isDeleted": true,
          "isEnabled": true,
          "lastInvalidationTime": 4,
          "lastSeen": 10,
          "maxValue": 8,
          "name": "string",
          "objectId": 2,
          "pluginId": 5,
          "pluginIndicatorTypeId": 6,
          "syntheticExpression": "string",
          "systemIsBaselining": true,
          "systemIsEnabled": false,
          "systemMaxValue": 1
        },
        {
          "dataUnits": "string",
          "description": "string",
          "deviceId": 5,
          "displayUnits": "string",
          "evaluationOrder": 3,
          "extendedInfo": {},
          "firstSeen": 7,
          "format": "COUNTER64",
          "id": 6,
          "isBaselining": false,
          "isDeleted": false,
          "isEnabled": false,
          "lastInvalidationTime": 6,
          "lastSeen": 9,
          "maxValue": 4,
          "name": "string",
          "objectId": 8,
          "pluginId": 3,
          "pluginIndicatorTypeId": 3,
          "syntheticExpression": "string",
          "systemIsBaselining": true,
          "systemIsEnabled": false,
          "systemMaxValue": 9
        },
        {
          "dataUnits": "string",
          "description": "string",
          "deviceId": 8,
          "displayUnits": "string",
          "evaluationOrder": 1,
          "extendedInfo": {},
          "firstSeen": 3,
          "format": "COUNTER32",
          "id": 8,
          "isBaselining": true,
          "isDeleted": true,
          "isEnabled": false,
          "lastInvalidationTime": 2,
          "lastSeen": 3,
          "maxValue": 6,
          "name": "string",
          "objectId": 10,
          "pluginId": 6,
          "pluginIndicatorTypeId": 9,
          "syntheticExpression": "string",
          "systemIsBaselining": true,
          "systemIsEnabled": true,
          "systemMaxValue": 4
        }
      ],
      "isDeleted": false,
      "isEnabled": true,
      "isVisible": true,
      "name": "string",
      "pluginId": 5,
      "pluginObjectTypeId": 5,
      "subtypeId": 1
    },
    {
      "alternateName": "string",
      "dateAdded": 5,
      "description": "string",
      "deviceId": 4,
      "enabled": "DISABLED",
      "extendedInfo": {},
      "id": 6,
      "indicators": [
        {
          "dataUnits": "string",
          "description": "string",
          "deviceId": 10,
          "displayUnits": "string",
          "evaluationOrder": 2,
          "extendedInfo": {},
          "firstSeen": 10,
          "format": "GAUGE",
          "id": 5,
          "isBaselining": true,
          "isDeleted": false,
          "isEnabled": true,
          "lastInvalidationTime": 5,
          "lastSeen": 8,
          "maxValue": 8,
          "name": "string",
          "objectId": 8,
          "pluginId": 9,
          "pluginIndicatorTypeId": 9,
          "syntheticExpression": "string",
          "systemIsBaselining": false,
          "systemIsEnabled": true,
          "systemMaxValue": 3
        },
        {
          "dataUnits": "string",
          "description": "string",
          "deviceId": 5,
          "displayUnits": "string",
          "evaluationOrder": 8,
          "extendedInfo": {},
          "firstSeen": 2,
          "format": "GAUGE",
          "id": 4,
          "isBaselining": true,
          "isDeleted": false,
          "isEnabled": false,
          "lastInvalidationTime": 10,
          "lastSeen": 8,
          "maxValue": 8,
          "name": "string",
          "objectId": 5,
          "pluginId": 9,
          "pluginIndicatorTypeId": 4,
          "syntheticExpression": "string",
          "systemIsBaselining": false,
          "systemIsEnabled": true,
          "systemMaxValue": 3
        }
      ],
      "isDeleted": true,
      "isEnabled": false,
      "isVisible": false,
      "name": "string",
      "pluginId": 5,
      "pluginObjectTypeId": 6,
      "subtypeId": 4
    },
    {
      "alternateName": "string",
      "dateAdded": 9,
      "description": "string",
      "deviceId": 7,
      "enabled": "AUTO",
      "extendedInfo": {},
      "id": 8,
      "indicators": [
        {
          "dataUnits": "string",
          "description": "string",
          "deviceId": 9,
          "displayUnits": "string",
          "evaluationOrder": 2,
          "extendedInfo": {},
          "firstSeen": 6,
          "format": "COUNTER64",
          "id": 6,
          "isBaselining": false,
          "isDeleted": true,
          "isEnabled": false,
          "lastInvalidationTime": 10,
          "lastSeen": 8,
          "maxValue": 7,
          "name": "string",
          "objectId": 10,
          "pluginId": 8,
          "pluginIndicatorTypeId": 1,
          "syntheticExpression": "string",
          "systemIsBaselining": false,
          "systemIsEnabled": false,
          "systemMaxValue": 5
        },
        {
          "dataUnits": "string",
          "description": "string",
          "deviceId": 7,
          "displayUnits": "string",
          "evaluationOrder": 7,
          "extendedInfo": {},
          "firstSeen": 6,
          "format": "GAUGE",
          "id": 8,
          "isBaselining": true,
          "isDeleted": false,
          "isEnabled": true,
          "lastInvalidationTime": 8,
          "lastSeen": 7,
          "maxValue": 1,
          "name": "string",
          "objectId": 9,
          "pluginId": 9,
          "pluginIndicatorTypeId": 10,
          "syntheticExpression": "string",
          "systemIsBaselining": false,
          "systemIsEnabled": true,
          "systemMaxValue": 8
        },
        {
          "dataUnits": "string",
          "description": "string",
          "deviceId": 1,
          "displayUnits": "string",
          "evaluationOrder": 2,
          "extendedInfo": {},
          "firstSeen": 3,
          "format": "GAUGE",
          "id": 3,
          "isBaselining": false,
          "isDeleted": true,
          "isEnabled": false,
          "lastInvalidationTime": 9,
          "lastSeen": 8,
          "maxValue": 2,
          "name": "string",
          "objectId": 2,
          "pluginId": 6,
          "pluginIndicatorTypeId": 5,
          "syntheticExpression": "string",
          "systemIsBaselining": false,
          "systemIsEnabled": true,
          "systemMaxValue": 7
        },
        {
          "dataUnits": "string",
          "description": "string",
          "deviceId": 4,
          "displayUnits": "string",
          "evaluationOrder": 6,
          "extendedInfo": {},
          "firstSeen": 10,
          "format": "COUNTER64",
          "id": 6,
          "isBaselining": false,
          "isDeleted": true,
          "isEnabled": false,
          "lastInvalidationTime": 6,
          "lastSeen": 1,
          "maxValue": 3,
          "name": "string",
          "objectId": 2,
          "pluginId": 9,
          "pluginIndicatorTypeId": 3,
          "syntheticExpression": "string",
          "systemIsBaselining": false,
          "systemIsEnabled": true,
          "systemMaxValue": 5
        },
        {
          "dataUnits": "string",
          "description": "string",
          "deviceId": 2,
          "displayUnits": "string",
          "evaluationOrder": 5,
          "extendedInfo": {},
          "firstSeen": 5,
          "format": "COUNTER32",
          "id": 8,
          "isBaselining": false,
          "isDeleted": true,
          "isEnabled": true,
          "lastInvalidationTime": 2,
          "lastSeen": 1,
          "maxValue": 9,
          "name": "string",
          "objectId": 6,
          "pluginId": 3,
          "pluginIndicatorTypeId": 1,
          "syntheticExpression": "string",
          "systemIsBaselining": true,
          "systemIsEnabled": true,
          "systemMaxValue": 10
        }
      ],
      "isDeleted": false,
      "isEnabled": true,
      "isVisible": false,
      "name": "string",
      "pluginId": 9,
      "pluginObjectTypeId": 5,
      "subtypeId": 1
    },
    {
      "alternateName": "string",
      "dateAdded": 3,
      "description": "string",
      "deviceId": 10,
      "enabled": "DISABLED",
      "extendedInfo": {},
      "id": 8,
      "indicators": [
        {
          "dataUnits": "string",
          "description": "string",
          "deviceId": 6,
          "displayUnits": "string",
          "evaluationOrder": 10,
          "extendedInfo": {},
          "firstSeen": 3,
          "format": "GAUGE",
          "id": 10,
          "isBaselining": false,
          "isDeleted": false,
          "isEnabled": false,
          "lastInvalidationTime": 4,
          "lastSeen": 9,
          "maxValue": 10,
          "name": "string",
          "objectId": 6,
          "pluginId": 9,
          "pluginIndicatorTypeId": 5,
          "syntheticExpression": "string",
          "systemIsBaselining": false,
          "systemIsEnabled": true,
          "systemMaxValue": 1
        },
        {
          "dataUnits": "string",
          "description": "string",
          "deviceId": 3,
          "displayUnits": "string",
          "evaluationOrder": 5,
          "extendedInfo": {},
          "firstSeen": 10,
          "format": "GAUGE",
          "id": 10,
          "isBaselining": true,
          "isDeleted": true,
          "isEnabled": false,
          "lastInvalidationTime": 9,
          "lastSeen": 3,
          "maxValue": 6,
          "name": "string",
          "objectId": 4,
          "pluginId": 5,
          "pluginIndicatorTypeId": 10,
          "syntheticExpression": "string",
          "systemIsBaselining": false,
          "systemIsEnabled": true,
          "systemMaxValue": 1
        },
        {
          "dataUnits": "string",
          "description": "string",
          "deviceId": 10,
          "displayUnits": "string",
          "evaluationOrder": 5,
          "extendedInfo": {},
          "firstSeen": 5,
          "format": "COUNTER32",
          "id": 7,
          "isBaselining": false,
          "isDeleted": false,
          "isEnabled": false,
          "lastInvalidationTime": 9,
          "lastSeen": 3,
          "maxValue": 6,
          "name": "string",
          "objectId": 1,
          "pluginId": 10,
          "pluginIndicatorTypeId": 2,
          "syntheticExpression": "string",
          "systemIsBaselining": true,
          "systemIsEnabled": false,
          "systemMaxValue": 10
        },
        {
          "dataUnits": "string",
          "description": "string",
          "deviceId": 4,
          "displayUnits": "string",
          "evaluationOrder": 1,
          "extendedInfo": {},
          "firstSeen": 5,
          "format": "COUNTER32",
          "id": 7,
          "isBaselining": false,
          "isDeleted": false,
          "isEnabled": true,
          "lastInvalidationTime": 3,
          "lastSeen": 6,
          "maxValue": 1,
          "name": "string",
          "objectId": 9,
          "pluginId": 8,
          "pluginIndicatorTypeId": 10,
          "syntheticExpression": "string",
          "systemIsBaselining": true,
          "systemIsEnabled": true,
          "systemMaxValue": 7
        },
        {
          "dataUnits": "string",
          "description": "string",
          "deviceId": 8,
          "displayUnits": "string",
          "evaluationOrder": 8,
          "extendedInfo": {},
          "firstSeen": 6,
          "format": "COUNTER64",
          "id": 2,
          "isBaselining": false,
          "isDeleted": true,
          "isEnabled": true,
          "lastInvalidationTime": 10,
          "lastSeen": 2,
          "maxValue": 9,
          "name": "string",
          "objectId": 8,
          "pluginId": 6,
          "pluginIndicatorTypeId": 5,
          "syntheticExpression": "string",
          "systemIsBaselining": true,
          "systemIsEnabled": false,
          "systemMaxValue": 7
        },
        {
          "dataUnits": "string",
          "description": "string",
          "deviceId": 1,
          "displayUnits": "string",
          "evaluationOrder": 2,
          "extendedInfo": {},
          "firstSeen": 3,
          "format": "GAUGE",
          "id": 3,
          "isBaselining": true,
          "isDeleted": false,
          "isEnabled": false,
          "lastInvalidationTime": 5,
          "lastSeen": 7,
          "maxValue": 6,
          "name": "string",
          "objectId": 5,
          "pluginId": 7,
          "pluginIndicatorTypeId": 3,
          "syntheticExpression": "string",
          "systemIsBaselining": true,
          "systemIsEnabled": false,
          "systemMaxValue": 9
        },
        {
          "dataUnits": "string",
          "description": "string",
          "deviceId": 3,
          "displayUnits": "string",
          "evaluationOrder": 7,
          "extendedInfo": {},
          "firstSeen": 8,
          "format": "COUNTER64",
          "id": 1,
          "isBaselining": true,
          "isDeleted": true,
          "isEnabled": true,
          "lastInvalidationTime": 8,
          "lastSeen": 7,
          "maxValue": 7,
          "name": "string",
          "objectId": 7,
          "pluginId": 9,
          "pluginIndicatorTypeId": 5,
          "syntheticExpression": "string",
          "systemIsBaselining": false,
          "systemIsEnabled": false,
          "systemMaxValue": 5
        },
        {
          "dataUnits": "string",
          "description": "string",
          "deviceId": 2,
          "displayUnits": "string",
          "evaluationOrder": 6,
          "extendedInfo": {},
          "firstSeen": 10,
          "format": "GAUGE",
          "id": 10,
          "isBaselining": true,
          "isDeleted": false,
          "isEnabled": true,
          "lastInvalidationTime": 4,
          "lastSeen": 8,
          "maxValue": 6,
          "name": "string",
          "objectId": 8,
          "pluginId": 10,
          "pluginIndicatorTypeId": 5,
          "syntheticExpression": "string",
          "systemIsBaselining": false,
          "systemIsEnabled": false,
          "systemMaxValue": 6
        },
        {
          "dataUnits": "string",
          "description": "string",
          "deviceId": 7,
          "displayUnits": "string",
          "evaluationOrder": 4,
          "extendedInfo": {},
          "firstSeen": 3,
          "format": "GAUGE",
          "id": 4,
          "isBaselining": false,
          "isDeleted": true,
          "isEnabled": true,
          "lastInvalidationTime": 9,
          "lastSeen": 1,
          "maxValue": 10,
          "name": "string",
          "objectId": 6,
          "pluginId": 10,
          "pluginIndicatorTypeId": 4,
          "syntheticExpression": "string",
          "systemIsBaselining": true,
          "systemIsEnabled": false,
          "systemMaxValue": 9
        },
        {
          "dataUnits": "string",
          "description": "string",
          "deviceId": 8,
          "displayUnits": "string",
          "evaluationOrder": 9,
          "extendedInfo": {},
          "firstSeen": 7,
          "format": "GAUGE",
          "id": 3,
          "isBaselining": true,
          "isDeleted": false,
          "isEnabled": false,
          "lastInvalidationTime": 4,
          "lastSeen": 5,
          "maxValue": 5,
          "name": "string",
          "objectId": 7,
          "pluginId": 7,
          "pluginIndicatorTypeId": 4,
          "syntheticExpression": "string",
          "systemIsBaselining": true,
          "systemIsEnabled": true,
          "systemMaxValue": 4
        }
      ],
      "isDeleted": true,
      "isEnabled": false,
      "isVisible": true,
      "name": "string",
      "pluginId": 7,
      "pluginObjectTypeId": 2,
      "subtypeId": 1
    },
    {
      "alternateName": "string",
      "dateAdded": 10,
      "description": "string",
      "deviceId": 3,
      "enabled": "AUTO",
      "extendedInfo": {},
      "id": 8,
      "indicators": [
        {
          "dataUnits": "string",
          "description": "string",
          "deviceId": 3,
          "displayUnits": "string",
          "evaluationOrder": 8,
          "extendedInfo": {},
          "firstSeen": 10,
          "format": "COUNTER64",
          "id": 3,
          "isBaselining": true,
          "isDeleted": false,
          "isEnabled": true,
          "lastInvalidationTime": 3,
          "lastSeen": 2,
          "maxValue": 5,
          "name": "string",
          "objectId": 4,
          "pluginId": 7,
          "pluginIndicatorTypeId": 10,
          "syntheticExpression": "string",
          "systemIsBaselining": true,
          "systemIsEnabled": true,
          "systemMaxValue": 1
        },
        {
          "dataUnits": "string",
          "description": "string",
          "deviceId": 3,
          "displayUnits": "string",
          "evaluationOrder": 7,
          "extendedInfo": {},
          "firstSeen": 5,
          "format": "COUNTER32",
          "id": 9,
          "isBaselining": false,
          "isDeleted": false,
          "isEnabled": true,
          "lastInvalidationTime": 2,
          "lastSeen": 6,
          "maxValue": 8,
          "name": "string",
          "objectId": 6,
          "pluginId": 6,
          "pluginIndicatorTypeId": 8,
          "syntheticExpression": "string",
          "systemIsBaselining": false,
          "systemIsEnabled": true,
          "systemMaxValue": 6
        }
      ],
      "isDeleted": true,
      "isEnabled": false,
      "isVisible": true,
      "name": "string",
      "pluginId": 7,
      "pluginObjectTypeId": 10,
      "subtypeId": 8
    },
    {
      "alternateName": "string",
      "dateAdded": 3,
      "description": "string",
      "deviceId": 6,
      "enabled": "AUTO",
      "extendedInfo": {},
      "id": 1,
      "indicators": [
        {
          "dataUnits": "string",
          "description": "string",
          "deviceId": 2,
          "displayUnits": "string",
          "evaluationOrder": 8,
          "extendedInfo": {},
          "firstSeen": 7,
          "format": "COUNTER32",
          "id": 10,
          "isBaselining": true,
          "isDeleted": false,
          "isEnabled": false,
          "lastInvalidationTime": 9,
          "lastSeen": 2,
          "maxValue": 4,
          "name": "string",
          "objectId": 7,
          "pluginId": 9,
          "pluginIndicatorTypeId": 9,
          "syntheticExpression": "string",
          "systemIsBaselining": false,
          "systemIsEnabled": false,
          "systemMaxValue": 7
        },
        {
          "dataUnits": "string",
          "description": "string",
          "deviceId": 2,
          "displayUnits": "string",
          "evaluationOrder": 8,
          "extendedInfo": {},
          "firstSeen": 4,
          "format": "GAUGE",
          "id": 9,
          "isBaselining": true,
          "isDeleted": true,
          "isEnabled": false,
          "lastInvalidationTime": 3,
          "lastSeen": 4,
          "maxValue": 3,
          "name": "string",
          "objectId": 4,
          "pluginId": 5,
          "pluginIndicatorTypeId": 6,
          "syntheticExpression": "string",
          "systemIsBaselining": false,
          "systemIsEnabled": true,
          "systemMaxValue": 7
        },
        {
          "dataUnits": "string",
          "description": "string",
          "deviceId": 4,
          "displayUnits": "string",
          "evaluationOrder": 8,
          "extendedInfo": {},
          "firstSeen": 10,
          "format": "COUNTER32",
          "id": 6,
          "isBaselining": true,
          "isDeleted": false,
          "isEnabled": true,
          "lastInvalidationTime": 9,
          "lastSeen": 10,
          "maxValue": 9,
          "name": "string",
          "objectId": 9,
          "pluginId": 4,
          "pluginIndicatorTypeId": 6,
          "syntheticExpression": "string",
          "systemIsBaselining": false,
          "systemIsEnabled": false,
          "systemMaxValue": 3
        },
        {
          "dataUnits": "string",
          "description": "string",
          "deviceId": 9,
          "displayUnits": "string",
          "evaluationOrder": 1,
          "extendedInfo": {},
          "firstSeen": 10,
          "format": "COUNTER32",
          "id": 3,
          "isBaselining": false,
          "isDeleted": true,
          "isEnabled": true,
          "lastInvalidationTime": 1,
          "lastSeen": 8,
          "maxValue": 9,
          "name": "string",
          "objectId": 6,
          "pluginId": 4,
          "pluginIndicatorTypeId": 2,
          "syntheticExpression": "string",
          "systemIsBaselining": false,
          "systemIsEnabled": true,
          "systemMaxValue": 9
        },
        {
          "dataUnits": "string",
          "description": "string",
          "deviceId": 4,
          "displayUnits": "string",
          "evaluationOrder": 3,
          "extendedInfo": {},
          "firstSeen": 7,
          "format": "COUNTER32",
          "id": 7,
          "isBaselining": false,
          "isDeleted": true,
          "isEnabled": true,
          "lastInvalidationTime": 8,
          "lastSeen": 5,
          "maxValue": 4,
          "name": "string",
          "objectId": 7,
          "pluginId": 3,
          "pluginIndicatorTypeId": 10,
          "syntheticExpression": "string",
          "systemIsBaselining": false,
          "systemIsEnabled": false,
          "systemMaxValue": 1
        },
        {
          "dataUnits": "string",
          "description": "string",
          "deviceId": 4,
          "displayUnits": "string",
          "evaluationOrder": 1,
          "extendedInfo": {},
          "firstSeen": 7,
          "format": "COUNTER32",
          "id": 3,
          "isBaselining": true,
          "isDeleted": false,
          "isEnabled": true,
          "lastInvalidationTime": 5,
          "lastSeen": 1,
          "maxValue": 3,
          "name": "string",
          "objectId": 8,
          "pluginId": 4,
          "pluginIndicatorTypeId": 5,
          "syntheticExpression": "string",
          "systemIsBaselining": true,
          "systemIsEnabled": false,
          "systemMaxValue": 6
        },
        {
          "dataUnits": "string",
          "description": "string",
          "deviceId": 5,
          "displayUnits": "string",
          "evaluationOrder": 5,
          "extendedInfo": {},
          "firstSeen": 3,
          "format": "GAUGE",
          "id": 3,
          "isBaselining": true,
          "isDeleted": false,
          "isEnabled": false,
          "lastInvalidationTime": 2,
          "lastSeen": 3,
          "maxValue": 1,
          "name": "string",
          "objectId": 3,
          "pluginId": 4,
          "pluginIndicatorTypeId": 2,
          "syntheticExpression": "string",
          "systemIsBaselining": true,
          "systemIsEnabled": false,
          "systemMaxValue": 3
        },
        {
          "dataUnits": "string",
          "description": "string",
          "deviceId": 6,
          "displayUnits": "string",
          "evaluationOrder": 6,
          "extendedInfo": {},
          "firstSeen": 8,
          "format": "GAUGE",
          "id": 2,
          "isBaselining": true,
          "isDeleted": true,
          "isEnabled": false,
          "lastInvalidationTime": 8,
          "lastSeen": 9,
          "maxValue": 4,
          "name": "string",
          "objectId": 1,
          "pluginId": 7,
          "pluginIndicatorTypeId": 9,
          "syntheticExpression": "string",
          "systemIsBaselining": true,
          "systemIsEnabled": false,
          "systemMaxValue": 7
        },
        {
          "dataUnits": "string",
          "description": "string",
          "deviceId": 1,
          "displayUnits": "string",
          "evaluationOrder": 8,
          "extendedInfo": {},
          "firstSeen": 4,
          "format": "COUNTER32",
          "id": 4,
          "isBaselining": false,
          "isDeleted": true,
          "isEnabled": false,
          "lastInvalidationTime": 3,
          "lastSeen": 6,
          "maxValue": 5,
          "name": "string",
          "objectId": 4,
          "pluginId": 4,
          "pluginIndicatorTypeId": 9,
          "syntheticExpression": "string",
          "systemIsBaselining": false,
          "systemIsEnabled": true,
          "systemMaxValue": 8
        }
      ],
      "isDeleted": true,
      "isEnabled": true,
      "isVisible": true,
      "name": "string",
      "pluginId": 10,
      "pluginObjectTypeId": 4,
      "subtypeId": 8
    },
    {
      "alternateName": "string",
      "dateAdded": 7,
      "description": "string",
      "deviceId": 4,
      "enabled": "ENABLED",
      "extendedInfo": {},
      "id": 7,
      "indicators": [
        {
          "dataUnits": "string",
          "description": "string",
          "deviceId": 9,
          "displayUnits": "string",
          "evaluationOrder": 4,
          "extendedInfo": {},
          "firstSeen": 6,
          "format": "GAUGE",
          "id": 6,
          "isBaselining": false,
          "isDeleted": true,
          "isEnabled": true,
          "lastInvalidationTime": 7,
          "lastSeen": 7,
          "maxValue": 9,
          "name": "string",
          "objectId": 4,
          "pluginId": 10,
          "pluginIndicatorTypeId": 5,
          "syntheticExpression": "string",
          "systemIsBaselining": false,
          "systemIsEnabled": false,
          "systemMaxValue": 8
        },
        {
          "dataUnits": "string",
          "description": "string",
          "deviceId": 6,
          "displayUnits": "string",
          "evaluationOrder": 1,
          "extendedInfo": {},
          "firstSeen": 1,
          "format": "COUNTER64",
          "id": 7,
          "isBaselining": false,
          "isDeleted": true,
          "isEnabled": true,
          "lastInvalidationTime": 5,
          "lastSeen": 9,
          "maxValue": 7,
          "name": "string",
          "objectId": 2,
          "pluginId": 4,
          "pluginIndicatorTypeId": 6,
          "syntheticExpression": "string",
          "systemIsBaselining": false,
          "systemIsEnabled": false,
          "systemMaxValue": 6
        },
        {
          "dataUnits": "string",
          "description": "string",
          "deviceId": 7,
          "displayUnits": "string",
          "evaluationOrder": 2,
          "extendedInfo": {},
          "firstSeen": 8,
          "format": "COUNTER32",
          "id": 5,
          "isBaselining": false,
          "isDeleted": false,
          "isEnabled": false,
          "lastInvalidationTime": 5,
          "lastSeen": 10,
          "maxValue": 10,
          "name": "string",
          "objectId": 8,
          "pluginId": 9,
          "pluginIndicatorTypeId": 9,
          "syntheticExpression": "string",
          "systemIsBaselining": false,
          "systemIsEnabled": true,
          "systemMaxValue": 2
        },
        {
          "dataUnits": "string",
          "description": "string",
          "deviceId": 3,
          "displayUnits": "string",
          "evaluationOrder": 4,
          "extendedInfo": {},
          "firstSeen": 3,
          "format": "COUNTER64",
          "id": 9,
          "isBaselining": true,
          "isDeleted": false,
          "isEnabled": false,
          "lastInvalidationTime": 4,
          "lastSeen": 4,
          "maxValue": 4,
          "name": "string",
          "objectId": 4,
          "pluginId": 4,
          "pluginIndicatorTypeId": 9,
          "syntheticExpression": "string",
          "systemIsBaselining": false,
          "systemIsEnabled": true,
          "systemMaxValue": 1
        },
        {
          "dataUnits": "string",
          "description": "string",
          "deviceId": 4,
          "displayUnits": "string",
          "evaluationOrder": 5,
          "extendedInfo": {},
          "firstSeen": 2,
          "format": "COUNTER32",
          "id": 1,
          "isBaselining": true,
          "isDeleted": false,
          "isEnabled": false,
          "lastInvalidationTime": 4,
          "lastSeen": 3,
          "maxValue": 1,
          "name": "string",
          "objectId": 2,
          "pluginId": 1,
          "pluginIndicatorTypeId": 9,
          "syntheticExpression": "string",
          "systemIsBaselining": false,
          "systemIsEnabled": true,
          "systemMaxValue": 1
        },
        {
          "dataUnits": "string",
          "description": "string",
          "deviceId": 7,
          "displayUnits": "string",
          "evaluationOrder": 8,
          "extendedInfo": {},
          "firstSeen": 5,
          "format": "COUNTER32",
          "id": 9,
          "isBaselining": true,
          "isDeleted": false,
          "isEnabled": false,
          "lastInvalidationTime": 4,
          "lastSeen": 2,
          "maxValue": 2,
          "name": "string",
          "objectId": 1,
          "pluginId": 4,
          "pluginIndicatorTypeId": 7,
          "syntheticExpression": "string",
          "systemIsBaselining": false,
          "systemIsEnabled": false,
          "systemMaxValue": 9
        },
        {
          "dataUnits": "string",
          "description": "string",
          "deviceId": 9,
          "displayUnits": "string",
          "evaluationOrder": 6,
          "extendedInfo": {},
          "firstSeen": 5,
          "format": "GAUGE",
          "id": 1,
          "isBaselining": false,
          "isDeleted": true,
          "isEnabled": true,
          "lastInvalidationTime": 2,
          "lastSeen": 3,
          "maxValue": 1,
          "name": "string",
          "objectId": 6,
          "pluginId": 9,
          "pluginIndicatorTypeId": 8,
          "syntheticExpression": "string",
          "systemIsBaselining": false,
          "systemIsEnabled": false,
          "systemMaxValue": 5
        },
        {
          "dataUnits": "string",
          "description": "string",
          "deviceId": 4,
          "displayUnits": "string",
          "evaluationOrder": 2,
          "extendedInfo": {},
          "firstSeen": 4,
          "format": "COUNTER64",
          "id": 9,
          "isBaselining": true,
          "isDeleted": true,
          "isEnabled": true,
          "lastInvalidationTime": 10,
          "lastSeen": 2,
          "maxValue": 1,
          "name": "string",
          "objectId": 6,
          "pluginId": 2,
          "pluginIndicatorTypeId": 4,
          "syntheticExpression": "string",
          "systemIsBaselining": true,
          "systemIsEnabled": false,
          "systemMaxValue": 10
        }
      ],
      "isDeleted": true,
      "isEnabled": false,
      "isVisible": true,
      "name": "string",
      "pluginId": 9,
      "pluginObjectTypeId": 10,
      "subtypeId": 3
    },
    {
      "alternateName": "string",
      "dateAdded": 2,
      "description": "string",
      "deviceId": 1,
      "enabled": "DISABLED",
      "extendedInfo": {},
      "id": 4,
      "indicators": [
        {
          "dataUnits": "string",
          "description": "string",
          "deviceId": 8,
          "displayUnits": "string",
          "evaluationOrder": 2,
          "extendedInfo": {},
          "firstSeen": 7,
          "format": "COUNTER64",
          "id": 7,
          "isBaselining": false,
          "isDeleted": true,
          "isEnabled": false,
          "lastInvalidationTime": 3,
          "lastSeen": 8,
          "maxValue": 4,
          "name": "string",
          "objectId": 9,
          "pluginId": 2,
          "pluginIndicatorTypeId": 3,
          "syntheticExpression": "string",
          "systemIsBaselining": false,
          "systemIsEnabled": true,
          "systemMaxValue": 10
        },
        {
          "dataUnits": "string",
          "description": "string",
          "deviceId": 1,
          "displayUnits": "string",
          "evaluationOrder": 5,
          "extendedInfo": {},
          "firstSeen": 4,
          "format": "COUNTER64",
          "id": 1,
          "isBaselining": false,
          "isDeleted": true,
          "isEnabled": false,
          "lastInvalidationTime": 9,
          "lastSeen": 1,
          "maxValue": 5,
          "name": "string",
          "objectId": 4,
          "pluginId": 4,
          "pluginIndicatorTypeId": 2,
          "syntheticExpression": "string",
          "systemIsBaselining": true,
          "systemIsEnabled": false,
          "systemMaxValue": 7
        },
        {
          "dataUnits": "string",
          "description": "string",
          "deviceId": 2,
          "displayUnits": "string",
          "evaluationOrder": 9,
          "extendedInfo": {},
          "firstSeen": 6,
          "format": "COUNTER64",
          "id": 2,
          "isBaselining": false,
          "isDeleted": true,
          "isEnabled": false,
          "lastInvalidationTime": 9,
          "lastSeen": 1,
          "maxValue": 3,
          "name": "string",
          "objectId": 5,
          "pluginId": 2,
          "pluginIndicatorTypeId": 5,
          "syntheticExpression": "string",
          "systemIsBaselining": false,
          "systemIsEnabled": false,
          "systemMaxValue": 1
        },
        {
          "dataUnits": "string",
          "description": "string",
          "deviceId": 8,
          "displayUnits": "string",
          "evaluationOrder": 1,
          "extendedInfo": {},
          "firstSeen": 10,
          "format": "GAUGE",
          "id": 1,
          "isBaselining": false,
          "isDeleted": true,
          "isEnabled": false,
          "lastInvalidationTime": 5,
          "lastSeen": 6,
          "maxValue": 1,
          "name": "string",
          "objectId": 9,
          "pluginId": 10,
          "pluginIndicatorTypeId": 7,
          "syntheticExpression": "string",
          "systemIsBaselining": true,
          "systemIsEnabled": true,
          "systemMaxValue": 7
        },
        {
          "dataUnits": "string",
          "description": "string",
          "deviceId": 10,
          "displayUnits": "string",
          "evaluationOrder": 7,
          "extendedInfo": {},
          "firstSeen": 1,
          "format": "COUNTER64",
          "id": 6,
          "isBaselining": true,
          "isDeleted": false,
          "isEnabled": false,
          "lastInvalidationTime": 7,
          "lastSeen": 3,
          "maxValue": 6,
          "name": "string",
          "objectId": 3,
          "pluginId": 1,
          "pluginIndicatorTypeId": 7,
          "syntheticExpression": "string",
          "systemIsBaselining": true,
          "systemIsEnabled": true,
          "systemMaxValue": 3
        }
      ],
      "isDeleted": true,
      "isEnabled": true,
      "isVisible": true,
      "name": "string",
      "pluginId": 3,
      "pluginObjectTypeId": 4,
      "subtypeId": 7
    },
    {
      "alternateName": "string",
      "dateAdded": 8,
      "description": "string",
      "deviceId": 8,
      "enabled": "ENABLED",
      "extendedInfo": {},
      "id": 6,
      "indicators": [
        {
          "dataUnits": "string",
          "description": "string",
          "deviceId": 8,
          "displayUnits": "string",
          "evaluationOrder": 1,
          "extendedInfo": {},
          "firstSeen": 7,
          "format": "GAUGE",
          "id": 6,
          "isBaselining": false,
          "isDeleted": false,
          "isEnabled": true,
          "lastInvalidationTime": 5,
          "lastSeen": 5,
          "maxValue": 7,
          "name": "string",
          "objectId": 6,
          "pluginId": 8,
          "pluginIndicatorTypeId": 6,
          "syntheticExpression": "string",
          "systemIsBaselining": true,
          "systemIsEnabled": false,
          "systemMaxValue": 6
        },
        {
          "dataUnits": "string",
          "description": "string",
          "deviceId": 9,
          "displayUnits": "string",
          "evaluationOrder": 3,
          "extendedInfo": {},
          "firstSeen": 10,
          "format": "COUNTER32",
          "id": 3,
          "isBaselining": true,
          "isDeleted": false,
          "isEnabled": false,
          "lastInvalidationTime": 5,
          "lastSeen": 5,
          "maxValue": 10,
          "name": "string",
          "objectId": 7,
          "pluginId": 2,
          "pluginIndicatorTypeId": 6,
          "syntheticExpression": "string",
          "systemIsBaselining": true,
          "systemIsEnabled": false,
          "systemMaxValue": 2
        },
        {
          "dataUnits": "string",
          "description": "string",
          "deviceId": 7,
          "displayUnits": "string",
          "evaluationOrder": 6,
          "extendedInfo": {},
          "firstSeen": 7,
          "format": "COUNTER64",
          "id": 4,
          "isBaselining": true,
          "isDeleted": false,
          "isEnabled": true,
          "lastInvalidationTime": 7,
          "lastSeen": 1,
          "maxValue": 10,
          "name": "string",
          "objectId": 6,
          "pluginId": 7,
          "pluginIndicatorTypeId": 5,
          "syntheticExpression": "string",
          "systemIsBaselining": true,
          "systemIsEnabled": false,
          "systemMaxValue": 3
        },
        {
          "dataUnits": "string",
          "description": "string",
          "deviceId": 1,
          "displayUnits": "string",
          "evaluationOrder": 8,
          "extendedInfo": {},
          "firstSeen": 10,
          "format": "GAUGE",
          "id": 8,
          "isBaselining": true,
          "isDeleted": true,
          "isEnabled": true,
          "lastInvalidationTime": 7,
          "lastSeen": 2,
          "maxValue": 3,
          "name": "string",
          "objectId": 3,
          "pluginId": 2,
          "pluginIndicatorTypeId": 7,
          "syntheticExpression": "string",
          "systemIsBaselining": false,
          "systemIsEnabled": true,
          "systemMaxValue": 8
        },
        {
          "dataUnits": "string",
          "description": "string",
          "deviceId": 10,
          "displayUnits": "string",
          "evaluationOrder": 9,
          "extendedInfo": {},
          "firstSeen": 10,
          "format": "COUNTER64",
          "id": 9,
          "isBaselining": true,
          "isDeleted": true,
          "isEnabled": false,
          "lastInvalidationTime": 6,
          "lastSeen": 5,
          "maxValue": 2,
          "name": "string",
          "objectId": 4,
          "pluginId": 5,
          "pluginIndicatorTypeId": 7,
          "syntheticExpression": "string",
          "systemIsBaselining": false,
          "systemIsEnabled": false,
          "systemMaxValue": 10
        },
        {
          "dataUnits": "string",
          "description": "string",
          "deviceId": 5,
          "displayUnits": "string",
          "evaluationOrder": 9,
          "extendedInfo": {},
          "firstSeen": 8,
          "format": "COUNTER64",
          "id": 5,
          "isBaselining": false,
          "isDeleted": true,
          "isEnabled": true,
          "lastInvalidationTime": 3,
          "lastSeen": 8,
          "maxValue": 3,
          "name": "string",
          "objectId": 2,
          "pluginId": 5,
          "pluginIndicatorTypeId": 7,
          "syntheticExpression": "string",
          "systemIsBaselining": true,
          "systemIsEnabled": true,
          "systemMaxValue": 2
        },
        {
          "dataUnits": "string",
          "description": "string",
          "deviceId": 4,
          "displayUnits": "string",
          "evaluationOrder": 3,
          "extendedInfo": {},
          "firstSeen": 2,
          "format": "GAUGE",
          "id": 7,
          "isBaselining": true,
          "isDeleted": false,
          "isEnabled": false,
          "lastInvalidationTime": 5,
          "lastSeen": 10,
          "maxValue": 4,
          "name": "string",
          "objectId": 6,
          "pluginId": 6,
          "pluginIndicatorTypeId": 3,
          "syntheticExpression": "string",
          "systemIsBaselining": true,
          "systemIsEnabled": false,
          "systemMaxValue": 9
        },
        {
          "dataUnits": "string",
          "description": "string",
          "deviceId": 2,
          "displayUnits": "string",
          "evaluationOrder": 7,
          "extendedInfo": {},
          "firstSeen": 3,
          "format": "GAUGE",
          "id": 10,
          "isBaselining": true,
          "isDeleted": true,
          "isEnabled": false,
          "lastInvalidationTime": 5,
          "lastSeen": 9,
          "maxValue": 4,
          "name": "string",
          "objectId": 6,
          "pluginId": 5,
          "pluginIndicatorTypeId": 2,
          "syntheticExpression": "string",
          "systemIsBaselining": true,
          "systemIsEnabled": true,
          "systemMaxValue": 4
        },
        {
          "dataUnits": "string",
          "description": "string",
          "deviceId": 6,
          "displayUnits": "string",
          "evaluationOrder": 9,
          "extendedInfo": {},
          "firstSeen": 4,
          "format": "COUNTER32",
          "id": 5,
          "isBaselining": true,
          "isDeleted": false,
          "isEnabled": false,
          "lastInvalidationTime": 4,
          "lastSeen": 6,
          "maxValue": 9,
          "name": "string",
          "objectId": 4,
          "pluginId": 4,
          "pluginIndicatorTypeId": 8,
          "syntheticExpression": "string",
          "systemIsBaselining": true,
          "systemIsEnabled": false,
          "systemMaxValue": 5
        },
        {
          "dataUnits": "string",
          "description": "string",
          "deviceId": 2,
          "displayUnits": "string",
          "evaluationOrder": 1,
          "extendedInfo": {},
          "firstSeen": 10,
          "format": "GAUGE",
          "id": 5,
          "isBaselining": false,
          "isDeleted": true,
          "isEnabled": true,
          "lastInvalidationTime": 4,
          "lastSeen": 1,
          "maxValue": 6,
          "name": "string",
          "objectId": 5,
          "pluginId": 9,
          "pluginIndicatorTypeId": 4,
          "syntheticExpression": "string",
          "systemIsBaselining": false,
          "systemIsEnabled": true,
          "systemMaxValue": 9
        }
      ],
      "isDeleted": true,
      "isEnabled": false,
      "isVisible": false,
      "name": "string",
      "pluginId": 7,
      "pluginObjectTypeId": 9,
      "subtypeId": 1
    }
  ],
  "name": "string",
  "parentId": 3,
  "readOnly": true
}