{
  "alertFlowFalcon": {
    "alertId": 1,
    "directionId": 2,
    "filterId": 7,
    "id": 1,
    "interfaceId": 9,
    "netflowDeviceId": 10,
    "viewId": 2
  },
  "clearTime": 6,
  "deviceId": 1,
  "endTime": 4,
  "id": 6,
  "ignoreComment": "string",
  "ignoreUid": 9,
  "ignoreUntil": 3,
  "message": "string",
  "number": 9,
  "objectId": 1,
  "origin": "flow",
  "pluginName": "string",
  "pollId": 8,
  "severity": 6,
  "startTime": 1,
  "thresholdId": 2
}