{
  "deviceGroups": [
    6,
    6,
    7,
    2,
    9
  ],
  "sourceTypes": [
    "string",
    "string",
    "string",
    "string",
    "string",
    "string",
    "string",
    "string",
    "string",
    "string"
  ]
}