{
  "content": [
    {
      "category": "string",
      "defaultSortOrder": 6,
      "id": 1,
      "isAggregated": true,
      "isEnabled": false,
      "lastUpdate": 8,
      "name": "string"
    },
    {
      "category": "string",
      "defaultSortOrder": 7,
      "id": 7,
      "isAggregated": true,
      "isEnabled": true,
      "lastUpdate": 8,
      "name": "string"
    },
    {
      "category": "string",
      "defaultSortOrder": 7,
      "id": 7,
      "isAggregated": true,
      "isEnabled": true,
      "lastUpdate": 3,
      "name": "string"
    },
    {
      "category": "string",
      "defaultSortOrder": 10,
      "id": 9,
      "isAggregated": false,
      "isEnabled": true,
      "lastUpdate": 2,
      "name": "string"
    },
    {
      "category": "string",
      "defaultSortOrder": 9,
      "id": 2,
      "isAggregated": true,
      "isEnabled": true,
      "lastUpdate": 2,
      "name": "string"
    },
    {
      "category": "string",
      "defaultSortOrder": 6,
      "id": 8,
      "isAggregated": false,
      "isEnabled": true,
      "lastUpdate": 2,
      "name": "string"
    },
    {
      "category": "string",
      "defaultSortOrder": 2,
      "id": 10,
      "isAggregated": false,
      "isEnabled": false,
      "lastUpdate": 1,
      "name": "string"
    }
  ],
  "pageNumber": 3,
  "pageSize": 7,
  "totalElements": 9,
  "totalPages": 6
}