{
  "attributeId": 9,
  "descriptionExpression": "string",
  "deviceGroup": 9,
  "deviceType": 5,
  "groupId": 9,
  "id": 3,
  "metadataValueExpression": "string",
  "nameExpression": "string",
  "namespaceId": 6,
  "objectTypeId": 9,
  "pluginId": 7,
  "subtypeId": 4
}