{
  "name": "string",
  "resource": {
    "ids": [
      5,
      8,
      7,
      5
    ],
    "type": "Everything"
  },
  "settings": {
    "resultLimit": {
      "resultLimit": 2
    },
    "sourceFields": {
      "fields": [
        "string",
        "string"
      ],
      "sort": [
        [
          "string",
          "string",
          "string",
          "string",
          "string",
          "string",
          "string"
        ],
        [
          "string",
          "string",
          "string",
          "string",
          "string",
          "string",
          "string"
        ],
        [
          "string",
          "string",
          "string",
          "string",
          "string",
          "string",
          "string",
          "string",
          "string"
        ],
        [
          "string",
          "string"
        ],
        [
          "string",
          "string",
          "string",
          "string",
          "string",
          "string",
          "string",
          "string",
          "string",
          "string"
        ],
        [
          "string",
          "string",
          "string",
          "string",
          "string",
          "string",
          "string",
          "string"
        ],
        [
          "string",
          "string",
          "string",
          "string",
          "string",
          "string",
          "string",
          "string"
        ],
        [
          "string",
          "string"
        ]
      ]
    }
  },
  "visualization": {
    "table": {
      "column": {
        "exclude": [
          "string",
          "string",
          "string",
          "string",
          "string",
          "string",
          "string",
          "string",
          "string",
          "string"
        ],
        "include": [
          "string",
          "string"
        ]
      },
      "dataPresentation": {
        "formatNumbers": false,
        "precision": 6
      },
      "table": {
        "blockVis": true,
        "hideHeaders": false,
        "wrapCells": false
      }
    }
  }
}