{
  "content": [
    {
      "description": "string",
      "id": 2,
      "name": "string",
      "parentId": 7
    },
    {
      "description": "string",
      "id": 3,
      "name": "string",
      "parentId": 8
    },
    {
      "description": "string",
      "id": 4,
      "name": "string",
      "parentId": 1
    },
    {
      "description": "string",
      "id": 6,
      "name": "string",
      "parentId": 4
    },
    {
      "description": "string",
      "id": 3,
      "name": "string",
      "parentId": 5
    },
    {
      "description": "string",
      "id": 4,
      "name": "string",
      "parentId": 5
    }
  ],
  "pageNumber": 2,
  "pageSize": 10,
  "totalElements": 6,
  "totalPages": 1
}