{
  "content": [
    {
      "forwardCardinality": "ONE",
      "forwardRelationshipType": "COMPOSED_OF",
      "id": 5,
      "localObjectTypeId": 8,
      "remoteObjectTypeId": 5,
      "reverseCardinality": "MANY",
      "reverseRelationshipType": "PEER"
    },
    {
      "forwardCardinality": "MANY",
      "forwardRelationshipType": "UNDERLYING",
      "id": 6,
      "localObjectTypeId": 4,
      "remoteObjectTypeId": 8,
      "reverseCardinality": "ONE",
      "reverseRelationshipType": "LAYERED_OVER"
    }
  ],
  "pageNumber": 9,
  "pageSize": 4,
  "totalElements": 9,
  "totalPages": 5
}