{
  "content": [
    {
      "allowMaximumValue": true,
      "dataUnits": "string",
      "description": "string",
      "displayUnits": "string",
      "extendedInfo": {},
      "format": "COUNTER32",
      "id": 10,
      "isDefault": true,
      "isEnabled": false,
      "name": "string",
      "pluginId": 1,
      "pluginObjectTypeId": 4,
      "syntheticExpression": "string",
      "syntheticMaximumExpression": "string"
    }
  ],
  "pageNumber": 4,
  "pageSize": 3,
  "totalElements": 3,
  "totalPages": 9
}