{
  "name": "string",
  "resource": {
    "ids": [
      3,
      8
    ],
    "indicatorTypes": [
      {
        "aggregations": [
          "minPer",
          "minPer",
          "max",
          "minPer",
          "avgPer"
        ],
        "ids": [
          2,
          10,
          6,
          3,
          10
        ],
        "objectTypeId": 2,
        "pluginId": 2
      },
      {
        "aggregations": [
          "max",
          "maxPer",
          "avgPer",
          "min",
          "avgPer",
          "max",
          "min",
          "minPer"
        ],
        "ids": [
          9,
          6,
          9,
          9,
          10,
          8
        ],
        "objectTypeId": 4,
        "pluginId": 4
      },
      {
        "aggregations": [
          "maxPer",
          "maxPer",
          "min",
          "maxPer",
          "max",
          "maxPer",
          "avg",
          "min",
          "min"
        ],
        "ids": [
          10,
          2
        ],
        "objectTypeId": 2,
        "pluginId": 6
      },
      {
        "aggregations": [
          "minPer",
          "max",
          "minPer",
          "max",
          "maxPer",
          "avg",
          "avg",
          "max",
          "max"
        ],
        "ids": [
          7,
          10,
          4,
          5,
          2,
          2,
          2
        ],
        "objectTypeId": 3,
        "pluginId": 7
      }
    ],
    "type": "DeviceGroup"
  },
  "settings": {
    "childrenReport": false,
    "preferredUnits": "bits",
    "sourceFields": {
      "fields": [
        "string",
        "string",
        "string",
        "string",
        "string",
        "string"
      ],
      "sort": [
        [
          "string",
          "string",
          "string",
          "string",
          "string",
          "string",
          "string",
          "string",
          "string"
        ],
        [
          "string",
          "string",
          "string",
          "string",
          "string"
        ],
        [
          "string",
          "string",
          "string",
          "string"
        ]
      ]
    }
  },
  "time": {
    "ranges": {
      "end": "string",
      "options": {},
      "start": "string",
      "type": "RelativePeriod"
    },
    "timezone": "string"
  },
  "visualization": {
    "table": {
      "column": {
        "exclude": [
          "string",
          "string",
          "string",
          "string",
          "string"
        ],
        "include": [
          "string",
          "string",
          "string",
          "string",
          "string",
          "string",
          "string",
          "string",
          "string",
          "string"
        ]
      },
      "dataPresentation": {
        "formatNumbers": true,
        "precision": 8
      },
      "table": {
        "blockVis": true,
        "hideHeaders": true,
        "wrapCells": false
      }
    }
  }
}