{
  "filterId": 6,
  "id": 2,
  "indicator": {
    "deviceId": 9,
    "indicatorId": 2,
    "objectId": 9
  },
  "interface": {
    "direction": 2,
    "interfaceId": 9,
    "netflowDeviceId": 6
  },
  "isAllowed": true,
  "isAutomatic": true,
  "viewId": 4
}