{
  "content": [
    {
      "actions": [
        "EXCLUDE_DATA_FROM_BASELINES",
        "EXCLUDE_DATA_FROM_AGGREGATION",
        "EXCLUDE_DATA_FROM_BASELINES",
        "EXCLUDE_DATA_FROM_BASELINES",
        "EXCLUDE_DATA_FROM_AGGREGATION",
        "EXCLUDE_DATA_FROM_AGGREGATION",
        "SUPPRESS_ALERT_NOTIFICATIONS",
        "EXCLUDE_DATA_FROM_BASELINES",
        "EXCLUDE_DATA_FROM_BASELINES"
      ],
      "id": "438038f2-49b0-4b77-8460-6917decdbe7c",
      "maintenanceType": "PLANNED",
      "mappedEntities": [
        {},
        {}
      ],
      "name": "string",
      "notes": "string",
      "scheduleInstance": {
        "beginDateTime": "1761149700000",
        "createDateTime": "1761150600000",
        "endDateTime": "1761150600000",
        "isRetroactive": true
      }
    },
    {
      "actions": [
        "EXCLUDE_DATA_FROM_AGGREGATION",
        "CATEGORIZE_ALERTS"
      ],
      "id": "438038f2-49b0-4b77-8460-6917decdbe7c",
      "maintenanceType": "PLANNED",
      "mappedEntities": [
        {},
        {},
        {},
        {}
      ],
      "name": "string",
      "notes": "string",
      "scheduleInstance": {
        "beginDateTime": "1761149700000",
        "createDateTime": "1761150600000",
        "endDateTime": "1761150600000",
        "isRetroactive": false
      }
    }
  ],
  "pageNumber": 2,
  "pageSize": 6,
  "totalElements": 7,
  "totalPages": 1
}