{
  "$id": "schema.json",
  "type": "object",
  "schema": "http://json-schema.org/draft-07/schema#",
  "translate": false,
  "dynamicfields": true,
  "properties": {
    "ph_request_type": {
      "type": "string",
      "description": "type of request (internal to adapter)",
      "default": "getDeviceGroups",
      "enum": [
        "getDeviceGroups",
        "createDeviceGroup",
        "getAncestorsForDeviceGroups",
        "filterDeviceGroup",
        "getDeviceGroupById",
        "updateDeviceGroupById",
        "deleteDeviceGroupById",
        "partiallyUpdateDeviceGroupById",
        "getAncestorsForDeviceGroup",
        "addMemberByIdToGroup",
        "deleteDeviceGroupMemberById",
        "getDeviceTagsById"
      ],
      "external_name": "ph_request_type"
    }
  },
  "definitions": {}
}