{
  "name": "string",
  "resource": {
    "deviceId": 6,
    "ids": [
      8
    ],
    "type": "Object"
  },
  "settings": {
    "resultLimit": {
      "resultLimit": 2
    }
  },
  "visualization": {
    "table": {
      "column": {
        "exclude": [
          "string",
          "string",
          "string",
          "string",
          "string",
          "string",
          "string",
          "string",
          "string"
        ],
        "include": [
          "string",
          "string",
          "string",
          "string"
        ]
      },
      "dataPresentation": {
        "formatNumbers": false,
        "precision": 10
      },
      "table": {
        "blockVis": true,
        "hideHeaders": false,
        "wrapCells": false
      }
    }
  }
}