[
  {
    "assignedName": "string",
    "deviceId": 3,
    "deviceName": "string",
    "endTime": 2,
    "id": 10,
    "message": "string",
    "occurrences": 10,
    "severity": 3,
    "startTime": 1
  },
  {
    "assignedName": "string",
    "deviceId": 5,
    "deviceName": "string",
    "endTime": 4,
    "id": 5,
    "message": "string",
    "occurrences": 9,
    "severity": 10,
    "startTime": 10
  },
  {
    "assignedName": "string",
    "deviceId": 5,
    "deviceName": "string",
    "endTime": 3,
    "id": 4,
    "message": "string",
    "occurrences": 5,
    "severity": 4,
    "startTime": 7
  },
  {
    "assignedName": "string",
    "deviceId": 4,
    "deviceName": "string",
    "endTime": 5,
    "id": 8,
    "message": "string",
    "occurrences": 7,
    "severity": 8,
    "startTime": 9
  }
]