[
  {
    "id": 5,
    "name": "string",
    "reportOnly": true
  },
  {
    "id": 7,
    "name": "string",
    "reportOnly": true
  },
  {
    "id": 7,
    "name": "string",
    "reportOnly": true
  },
  {
    "id": 4,
    "name": "string",
    "reportOnly": true
  }
]