{
  "name": "string",
  "resource": {
    "deviceId": 7,
    "ids": [
      9,
      2
    ],
    "type": "ObjectGroup"
  },
  "visualization": {
    "table": {
      "column": {
        "exclude": [
          "string",
          "string"
        ],
        "include": [
          "string",
          "string",
          "string",
          "string",
          "string",
          "string"
        ]
      },
      "dataPresentation": {
        "formatNumbers": true,
        "precision": 4
      },
      "table": {
        "blockVis": true,
        "hideHeaders": true,
        "wrapCells": true
      }
    }
  }
}