{
  "alternateName": "string",
  "dateAdded": 7,
  "description": "string",
  "deviceId": 1,
  "enabled": "AUTO",
  "extendedInfo": {},
  "id": 4,
  "indicators": [
    {
      "dataUnits": "string",
      "description": "string",
      "deviceId": 1,
      "displayUnits": "string",
      "evaluationOrder": 1,
      "extendedInfo": {},
      "firstSeen": 2,
      "format": "GAUGE",
      "id": 9,
      "isBaselining": true,
      "isDeleted": false,
      "isEnabled": false,
      "lastInvalidationTime": 2,
      "lastSeen": 6,
      "maxValue": 2,
      "name": "string",
      "objectId": 9,
      "pluginId": 3,
      "pluginIndicatorTypeId": 1,
      "syntheticExpression": "string",
      "systemIsBaselining": true,
      "systemIsEnabled": false,
      "systemMaxValue": 6
    },
    {
      "dataUnits": "string",
      "description": "string",
      "deviceId": 3,
      "displayUnits": "string",
      "evaluationOrder": 10,
      "extendedInfo": {},
      "firstSeen": 3,
      "format": "COUNTER64",
      "id": 10,
      "isBaselining": false,
      "isDeleted": true,
      "isEnabled": false,
      "lastInvalidationTime": 2,
      "lastSeen": 2,
      "maxValue": 7,
      "name": "string",
      "objectId": 10,
      "pluginId": 3,
      "pluginIndicatorTypeId": 9,
      "syntheticExpression": "string",
      "systemIsBaselining": false,
      "systemIsEnabled": false,
      "systemMaxValue": 4
    },
    {
      "dataUnits": "string",
      "description": "string",
      "deviceId": 8,
      "displayUnits": "string",
      "evaluationOrder": 4,
      "extendedInfo": {},
      "firstSeen": 5,
      "format": "COUNTER32",
      "id": 9,
      "isBaselining": false,
      "isDeleted": false,
      "isEnabled": false,
      "lastInvalidationTime": 7,
      "lastSeen": 3,
      "maxValue": 6,
      "name": "string",
      "objectId": 3,
      "pluginId": 10,
      "pluginIndicatorTypeId": 1,
      "syntheticExpression": "string",
      "systemIsBaselining": false,
      "systemIsEnabled": true,
      "systemMaxValue": 7
    },
    {
      "dataUnits": "string",
      "description": "string",
      "deviceId": 4,
      "displayUnits": "string",
      "evaluationOrder": 2,
      "extendedInfo": {},
      "firstSeen": 6,
      "format": "COUNTER32",
      "id": 2,
      "isBaselining": false,
      "isDeleted": true,
      "isEnabled": false,
      "lastInvalidationTime": 8,
      "lastSeen": 1,
      "maxValue": 1,
      "name": "string",
      "objectId": 8,
      "pluginId": 5,
      "pluginIndicatorTypeId": 2,
      "syntheticExpression": "string",
      "systemIsBaselining": false,
      "systemIsEnabled": true,
      "systemMaxValue": 8
    },
    {
      "dataUnits": "string",
      "description": "string",
      "deviceId": 7,
      "displayUnits": "string",
      "evaluationOrder": 4,
      "extendedInfo": {},
      "firstSeen": 9,
      "format": "COUNTER32",
      "id": 4,
      "isBaselining": true,
      "isDeleted": false,
      "isEnabled": false,
      "lastInvalidationTime": 2,
      "lastSeen": 9,
      "maxValue": 7,
      "name": "string",
      "objectId": 9,
      "pluginId": 3,
      "pluginIndicatorTypeId": 7,
      "syntheticExpression": "string",
      "systemIsBaselining": true,
      "systemIsEnabled": false,
      "systemMaxValue": 3
    }
  ],
  "isDeleted": true,
  "isEnabled": false,
  "isVisible": true,
  "name": "string",
  "pluginId": 7,
  "pluginObjectTypeId": 9,
  "subtypeId": 1
}