{
  "bar": {
    "drawGraphOutline": true,
    "prettyXAxis": false,
    "prettyYAxis": true,
    "scaleToMinimumValue": false,
    "scaled": true,
    "showAggregation": false,
    "showAverage": true,
    "showFrequency": true,
    "showLast": false,
    "showLegend": false,
    "showPeak": true,
    "showTimespan": false,
    "showTitle": true,
    "showValley": true
  },
  "pie": {
    "showAggregation": false,
    "showAverage": true,
    "showFrequency": true,
    "showLast": false,
    "showLegend": false,
    "showPeak": false,
    "showTimespan": true,
    "showTitle": true,
    "showValley": false
  },
  "table": {
    "column": {
      "exclude": [
        "string"
      ],
      "include": [
        "string",
        "string",
        "string",
        "string",
        "string",
        "string",
        "string"
      ]
    },
    "dataPresentation": {
      "formatNumbers": true,
      "precision": 9
    },
    "table": {
      "blockVis": true,
      "hideHeaders": false,
      "wrapCells": true
    }
  }
}