{
  "description": "string",
  "destinationIp": "string",
  "destinationPort": 7,
  "destinationPortMax": 2,
  "id": 5,
  "ip": "string",
  "name": "string",
  "port": 3,
  "portMax": 5,
  "protocol": 4
}