{
  "allowed": true,
  "description": "string",
  "id": 1,
  "interface": 6,
  "name": "string",
  "nameResolved": "string",
  "netflowDeviceId": 1,
  "originIp": "string",
  "overrideDescription": 2,
  "overrideName": 10,
  "overrideSpeed": 2,
  "peer": 10,
  "reason": "exceeded_capacity",
  "speed": 5,
  "systemDescription": "string",
  "systemName": "string",
  "systemSpeed": 1,
  "visible": 5
}