{
  "content": [
    {
      "allowDelete": false,
      "alternateName": "string",
      "dateAdded": 2,
      "description": "string",
      "disableConcurrentPolling": true,
      "disablePolling": true,
      "disableThresholding": false,
      "id": 8,
      "ipAddress": "string",
      "isDeleted": true,
      "isNew": false,
      "lastDiscovery": 3,
      "manualIP": true,
      "name": "string",
      "numElements": 9,
      "objects": [
        {
          "alternateName": "string",
          "dateAdded": 4,
          "description": "string",
          "deviceId": 4,
          "enabled": {},
          "extendedInfo": {},
          "id": 7,
          "indicators": [
            {},
            {},
            {}
          ],
          "isDeleted": true,
          "isEnabled": true,
          "isVisible": false,
          "name": "string",
          "pluginId": 6,
          "pluginObjectTypeId": 4,
          "subtypeId": 8
        },
        {
          "alternateName": "string",
          "dateAdded": 3,
          "description": "string",
          "deviceId": 10,
          "enabled": {},
          "extendedInfo": {},
          "id": 9,
          "indicators": [
            {},
            {}
          ],
          "isDeleted": true,
          "isEnabled": false,
          "isVisible": true,
          "name": "string",
          "pluginId": 9,
          "pluginObjectTypeId": 4,
          "subtypeId": 6
        },
        {
          "alternateName": "string",
          "dateAdded": 7,
          "description": "string",
          "deviceId": 8,
          "enabled": {},
          "extendedInfo": {},
          "id": 6,
          "indicators": [
            {},
            {},
            {},
            {},
            {},
            {},
            {}
          ],
          "isDeleted": false,
          "isEnabled": true,
          "isVisible": false,
          "name": "string",
          "pluginId": 7,
          "pluginObjectTypeId": 2,
          "subtypeId": 1
        },
        {
          "alternateName": "string",
          "dateAdded": 1,
          "description": "string",
          "deviceId": 8,
          "enabled": {},
          "extendedInfo": {},
          "id": 1,
          "indicators": [
            {},
            {},
            {},
            {},
            {},
            {}
          ],
          "isDeleted": false,
          "isEnabled": true,
          "isVisible": false,
          "name": "string",
          "pluginId": 2,
          "pluginObjectTypeId": 9,
          "subtypeId": 1
        },
        {
          "alternateName": "string",
          "dateAdded": 7,
          "description": "string",
          "deviceId": 1,
          "enabled": {},
          "extendedInfo": {},
          "id": 4,
          "indicators": [
            {},
            {},
            {},
            {},
            {},
            {},
            {},
            {}
          ],
          "isDeleted": false,
          "isEnabled": false,
          "isVisible": false,
          "name": "string",
          "pluginId": 4,
          "pluginObjectTypeId": 8,
          "subtypeId": 4
        },
        {
          "alternateName": "string",
          "dateAdded": 2,
          "description": "string",
          "deviceId": 2,
          "enabled": {},
          "extendedInfo": {},
          "id": 8,
          "indicators": [
            {},
            {},
            {},
            {},
            {},
            {},
            {},
            {},
            {},
            {}
          ],
          "isDeleted": false,
          "isEnabled": true,
          "isVisible": true,
          "name": "string",
          "pluginId": 4,
          "pluginObjectTypeId": 2,
          "subtypeId": 2
        },
        {
          "alternateName": "string",
          "dateAdded": 10,
          "description": "string",
          "deviceId": 4,
          "enabled": {},
          "extendedInfo": {},
          "id": 1,
          "indicators": [
            {},
            {},
            {},
            {},
            {},
            {},
            {},
            {},
            {},
            {}
          ],
          "isDeleted": true,
          "isEnabled": true,
          "isVisible": true,
          "name": "string",
          "pluginId": 7,
          "pluginObjectTypeId": 5,
          "subtypeId": 8
        },
        {
          "alternateName": "string",
          "dateAdded": 2,
          "description": "string",
          "deviceId": 1,
          "enabled": {},
          "extendedInfo": {},
          "id": 4,
          "indicators": [
            {},
            {},
            {},
            {}
          ],
          "isDeleted": true,
          "isEnabled": false,
          "isVisible": false,
          "name": "string",
          "pluginId": 7,
          "pluginObjectTypeId": 10,
          "subtypeId": 1
        },
        {
          "alternateName": "string",
          "dateAdded": 10,
          "description": "string",
          "deviceId": 4,
          "enabled": {},
          "extendedInfo": {},
          "id": 9,
          "indicators": [
            {},
            {},
            {},
            {},
            {},
            {},
            {},
            {},
            {}
          ],
          "isDeleted": false,
          "isEnabled": true,
          "isVisible": false,
          "name": "string",
          "pluginId": 9,
          "pluginObjectTypeId": 4,
          "subtypeId": 9
        }
      ],
      "peerId": 7,
      "pluginInfo": {},
      "pluginManagerId": 5,
      "pollFrequency": 4,
      "timezone": "string",
      "workhoursGroupId": 9
    },
    {
      "allowDelete": false,
      "alternateName": "string",
      "dateAdded": 10,
      "description": "string",
      "disableConcurrentPolling": true,
      "disablePolling": false,
      "disableThresholding": false,
      "id": 3,
      "ipAddress": "string",
      "isDeleted": false,
      "isNew": false,
      "lastDiscovery": 3,
      "manualIP": true,
      "name": "string",
      "numElements": 6,
      "objects": [
        {
          "alternateName": "string",
          "dateAdded": 2,
          "description": "string",
          "deviceId": 6,
          "enabled": {},
          "extendedInfo": {},
          "id": 7,
          "indicators": [
            {},
            {},
            {},
            {},
            {},
            {},
            {},
            {},
            {},
            {}
          ],
          "isDeleted": false,
          "isEnabled": true,
          "isVisible": true,
          "name": "string",
          "pluginId": 6,
          "pluginObjectTypeId": 6,
          "subtypeId": 1
        },
        {
          "alternateName": "string",
          "dateAdded": 6,
          "description": "string",
          "deviceId": 2,
          "enabled": {},
          "extendedInfo": {},
          "id": 5,
          "indicators": [
            {}
          ],
          "isDeleted": false,
          "isEnabled": false,
          "isVisible": false,
          "name": "string",
          "pluginId": 4,
          "pluginObjectTypeId": 9,
          "subtypeId": 5
        },
        {
          "alternateName": "string",
          "dateAdded": 2,
          "description": "string",
          "deviceId": 9,
          "enabled": {},
          "extendedInfo": {},
          "id": 10,
          "indicators": [
            {},
            {},
            {},
            {},
            {}
          ],
          "isDeleted": true,
          "isEnabled": true,
          "isVisible": true,
          "name": "string",
          "pluginId": 3,
          "pluginObjectTypeId": 7,
          "subtypeId": 3
        }
      ],
      "peerId": 1,
      "pluginInfo": {},
      "pluginManagerId": 1,
      "pollFrequency": 9,
      "timezone": "string",
      "workhoursGroupId": 2
    },
    {
      "allowDelete": false,
      "alternateName": "string",
      "dateAdded": 1,
      "description": "string",
      "disableConcurrentPolling": false,
      "disablePolling": true,
      "disableThresholding": true,
      "id": 7,
      "ipAddress": "string",
      "isDeleted": true,
      "isNew": true,
      "lastDiscovery": 8,
      "manualIP": true,
      "name": "string",
      "numElements": 10,
      "objects": [
        {
          "alternateName": "string",
          "dateAdded": 10,
          "description": "string",
          "deviceId": 9,
          "enabled": {},
          "extendedInfo": {},
          "id": 9,
          "indicators": [
            {},
            {},
            {}
          ],
          "isDeleted": true,
          "isEnabled": true,
          "isVisible": true,
          "name": "string",
          "pluginId": 3,
          "pluginObjectTypeId": 5,
          "subtypeId": 1
        }
      ],
      "peerId": 10,
      "pluginInfo": {},
      "pluginManagerId": 9,
      "pollFrequency": 5,
      "timezone": "string",
      "workhoursGroupId": 9
    },
    {
      "allowDelete": true,
      "alternateName": "string",
      "dateAdded": 1,
      "description": "string",
      "disableConcurrentPolling": true,
      "disablePolling": true,
      "disableThresholding": true,
      "id": 3,
      "ipAddress": "string",
      "isDeleted": true,
      "isNew": true,
      "lastDiscovery": 2,
      "manualIP": false,
      "name": "string",
      "numElements": 8,
      "objects": [
        {
          "alternateName": "string",
          "dateAdded": 3,
          "description": "string",
          "deviceId": 7,
          "enabled": {},
          "extendedInfo": {},
          "id": 5,
          "indicators": [
            {},
            {},
            {},
            {},
            {},
            {},
            {},
            {},
            {}
          ],
          "isDeleted": true,
          "isEnabled": false,
          "isVisible": false,
          "name": "string",
          "pluginId": 2,
          "pluginObjectTypeId": 5,
          "subtypeId": 10
        },
        {
          "alternateName": "string",
          "dateAdded": 9,
          "description": "string",
          "deviceId": 2,
          "enabled": {},
          "extendedInfo": {},
          "id": 10,
          "indicators": [
            {},
            {},
            {},
            {},
            {},
            {},
            {}
          ],
          "isDeleted": true,
          "isEnabled": true,
          "isVisible": true,
          "name": "string",
          "pluginId": 6,
          "pluginObjectTypeId": 8,
          "subtypeId": 6
        },
        {
          "alternateName": "string",
          "dateAdded": 2,
          "description": "string",
          "deviceId": 2,
          "enabled": {},
          "extendedInfo": {},
          "id": 9,
          "indicators": [
            {},
            {},
            {},
            {},
            {},
            {}
          ],
          "isDeleted": true,
          "isEnabled": false,
          "isVisible": true,
          "name": "string",
          "pluginId": 3,
          "pluginObjectTypeId": 1,
          "subtypeId": 8
        },
        {
          "alternateName": "string",
          "dateAdded": 7,
          "description": "string",
          "deviceId": 9,
          "enabled": {},
          "extendedInfo": {},
          "id": 4,
          "indicators": [
            {},
            {},
            {},
            {},
            {},
            {},
            {},
            {},
            {},
            {}
          ],
          "isDeleted": false,
          "isEnabled": false,
          "isVisible": true,
          "name": "string",
          "pluginId": 10,
          "pluginObjectTypeId": 7,
          "subtypeId": 9
        },
        {
          "alternateName": "string",
          "dateAdded": 9,
          "description": "string",
          "deviceId": 10,
          "enabled": {},
          "extendedInfo": {},
          "id": 9,
          "indicators": [
            {},
            {},
            {},
            {},
            {},
            {},
            {}
          ],
          "isDeleted": true,
          "isEnabled": false,
          "isVisible": true,
          "name": "string",
          "pluginId": 3,
          "pluginObjectTypeId": 7,
          "subtypeId": 1
        },
        {
          "alternateName": "string",
          "dateAdded": 9,
          "description": "string",
          "deviceId": 5,
          "enabled": {},
          "extendedInfo": {},
          "id": 7,
          "indicators": [
            {},
            {},
            {}
          ],
          "isDeleted": true,
          "isEnabled": true,
          "isVisible": false,
          "name": "string",
          "pluginId": 9,
          "pluginObjectTypeId": 10,
          "subtypeId": 8
        },
        {
          "alternateName": "string",
          "dateAdded": 3,
          "description": "string",
          "deviceId": 1,
          "enabled": {},
          "extendedInfo": {},
          "id": 6,
          "indicators": [
            {},
            {},
            {},
            {},
            {},
            {},
            {}
          ],
          "isDeleted": true,
          "isEnabled": true,
          "isVisible": true,
          "name": "string",
          "pluginId": 7,
          "pluginObjectTypeId": 2,
          "subtypeId": 8
        }
      ],
      "peerId": 8,
      "pluginInfo": {},
      "pluginManagerId": 10,
      "pollFrequency": 9,
      "timezone": "string",
      "workhoursGroupId": 3
    },
    {
      "allowDelete": false,
      "alternateName": "string",
      "dateAdded": 10,
      "description": "string",
      "disableConcurrentPolling": true,
      "disablePolling": true,
      "disableThresholding": false,
      "id": 8,
      "ipAddress": "string",
      "isDeleted": true,
      "isNew": false,
      "lastDiscovery": 9,
      "manualIP": false,
      "name": "string",
      "numElements": 2,
      "objects": [
        {
          "alternateName": "string",
          "dateAdded": 5,
          "description": "string",
          "deviceId": 10,
          "enabled": {},
          "extendedInfo": {},
          "id": 9,
          "indicators": [
            {},
            {},
            {}
          ],
          "isDeleted": false,
          "isEnabled": true,
          "isVisible": true,
          "name": "string",
          "pluginId": 6,
          "pluginObjectTypeId": 10,
          "subtypeId": 2
        },
        {
          "alternateName": "string",
          "dateAdded": 2,
          "description": "string",
          "deviceId": 3,
          "enabled": {},
          "extendedInfo": {},
          "id": 1,
          "indicators": [
            {},
            {},
            {},
            {},
            {},
            {},
            {}
          ],
          "isDeleted": true,
          "isEnabled": false,
          "isVisible": false,
          "name": "string",
          "pluginId": 8,
          "pluginObjectTypeId": 5,
          "subtypeId": 7
        },
        {
          "alternateName": "string",
          "dateAdded": 5,
          "description": "string",
          "deviceId": 5,
          "enabled": {},
          "extendedInfo": {},
          "id": 6,
          "indicators": [
            {},
            {},
            {},
            {},
            {}
          ],
          "isDeleted": true,
          "isEnabled": false,
          "isVisible": false,
          "name": "string",
          "pluginId": 5,
          "pluginObjectTypeId": 7,
          "subtypeId": 5
        },
        {
          "alternateName": "string",
          "dateAdded": 4,
          "description": "string",
          "deviceId": 7,
          "enabled": {},
          "extendedInfo": {},
          "id": 4,
          "indicators": [
            {},
            {},
            {},
            {},
            {},
            {},
            {}
          ],
          "isDeleted": false,
          "isEnabled": false,
          "isVisible": false,
          "name": "string",
          "pluginId": 8,
          "pluginObjectTypeId": 3,
          "subtypeId": 5
        },
        {
          "alternateName": "string",
          "dateAdded": 8,
          "description": "string",
          "deviceId": 7,
          "enabled": {},
          "extendedInfo": {},
          "id": 2,
          "indicators": [
            {},
            {},
            {},
            {}
          ],
          "isDeleted": false,
          "isEnabled": false,
          "isVisible": false,
          "name": "string",
          "pluginId": 1,
          "pluginObjectTypeId": 10,
          "subtypeId": 9
        },
        {
          "alternateName": "string",
          "dateAdded": 5,
          "description": "string",
          "deviceId": 5,
          "enabled": {},
          "extendedInfo": {},
          "id": 5,
          "indicators": [
            {},
            {},
            {},
            {},
            {},
            {},
            {},
            {}
          ],
          "isDeleted": true,
          "isEnabled": true,
          "isVisible": false,
          "name": "string",
          "pluginId": 6,
          "pluginObjectTypeId": 7,
          "subtypeId": 4
        },
        {
          "alternateName": "string",
          "dateAdded": 9,
          "description": "string",
          "deviceId": 3,
          "enabled": {},
          "extendedInfo": {},
          "id": 8,
          "indicators": [
            {},
            {},
            {},
            {}
          ],
          "isDeleted": false,
          "isEnabled": true,
          "isVisible": false,
          "name": "string",
          "pluginId": 4,
          "pluginObjectTypeId": 7,
          "subtypeId": 4
        },
        {
          "alternateName": "string",
          "dateAdded": 5,
          "description": "string",
          "deviceId": 1,
          "enabled": {},
          "extendedInfo": {},
          "id": 4,
          "indicators": [
            {}
          ],
          "isDeleted": true,
          "isEnabled": true,
          "isVisible": false,
          "name": "string",
          "pluginId": 4,
          "pluginObjectTypeId": 4,
          "subtypeId": 6
        },
        {
          "alternateName": "string",
          "dateAdded": 5,
          "description": "string",
          "deviceId": 7,
          "enabled": {},
          "extendedInfo": {},
          "id": 7,
          "indicators": [
            {},
            {},
            {}
          ],
          "isDeleted": false,
          "isEnabled": false,
          "isVisible": false,
          "name": "string",
          "pluginId": 1,
          "pluginObjectTypeId": 4,
          "subtypeId": 10
        }
      ],
      "peerId": 1,
      "pluginInfo": {},
      "pluginManagerId": 9,
      "pollFrequency": 5,
      "timezone": "string",
      "workhoursGroupId": 7
    },
    {
      "allowDelete": false,
      "alternateName": "string",
      "dateAdded": 9,
      "description": "string",
      "disableConcurrentPolling": false,
      "disablePolling": false,
      "disableThresholding": true,
      "id": 4,
      "ipAddress": "string",
      "isDeleted": false,
      "isNew": true,
      "lastDiscovery": 9,
      "manualIP": true,
      "name": "string",
      "numElements": 6,
      "objects": [
        {
          "alternateName": "string",
          "dateAdded": 10,
          "description": "string",
          "deviceId": 9,
          "enabled": {},
          "extendedInfo": {},
          "id": 10,
          "indicators": [
            {},
            {},
            {},
            {}
          ],
          "isDeleted": true,
          "isEnabled": true,
          "isVisible": false,
          "name": "string",
          "pluginId": 8,
          "pluginObjectTypeId": 8,
          "subtypeId": 3
        },
        {
          "alternateName": "string",
          "dateAdded": 5,
          "description": "string",
          "deviceId": 10,
          "enabled": {},
          "extendedInfo": {},
          "id": 6,
          "indicators": [
            {}
          ],
          "isDeleted": false,
          "isEnabled": true,
          "isVisible": true,
          "name": "string",
          "pluginId": 6,
          "pluginObjectTypeId": 2,
          "subtypeId": 1
        },
        {
          "alternateName": "string",
          "dateAdded": 1,
          "description": "string",
          "deviceId": 7,
          "enabled": {},
          "extendedInfo": {},
          "id": 7,
          "indicators": [
            {},
            {},
            {},
            {},
            {}
          ],
          "isDeleted": true,
          "isEnabled": false,
          "isVisible": true,
          "name": "string",
          "pluginId": 9,
          "pluginObjectTypeId": 8,
          "subtypeId": 7
        },
        {
          "alternateName": "string",
          "dateAdded": 6,
          "description": "string",
          "deviceId": 10,
          "enabled": {},
          "extendedInfo": {},
          "id": 3,
          "indicators": [
            {},
            {},
            {},
            {},
            {},
            {},
            {},
            {},
            {},
            {}
          ],
          "isDeleted": true,
          "isEnabled": true,
          "isVisible": false,
          "name": "string",
          "pluginId": 6,
          "pluginObjectTypeId": 3,
          "subtypeId": 2
        },
        {
          "alternateName": "string",
          "dateAdded": 7,
          "description": "string",
          "deviceId": 8,
          "enabled": {},
          "extendedInfo": {},
          "id": 1,
          "indicators": [
            {},
            {},
            {},
            {},
            {},
            {},
            {}
          ],
          "isDeleted": false,
          "isEnabled": false,
          "isVisible": false,
          "name": "string",
          "pluginId": 3,
          "pluginObjectTypeId": 8,
          "subtypeId": 4
        },
        {
          "alternateName": "string",
          "dateAdded": 10,
          "description": "string",
          "deviceId": 4,
          "enabled": {},
          "extendedInfo": {},
          "id": 10,
          "indicators": [
            {},
            {},
            {},
            {},
            {},
            {},
            {}
          ],
          "isDeleted": true,
          "isEnabled": false,
          "isVisible": false,
          "name": "string",
          "pluginId": 2,
          "pluginObjectTypeId": 3,
          "subtypeId": 10
        },
        {
          "alternateName": "string",
          "dateAdded": 7,
          "description": "string",
          "deviceId": 10,
          "enabled": {},
          "extendedInfo": {},
          "id": 1,
          "indicators": [
            {}
          ],
          "isDeleted": false,
          "isEnabled": true,
          "isVisible": false,
          "name": "string",
          "pluginId": 7,
          "pluginObjectTypeId": 8,
          "subtypeId": 8
        },
        {
          "alternateName": "string",
          "dateAdded": 10,
          "description": "string",
          "deviceId": 5,
          "enabled": {},
          "extendedInfo": {},
          "id": 2,
          "indicators": [
            {},
            {}
          ],
          "isDeleted": true,
          "isEnabled": false,
          "isVisible": true,
          "name": "string",
          "pluginId": 1,
          "pluginObjectTypeId": 10,
          "subtypeId": 10
        }
      ],
      "peerId": 3,
      "pluginInfo": {},
      "pluginManagerId": 4,
      "pollFrequency": 3,
      "timezone": "string",
      "workhoursGroupId": 10
    },
    {
      "allowDelete": true,
      "alternateName": "string",
      "dateAdded": 1,
      "description": "string",
      "disableConcurrentPolling": true,
      "disablePolling": false,
      "disableThresholding": true,
      "id": 2,
      "ipAddress": "string",
      "isDeleted": true,
      "isNew": true,
      "lastDiscovery": 1,
      "manualIP": false,
      "name": "string",
      "numElements": 10,
      "objects": [
        {
          "alternateName": "string",
          "dateAdded": 4,
          "description": "string",
          "deviceId": 8,
          "enabled": {},
          "extendedInfo": {},
          "id": 1,
          "indicators": [
            {},
            {},
            {}
          ],
          "isDeleted": true,
          "isEnabled": false,
          "isVisible": false,
          "name": "string",
          "pluginId": 7,
          "pluginObjectTypeId": 4,
          "subtypeId": 5
        },
        {
          "alternateName": "string",
          "dateAdded": 3,
          "description": "string",
          "deviceId": 7,
          "enabled": {},
          "extendedInfo": {},
          "id": 9,
          "indicators": [
            {},
            {},
            {},
            {},
            {},
            {}
          ],
          "isDeleted": false,
          "isEnabled": true,
          "isVisible": false,
          "name": "string",
          "pluginId": 4,
          "pluginObjectTypeId": 8,
          "subtypeId": 7
        }
      ],
      "peerId": 5,
      "pluginInfo": {},
      "pluginManagerId": 3,
      "pollFrequency": 9,
      "timezone": "string",
      "workhoursGroupId": 5
    }
  ],
  "pageNumber": 10,
  "pageSize": 7,
  "totalElements": 10,
  "totalPages": 2
}