[
  {
    "description": "string",
    "id": 5,
    "name": "string",
    "parentId": 8
  },
  {
    "description": "string",
    "id": 10,
    "name": "string",
    "parentId": 9
  },
  {
    "description": "string",
    "id": 6,
    "name": "string",
    "parentId": 7
  }
]