{
  "content": [
    {
      "roleEdit": false,
      "roleId": 4,
      "roleView": true,
      "targetRoleId": 2,
      "userEdit": false,
      "userView": true
    },
    {
      "roleEdit": false,
      "roleId": 10,
      "roleView": false,
      "targetRoleId": 9,
      "userEdit": true,
      "userView": false
    },
    {
      "roleEdit": false,
      "roleId": 10,
      "roleView": false,
      "targetRoleId": 9,
      "userEdit": true,
      "userView": false
    },
    {
      "roleEdit": true,
      "roleId": 5,
      "roleView": true,
      "targetRoleId": 3,
      "userEdit": false,
      "userView": false
    },
    {
      "roleEdit": true,
      "roleId": 6,
      "roleView": false,
      "targetRoleId": 8,
      "userEdit": false,
      "userView": false
    },
    {
      "roleEdit": false,
      "roleId": 9,
      "roleView": false,
      "targetRoleId": 4,
      "userEdit": true,
      "userView": false
    },
    {
      "roleEdit": true,
      "roleId": 9,
      "roleView": false,
      "targetRoleId": 1,
      "userEdit": true,
      "userView": true
    },
    {
      "roleEdit": true,
      "roleId": 2,
      "roleView": false,
      "targetRoleId": 7,
      "userEdit": false,
      "userView": false
    }
  ],
  "pageNumber": 10,
  "pageSize": 1,
  "totalElements": 9,
  "totalPages": 1
}