{
  "aggregation": "None",
  "filters": {
    "empty": false,
    "expression": "string",
    "filters": [
      {
        "id": "string",
        "name": "string",
        "operation": "string",
        "values": [
          "string",
          "string",
          "string",
          "string",
          "string",
          "string"
        ]
      },
      {
        "id": "string",
        "name": "string",
        "operation": "string",
        "values": [
          "string",
          "string",
          "string",
          "string",
          "string",
          "string",
          "string",
          "string",
          "string"
        ]
      },
      {
        "id": "string",
        "name": "string",
        "operation": "string",
        "values": [
          "string",
          "string",
          "string",
          "string",
          "string"
        ]
      },
      {
        "id": "string",
        "name": "string",
        "operation": "string",
        "values": [
          "string",
          "string",
          "string",
          "string",
          "string",
          "string",
          "string",
          "string",
          "string"
        ]
      },
      {
        "id": "string",
        "name": "string",
        "operation": "string",
        "values": [
          "string",
          "string"
        ]
      },
      {
        "id": "string",
        "name": "string",
        "operation": "string",
        "values": [
          "string"
        ]
      }
    ]
  },
  "name": "string",
  "resources": [
    {
      "ids": [
        {}
      ],
      "type": "Device"
    },
    {
      "ids": [
        {},
        {},
        {},
        {},
        {},
        {}
      ],
      "type": "Everything"
    },
    {
      "ids": [
        {},
        {},
        {}
      ],
      "type": "Object"
    },
    {
      "ids": [
        {},
        {},
        {},
        {}
      ],
      "type": "DeviceGroup"
    },
    {
      "ids": [
        {},
        {},
        {},
        {},
        {}
      ],
      "type": "Device"
    },
    {
      "ids": [
        {}
      ],
      "type": "ObjectGroup"
    },
    {
      "ids": [
        {},
        {},
        {},
        {},
        {}
      ],
      "type": "DeviceGroup"
    }
  ],
  "settings": {
    "alert": {
      "defaultView": "devices",
      "eventSummary": false,
      "inlcudeMaintenanceWindowAlerts": true
    },
    "resultLimit": {
      "resultLimit": 4
    },
    "sourceFields": {
      "fields": [
        "string",
        "string",
        "string",
        "string",
        "string",
        "string",
        "string"
      ],
      "sort": [
        [
          "string",
          "string",
          "string",
          "string",
          "string",
          "string",
          "string"
        ],
        [
          "string"
        ]
      ]
    }
  },
  "time": {
    "ranges": [
      {
        "end": "string",
        "options": {},
        "start": "string",
        "type": "SpecificInterval"
      },
      {
        "end": "string",
        "options": {},
        "start": "string",
        "type": "RelativePeriod"
      },
      {
        "end": "string",
        "options": {},
        "start": "string",
        "type": "SpecificInterval"
      },
      {
        "end": "string",
        "options": {},
        "start": "string",
        "type": "RelativePeriod"
      },
      {
        "end": "string",
        "options": {},
        "start": "string",
        "type": "CustomWeek"
      },
      {
        "end": "string",
        "options": {},
        "start": "string",
        "type": "RelativePeriod"
      },
      {
        "end": "string",
        "options": {},
        "start": "string",
        "type": "CustomWeek"
      },
      {
        "end": "string",
        "options": {},
        "start": "string",
        "type": "SpecificInterval"
      }
    ],
    "timezone": "string"
  },
  "visualization": {
    "bar": {
      "drawGraphOutline": true,
      "prettyXAxis": true,
      "prettyYAxis": false,
      "scaleToMinimumValue": false,
      "scaled": true,
      "showAggregation": true,
      "showAverage": false,
      "showFrequency": true,
      "showLast": true,
      "showLegend": false,
      "showPeak": false,
      "showTimespan": true,
      "showTitle": false,
      "showValley": false
    },
    "pie": {
      "showAggregation": false,
      "showAverage": true,
      "showFrequency": true,
      "showLast": true,
      "showLegend": false,
      "showPeak": true,
      "showTimespan": true,
      "showTitle": true,
      "showValley": false
    },
    "table": {
      "column": {
        "exclude": [
          "string",
          "string"
        ],
        "include": [
          "string",
          "string",
          "string",
          "string"
        ]
      },
      "dataPresentation": {
        "formatNumbers": false,
        "precision": 2
      },
      "table": {
        "blockVis": false,
        "hideHeaders": false,
        "wrapCells": false
      }
    }
  }
}