{
  "aggregation": 2,
  "comparison": 10,
  "duration": 2,
  "id": 2,
  "indicatorTypeId": 8,
  "isTrigger": false,
  "message": "string",
  "policyId": 6,
  "sigmaDirection": 9,
  "type": 1,
  "unit": "string",
  "value": 4
}