{
  "filters": {
    "empty": true,
    "expression": "string",
    "filters": [
      {
        "id": "string",
        "name": "string",
        "operation": "string",
        "values": [
          "string",
          "string",
          "string",
          "string",
          "string"
        ]
      },
      {
        "id": "string",
        "name": "string",
        "operation": "string",
        "values": [
          "string",
          "string",
          "string",
          "string",
          "string",
          "string",
          "string"
        ]
      },
      {
        "id": "string",
        "name": "string",
        "operation": "string",
        "values": [
          "string",
          "string",
          "string",
          "string",
          "string",
          "string",
          "string"
        ]
      }
    ]
  },
  "name": "string",
  "resource": {
    "groups": {
      "ids": [
        7,
        2,
        1,
        4,
        3,
        7
      ],
      "type": "ObjectGroup"
    },
    "interfaces": [
      {
        "direction": 3,
        "interfaceNum": 2,
        "sourceIp": "string"
      },
      {
        "direction": 9,
        "interfaceNum": 10,
        "sourceIp": "string"
      },
      {
        "direction": 5,
        "interfaceNum": 5,
        "sourceIp": "string"
      }
    ]
  },
  "settings": {
    "flowFalcon": {
      "canZoomInCb": "string",
      "granularity": 5,
      "graphOther": true,
      "isRate": true,
      "isTotal": true,
      "split": 5,
      "subnetCategoryId": 2
    },
    "flowFalconResolution": {
      "showAs": "string",
      "showDns": "string",
      "showDscp": "string",
      "showPort": "string",
      "showProtocol": "string"
    },
    "flowFalconTemplate": {
      "isAggregated": true,
      "metricId": 2,
      "viewId": 10
    },
    "resultLimit": {
      "resultLimit": 10
    },
    "sourceFields": {
      "fields": [
        "string",
        "string",
        "string",
        "string",
        "string",
        "string",
        "string",
        "string",
        "string"
      ],
      "sort": [
        [
          "string",
          "string"
        ]
      ]
    },
    "units": {
      "percentage": true,
      "preferredUnits": "bits"
    }
  },
  "time": {
    "ranges": {
      "end": "string",
      "options": {},
      "start": "string",
      "type": "RelativePeriod"
    },
    "timezone": "string"
  },
  "visualization": {
    "pie": {
      "showAggregation": true,
      "showAverage": true,
      "showFrequency": true,
      "showLast": true,
      "showLegend": false,
      "showPeak": true,
      "showTimespan": true,
      "showTitle": true,
      "showValley": true
    },
    "stackedLine": {
      "drawGraphOutline": false,
      "prettyXAxis": false,
      "prettyYAxis": true,
      "scaleToMinimumValue": false,
      "scaled": true,
      "sendGraphCSV": true,
      "showAggregation": true,
      "showAverage": true,
      "showFrequency": false,
      "showLast": true,
      "showLegend": false,
      "showPeak": true,
      "showTimespan": false,
      "showTitle": true,
      "showValley": false
    },
    "table": {
      "column": {
        "exclude": [
          "string",
          "string"
        ],
        "include": [
          "string"
        ]
      },
      "dataPresentation": {
        "formatNumbers": true,
        "precision": 4
      },
      "table": {
        "blockVis": false,
        "hideHeaders": false,
        "wrapCells": true
      }
    }
  }
}