{
  "content": [
    {
      "attributeId": 7,
      "descriptionExpression": "string",
      "groupId": 4,
      "id": 7,
      "metadataValueExpression": "string",
      "mgtIpExpression": "string",
      "nameExpression": "string",
      "namespaceId": 6,
      "sysContactExpression": "string",
      "sysDescrExpression": "string",
      "sysLocationExpression": "string",
      "sysNameExpression": "string",
      "sysObjectIdExpression": "string",
      "walkCheckOid": "string"
    },
    {
      "attributeId": 2,
      "descriptionExpression": "string",
      "groupId": 1,
      "id": 5,
      "metadataValueExpression": "string",
      "mgtIpExpression": "string",
      "nameExpression": "string",
      "namespaceId": 5,
      "sysContactExpression": "string",
      "sysDescrExpression": "string",
      "sysLocationExpression": "string",
      "sysNameExpression": "string",
      "sysObjectIdExpression": "string",
      "walkCheckOid": "string"
    },
    {
      "attributeId": 10,
      "descriptionExpression": "string",
      "groupId": 7,
      "id": 4,
      "metadataValueExpression": "string",
      "mgtIpExpression": "string",
      "nameExpression": "string",
      "namespaceId": 10,
      "sysContactExpression": "string",
      "sysDescrExpression": "string",
      "sysLocationExpression": "string",
      "sysNameExpression": "string",
      "sysObjectIdExpression": "string",
      "walkCheckOid": "string"
    },
    {
      "attributeId": 7,
      "descriptionExpression": "string",
      "groupId": 4,
      "id": 5,
      "metadataValueExpression": "string",
      "mgtIpExpression": "string",
      "nameExpression": "string",
      "namespaceId": 1,
      "sysContactExpression": "string",
      "sysDescrExpression": "string",
      "sysLocationExpression": "string",
      "sysNameExpression": "string",
      "sysObjectIdExpression": "string",
      "walkCheckOid": "string"
    },
    {
      "attributeId": 10,
      "descriptionExpression": "string",
      "groupId": 6,
      "id": 10,
      "metadataValueExpression": "string",
      "mgtIpExpression": "string",
      "nameExpression": "string",
      "namespaceId": 10,
      "sysContactExpression": "string",
      "sysDescrExpression": "string",
      "sysLocationExpression": "string",
      "sysNameExpression": "string",
      "sysObjectIdExpression": "string",
      "walkCheckOid": "string"
    },
    {
      "attributeId": 10,
      "descriptionExpression": "string",
      "groupId": 9,
      "id": 4,
      "metadataValueExpression": "string",
      "mgtIpExpression": "string",
      "nameExpression": "string",
      "namespaceId": 2,
      "sysContactExpression": "string",
      "sysDescrExpression": "string",
      "sysLocationExpression": "string",
      "sysNameExpression": "string",
      "sysObjectIdExpression": "string",
      "walkCheckOid": "string"
    },
    {
      "attributeId": 10,
      "descriptionExpression": "string",
      "groupId": 10,
      "id": 3,
      "metadataValueExpression": "string",
      "mgtIpExpression": "string",
      "nameExpression": "string",
      "namespaceId": 1,
      "sysContactExpression": "string",
      "sysDescrExpression": "string",
      "sysLocationExpression": "string",
      "sysNameExpression": "string",
      "sysObjectIdExpression": "string",
      "walkCheckOid": "string"
    }
  ],
  "pageNumber": 1,
  "pageSize": 4,
  "totalElements": 6,
  "totalPages": 3
}