{
  "filters": {
    "empty": true,
    "expression": "string",
    "filters": [
      {
        "id": "string",
        "name": "string",
        "operation": "string",
        "values": [
          "string",
          "string",
          "string",
          "string",
          "string",
          "string",
          "string",
          "string",
          "string",
          "string"
        ]
      },
      {
        "id": "string",
        "name": "string",
        "operation": "string",
        "values": [
          "string",
          "string",
          "string",
          "string",
          "string",
          "string",
          "string",
          "string",
          "string"
        ]
      },
      {
        "id": "string",
        "name": "string",
        "operation": "string",
        "values": [
          "string",
          "string",
          "string"
        ]
      },
      {
        "id": "string",
        "name": "string",
        "operation": "string",
        "values": [
          "string",
          "string"
        ]
      },
      {
        "id": "string",
        "name": "string",
        "operation": "string",
        "values": [
          "string",
          "string",
          "string"
        ]
      },
      {
        "id": "string",
        "name": "string",
        "operation": "string",
        "values": [
          "string",
          "string",
          "string",
          "string",
          "string",
          "string"
        ]
      },
      {
        "id": "string",
        "name": "string",
        "operation": "string",
        "values": [
          "string",
          "string",
          "string",
          "string",
          "string",
          "string",
          "string",
          "string",
          "string"
        ]
      }
    ]
  },
  "name": "string",
  "resource": {
    "groups": {
      "ids": [
        2,
        5,
        10,
        9,
        5,
        4,
        3,
        7,
        6
      ],
      "type": "DeviceGroup"
    },
    "interfaces": [
      {
        "direction": 1,
        "interfaceNum": 10,
        "sourceIp": "string"
      },
      {
        "direction": 4,
        "interfaceNum": 6,
        "sourceIp": "string"
      },
      {
        "direction": 8,
        "interfaceNum": 8,
        "sourceIp": "string"
      },
      {
        "direction": 8,
        "interfaceNum": 1,
        "sourceIp": "string"
      },
      {
        "direction": 5,
        "interfaceNum": 10,
        "sourceIp": "string"
      },
      {
        "direction": 10,
        "interfaceNum": 3,
        "sourceIp": "string"
      },
      {
        "direction": 1,
        "interfaceNum": 10,
        "sourceIp": "string"
      }
    ]
  },
  "settings": {
    "flowFalcon": {
      "canZoomInCb": "string",
      "granularity": 7,
      "graphOther": true,
      "isRate": false,
      "isTotal": true,
      "split": 6,
      "subnetCategoryId": 7
    },
    "flowFalconResolution": {
      "showAs": "string",
      "showDns": "string",
      "showDscp": "string",
      "showPort": "string",
      "showProtocol": "string"
    },
    "flowFalconTemplate": {
      "isAggregated": false,
      "metricId": 6,
      "viewId": 5
    },
    "resultLimit": {
      "resultLimit": 9
    },
    "sourceFields": {
      "fields": [
        "string",
        "string",
        "string",
        "string",
        "string",
        "string",
        "string"
      ],
      "sort": [
        [
          "string",
          "string",
          "string",
          "string",
          "string",
          "string",
          "string",
          "string",
          "string",
          "string"
        ]
      ]
    },
    "units": {
      "percentage": false,
      "preferredUnits": "bits"
    }
  },
  "time": {
    "ranges": {
      "end": "string",
      "options": {},
      "start": "string",
      "type": "RelativePeriod"
    },
    "timezone": "string"
  },
  "visualization": {
    "pie": {
      "showAggregation": false,
      "showAverage": true,
      "showFrequency": true,
      "showLast": true,
      "showLegend": false,
      "showPeak": false,
      "showTimespan": false,
      "showTitle": true,
      "showValley": true
    },
    "stackedLine": {
      "drawGraphOutline": false,
      "prettyXAxis": true,
      "prettyYAxis": false,
      "scaleToMinimumValue": false,
      "scaled": false,
      "sendGraphCSV": true,
      "showAggregation": true,
      "showAverage": false,
      "showFrequency": true,
      "showLast": false,
      "showLegend": true,
      "showPeak": true,
      "showTimespan": false,
      "showTitle": false,
      "showValley": false
    },
    "table": {
      "column": {
        "exclude": [
          "string",
          "string",
          "string",
          "string"
        ],
        "include": [
          "string",
          "string",
          "string",
          "string",
          "string",
          "string"
        ]
      },
      "dataPresentation": {
        "formatNumbers": true,
        "precision": 7
      },
      "table": {
        "blockVis": false,
        "hideHeaders": false,
        "wrapCells": false
      }
    }
  }
}