{
  "alert": {
    "defaultView": "objects",
    "eventSummary": true,
    "inlcudeMaintenanceWindowAlerts": false
  },
  "resultLimit": {
    "resultLimit": 10
  },
  "sourceFields": {
    "fields": [
      "string",
      "string",
      "string"
    ],
    "sort": [
      [
        "string",
        "string",
        "string",
        "string",
        "string",
        "string",
        "string"
      ],
      [
        "string",
        "string",
        "string",
        "string",
        "string",
        "string",
        "string"
      ],
      [
        "string",
        "string",
        "string",
        "string",
        "string"
      ],
      [
        "string"
      ],
      [
        "string",
        "string",
        "string"
      ],
      [
        "string",
        "string",
        "string",
        "string",
        "string",
        "string",
        "string",
        "string",
        "string"
      ],
      [
        "string",
        "string",
        "string",
        "string",
        "string",
        "string"
      ],
      [
        "string",
        "string",
        "string",
        "string",
        "string",
        "string",
        "string",
        "string",
        "string",
        "string"
      ]
    ]
  }
}