[
  {
    "aDeviceId": 8,
    "aObjectId": 10,
    "connectionId": 1,
    "isAutomatic": true,
    "isDiscovered": false,
    "relationType": "LAYERED_OVER",
    "sourceName": "NetflowInterface",
    "zDeviceId": 6
  },
  {
    "aDeviceId": 7,
    "aObjectId": 2,
    "connectionId": 5,
    "isAutomatic": false,
    "isDiscovered": true,
    "relationType": "COMPOSED_OF",
    "sourceName": "MPLSLDP",
    "zDeviceId": 6
  },
  {
    "aDeviceId": 7,
    "aObjectId": 3,
    "connectionId": 5,
    "isAutomatic": false,
    "isDiscovered": false,
    "relationType": "PEER",
    "sourceName": "UserDefined",
    "zDeviceId": 6
  },
  {
    "aDeviceId": 2,
    "aObjectId": 4,
    "connectionId": 3,
    "isAutomatic": true,
    "isDiscovered": false,
    "relationType": "UNDERLYING",
    "sourceName": "CISCOACI_LOGICAL",
    "zDeviceId": 4
  }
]