{
  "authentication": "TACACS",
  "customTimeout": 10,
  "dateFormat": "string",
  "email": "string",
  "firstName": "string",
  "forcePasswordChange": true,
  "id": 7,
  "isActive": true,
  "lastName": "string",
  "password": "string",
  "passwordNeverExpires": false,
  "roleIds": [
    8,
    5,
    9,
    7,
    3,
    8,
    8
  ],
  "timezone": "string",
  "timezoneStartupCheck": false,
  "username": "string"
}