{
  "allowMaximumValue": false,
  "dataUnits": "string",
  "description": "string",
  "displayUnits": "string",
  "extendedInfo": {},
  "format": "GAUGE",
  "id": 10,
  "isDefault": false,
  "isEnabled": false,
  "name": "string",
  "pluginId": 6,
  "pluginObjectTypeId": 8,
  "syntheticExpression": "string",
  "syntheticMaximumExpression": "string"
}