{
  "ranges": [
    {
      "end": "string",
      "options": {},
      "start": "string",
      "type": "CustomWeek"
    },
    {
      "end": "string",
      "options": {},
      "start": "string",
      "type": "CustomWeek"
    },
    {
      "end": "string",
      "options": {},
      "start": "string",
      "type": "CustomWeek"
    },
    {
      "end": "string",
      "options": {},
      "start": "string",
      "type": "RelativePeriod"
    }
  ],
  "timezone": "string"
}