{
  "id": 1,
  "isDefault": true,
  "name": "string",
  "relativeTimes": [
    {
      "endHour": 5,
      "endMin": 10,
      "friday": false,
      "monday": true,
      "saturday": false,
      "startHour": 8,
      "startMin": 3,
      "sunday": true,
      "thursday": true,
      "tuesday": true,
      "wednesday": true
    },
    {
      "endHour": 10,
      "endMin": 9,
      "friday": true,
      "monday": true,
      "saturday": true,
      "startHour": 1,
      "startMin": 4,
      "sunday": true,
      "thursday": true,
      "tuesday": false,
      "wednesday": false
    },
    {
      "endHour": 1,
      "endMin": 5,
      "friday": true,
      "monday": false,
      "saturday": false,
      "startHour": 9,
      "startMin": 4,
      "sunday": false,
      "thursday": false,
      "tuesday": false,
      "wednesday": false
    },
    {
      "endHour": 4,
      "endMin": 1,
      "friday": false,
      "monday": true,
      "saturday": false,
      "startHour": 4,
      "startMin": 9,
      "sunday": true,
      "thursday": true,
      "tuesday": false,
      "wednesday": true
    },
    {
      "endHour": 1,
      "endMin": 3,
      "friday": false,
      "monday": true,
      "saturday": false,
      "startHour": 9,
      "startMin": 4,
      "sunday": false,
      "thursday": false,
      "tuesday": false,
      "wednesday": false
    },
    {
      "endHour": 2,
      "endMin": 1,
      "friday": false,
      "monday": true,
      "saturday": true,
      "startHour": 2,
      "startMin": 7,
      "sunday": false,
      "thursday": false,
      "tuesday": true,
      "wednesday": true
    }
  ]
}