{
  "rawData": {
    "csv": {
      "expandTimeseries": true,
      "formatTimestamp": true
    },
    "dataAggregation": {
      "aggregationType": {},
      "aggregationUnits": {},
      "aggregationValue": 1,
      "useAggregation": true
    },
    "rawData": {
      "fitTimeSpanTo": {},
      "percentiles": 8,
      "projectionTime": 3,
      "reduceData": true,
      "standardDeviation": 2,
      "timeOverTimeOnly": true,
      "timeOverTimeType": {},
      "timeOverTimeUnits": {},
      "timeOverTimeValue": 3,
      "trend": {},
      "trendType": {},
      "useBaseline": true,
      "usePercentiles": false,
      "useTimeOverTime": true
    },
    "units": {
      "percentage": true,
      "preferredUnits": "bits"
    },
    "workHours": {
      "customWorkhours": [
        {
          "days": {},
          "startHour": {},
          "startMin": {},
          "endHour": {},
          "endMin": {}
        },
        {
          "days": {},
          "startHour": {},
          "startMin": {},
          "endHour": {},
          "endMin": {}
        },
        {
          "days": {},
          "startHour": {},
          "startMin": {},
          "endHour": {},
          "endMin": {}
        },
        {
          "days": {},
          "startHour": {},
          "startMin": {},
          "endHour": {},
          "endMin": {}
        }
      ],
      "type": "none",
      "workHoursGroupId": 7
    }
  },
  "sourceFields": {
    "fields": [
      "string",
      "string",
      "string"
    ],
    "sort": [
      [
        "string",
        "string",
        "string",
        "string",
        "string"
      ]
    ]
  }
}