{
  "connections": [
    {
      "data": [
        {
          "deviceId": 1,
          "elementId": 1,
          "pluginId": 7,
          "reportId": 8
        },
        {
          "deviceId": 4,
          "elementId": 1,
          "pluginId": 9,
          "reportId": 1
        },
        {
          "deviceId": 6,
          "elementId": 9,
          "pluginId": 4,
          "reportId": 3
        },
        {
          "deviceId": 5,
          "elementId": 1,
          "pluginId": 8,
          "reportId": 10
        },
        {
          "deviceId": 4,
          "elementId": 2,
          "pluginId": 6,
          "reportId": 2
        }
      ],
      "id": 9,
      "nodeAId": 1,
      "nodeBId": 8,
      "type": "Device"
    },
    {
      "data": [
        {
          "deviceId": 2,
          "elementId": 5,
          "pluginId": 2,
          "reportId": 3
        },
        {
          "deviceId": 4,
          "elementId": 9,
          "pluginId": 4,
          "reportId": 1
        },
        {
          "deviceId": 4,
          "elementId": 3,
          "pluginId": 8,
          "reportId": 4
        },
        {
          "deviceId": 9,
          "elementId": 7,
          "pluginId": 10,
          "reportId": 9
        },
        {
          "deviceId": 9,
          "elementId": 9,
          "pluginId": 3,
          "reportId": 4
        },
        {
          "deviceId": 9,
          "elementId": 10,
          "pluginId": 7,
          "reportId": 9
        },
        {
          "deviceId": 6,
          "elementId": 8,
          "pluginId": 7,
          "reportId": 1
        },
        {
          "deviceId": 8,
          "elementId": 2,
          "pluginId": 8,
          "reportId": 8
        }
      ],
      "id": 10,
      "nodeAId": 3,
      "nodeBId": 8,
      "type": "ObjectGroup"
    },
    {
      "data": [
        {
          "deviceId": 2,
          "elementId": 10,
          "pluginId": 5,
          "reportId": 7
        },
        {
          "deviceId": 9,
          "elementId": 10,
          "pluginId": 8,
          "reportId": 2
        }
      ],
      "id": 4,
      "nodeAId": 10,
      "nodeBId": 7,
      "type": "Object"
    },
    {
      "data": [
        {
          "deviceId": 10,
          "elementId": 6,
          "pluginId": 3,
          "reportId": 5
        },
        {
          "deviceId": 7,
          "elementId": 4,
          "pluginId": 8,
          "reportId": 5
        },
        {
          "deviceId": 3,
          "elementId": 1,
          "pluginId": 9,
          "reportId": 5
        },
        {
          "deviceId": 3,
          "elementId": 8,
          "pluginId": 3,
          "reportId": 10
        },
        {
          "deviceId": 4,
          "elementId": 6,
          "pluginId": 3,
          "reportId": 10
        }
      ],
      "id": 5,
      "nodeAId": 7,
      "nodeBId": 6,
      "type": "StatusMap"
    },
    {
      "data": [
        {
          "deviceId": 7,
          "elementId": 3,
          "pluginId": 3,
          "reportId": 3
        },
        {
          "deviceId": 1,
          "elementId": 1,
          "pluginId": 3,
          "reportId": 1
        },
        {
          "deviceId": 3,
          "elementId": 5,
          "pluginId": 6,
          "reportId": 3
        },
        {
          "deviceId": 3,
          "elementId": 1,
          "pluginId": 3,
          "reportId": 8
        }
      ],
      "id": 2,
      "nodeAId": 10,
      "nodeBId": 9,
      "type": "Object"
    },
    {
      "data": [
        {
          "deviceId": 2,
          "elementId": 5,
          "pluginId": 10,
          "reportId": 4
        },
        {
          "deviceId": 3,
          "elementId": 5,
          "pluginId": 1,
          "reportId": 6
        },
        {
          "deviceId": 8,
          "elementId": 2,
          "pluginId": 10,
          "reportId": 4
        },
        {
          "deviceId": 7,
          "elementId": 4,
          "pluginId": 6,
          "reportId": 1
        }
      ],
      "id": 1,
      "nodeAId": 10,
      "nodeBId": 7,
      "type": "ObjectGroup"
    },
    {
      "data": [
        {
          "deviceId": 2,
          "elementId": 4,
          "pluginId": 8,
          "reportId": 8
        },
        {
          "deviceId": 3,
          "elementId": 5,
          "pluginId": 9,
          "reportId": 6
        }
      ],
      "id": 7,
      "nodeAId": 2,
      "nodeBId": 6,
      "type": "ObjectGroup"
    },
    {
      "data": [
        {
          "deviceId": 3,
          "elementId": 7,
          "pluginId": 6,
          "reportId": 7
        },
        {
          "deviceId": 5,
          "elementId": 1,
          "pluginId": 9,
          "reportId": 7
        },
        {
          "deviceId": 9,
          "elementId": 1,
          "pluginId": 6,
          "reportId": 6
        },
        {
          "deviceId": 6,
          "elementId": 3,
          "pluginId": 2,
          "reportId": 1
        },
        {
          "deviceId": 8,
          "elementId": 3,
          "pluginId": 5,
          "reportId": 10
        },
        {
          "deviceId": 5,
          "elementId": 2,
          "pluginId": 9,
          "reportId": 1
        }
      ],
      "id": 5,
      "nodeAId": 9,
      "nodeBId": 3,
      "type": "Object"
    },
    {
      "data": [
        {
          "deviceId": 6,
          "elementId": 5,
          "pluginId": 1,
          "reportId": 8
        },
        {
          "deviceId": 9,
          "elementId": 4,
          "pluginId": 7,
          "reportId": 6
        },
        {
          "deviceId": 8,
          "elementId": 1,
          "pluginId": 4,
          "reportId": 8
        },
        {
          "deviceId": 3,
          "elementId": 7,
          "pluginId": 4,
          "reportId": 5
        },
        {
          "deviceId": 3,
          "elementId": 4,
          "pluginId": 7,
          "reportId": 8
        },
        {
          "deviceId": 5,
          "elementId": 6,
          "pluginId": 10,
          "reportId": 5
        },
        {
          "deviceId": 5,
          "elementId": 4,
          "pluginId": 2,
          "reportId": 7
        }
      ],
      "id": 9,
      "nodeAId": 4,
      "nodeBId": 10,
      "type": "DeviceGroup"
    }
  ],
  "id": 1,
  "imageId": 2,
  "imageMimeType": "string",
  "imageName": "string",
  "imageSize": 4,
  "name": "string",
  "nodes": [
    {
      "data": [
        {
          "deviceId": 4,
          "elementId": 2,
          "pluginId": 2,
          "reportId": 5
        },
        {
          "deviceId": 1,
          "elementId": 3,
          "pluginId": 5,
          "reportId": 10
        },
        {
          "deviceId": 8,
          "elementId": 9,
          "pluginId": 5,
          "reportId": 1
        },
        {
          "deviceId": 2,
          "elementId": 2,
          "pluginId": 3,
          "reportId": 7
        },
        {
          "deviceId": 2,
          "elementId": 7,
          "pluginId": 3,
          "reportId": 7
        },
        {
          "deviceId": 3,
          "elementId": 7,
          "pluginId": 10,
          "reportId": 10
        },
        {
          "deviceId": 9,
          "elementId": 8,
          "pluginId": 4,
          "reportId": 5
        },
        {
          "deviceId": 2,
          "elementId": 9,
          "pluginId": 4,
          "reportId": 1
        },
        {
          "deviceId": 3,
          "elementId": 3,
          "pluginId": 8,
          "reportId": 3
        },
        {
          "deviceId": 8,
          "elementId": 4,
          "pluginId": 10,
          "reportId": 10
        }
      ],
      "id": 5,
      "name": "string",
      "type": "DeviceGroup",
      "x": 6,
      "y": 5
    },
    {
      "data": [
        {
          "deviceId": 7,
          "elementId": 9,
          "pluginId": 3,
          "reportId": 5
        },
        {
          "deviceId": 1,
          "elementId": 7,
          "pluginId": 2,
          "reportId": 2
        }
      ],
      "id": 10,
      "name": "string",
      "type": "StatusMap",
      "x": 8,
      "y": 5
    },
    {
      "data": [
        {
          "deviceId": 8,
          "elementId": 9,
          "pluginId": 10,
          "reportId": 1
        },
        {
          "deviceId": 1,
          "elementId": 9,
          "pluginId": 5,
          "reportId": 8
        },
        {
          "deviceId": 6,
          "elementId": 4,
          "pluginId": 9,
          "reportId": 1
        },
        {
          "deviceId": 1,
          "elementId": 1,
          "pluginId": 5,
          "reportId": 3
        },
        {
          "deviceId": 2,
          "elementId": 10,
          "pluginId": 2,
          "reportId": 7
        },
        {
          "deviceId": 8,
          "elementId": 1,
          "pluginId": 8,
          "reportId": 3
        },
        {
          "deviceId": 7,
          "elementId": 6,
          "pluginId": 9,
          "reportId": 1
        }
      ],
      "id": 1,
      "name": "string",
      "type": "DeviceGroup",
      "x": 5,
      "y": 7
    },
    {
      "data": [
        {
          "deviceId": 9,
          "elementId": 4,
          "pluginId": 7,
          "reportId": 4
        },
        {
          "deviceId": 6,
          "elementId": 1,
          "pluginId": 3,
          "reportId": 1
        },
        {
          "deviceId": 5,
          "elementId": 1,
          "pluginId": 10,
          "reportId": 9
        },
        {
          "deviceId": 2,
          "elementId": 10,
          "pluginId": 3,
          "reportId": 7
        },
        {
          "deviceId": 1,
          "elementId": 9,
          "pluginId": 4,
          "reportId": 3
        },
        {
          "deviceId": 5,
          "elementId": 2,
          "pluginId": 1,
          "reportId": 10
        },
        {
          "deviceId": 2,
          "elementId": 2,
          "pluginId": 5,
          "reportId": 4
        },
        {
          "deviceId": 6,
          "elementId": 7,
          "pluginId": 9,
          "reportId": 2
        }
      ],
      "id": 10,
      "name": "string",
      "type": "ObjectGroup",
      "x": 4,
      "y": 3
    },
    {
      "data": [
        {
          "deviceId": 6,
          "elementId": 10,
          "pluginId": 4,
          "reportId": 6
        },
        {
          "deviceId": 2,
          "elementId": 9,
          "pluginId": 7,
          "reportId": 3
        },
        {
          "deviceId": 4,
          "elementId": 8,
          "pluginId": 6,
          "reportId": 3
        },
        {
          "deviceId": 9,
          "elementId": 10,
          "pluginId": 3,
          "reportId": 9
        },
        {
          "deviceId": 1,
          "elementId": 3,
          "pluginId": 8,
          "reportId": 2
        },
        {
          "deviceId": 4,
          "elementId": 4,
          "pluginId": 9,
          "reportId": 8
        },
        {
          "deviceId": 10,
          "elementId": 9,
          "pluginId": 5,
          "reportId": 3
        },
        {
          "deviceId": 2,
          "elementId": 10,
          "pluginId": 4,
          "reportId": 10
        },
        {
          "deviceId": 3,
          "elementId": 1,
          "pluginId": 4,
          "reportId": 8
        }
      ],
      "id": 8,
      "name": "string",
      "type": "ObjectGroup",
      "x": 1,
      "y": 7
    }
  ]
}