{
  "bar": {
    "drawGraphOutline": true,
    "prettyXAxis": true,
    "prettyYAxis": true,
    "scaleToMinimumValue": false,
    "scaled": true,
    "showAggregation": false,
    "showAverage": false,
    "showFrequency": true,
    "showLast": true,
    "showLegend": true,
    "showPeak": false,
    "showTimespan": true,
    "showTitle": false,
    "showValley": true
  },
  "csv": {
    "csvSetting": {
      "expandTimeseries": false,
      "formatTimestamp": true
    }
  },
  "line": {
    "drawGraphOutline": true,
    "dualYAxes": true,
    "logScale": true,
    "prettyXAxis": false,
    "prettyYAxis": true,
    "scaleToMinimumValue": false,
    "scaled": true,
    "showAggregation": true,
    "showAverage": false,
    "showFrequency": true,
    "showLast": false,
    "showLegend": false,
    "showPeak": false,
    "showTimespan": true,
    "showTitle": true,
    "showValley": true
  },
  "pie": {
    "showAggregation": false,
    "showAverage": false,
    "showFrequency": false,
    "showLast": false,
    "showLegend": true,
    "showPeak": true,
    "showTimespan": false,
    "showTitle": true,
    "showValley": true
  },
  "radial": {
    "drawGraphOutline": true,
    "scaled": false,
    "showAggregation": false,
    "showAverage": false,
    "showFrequency": false,
    "showLast": false,
    "showLegend": false,
    "showPeak": true,
    "showTimespan": true,
    "showTitle": true,
    "showValley": false
  },
  "stackedBar": {
    "drawGraphOutline": true,
    "prettyXAxis": false,
    "prettyYAxis": false,
    "scaled": true,
    "showAggregation": false,
    "showAverage": false,
    "showFrequency": true,
    "showLast": true,
    "showLegend": true,
    "showPeak": false,
    "showTimespan": false,
    "showTitle": false,
    "showValley": true
  },
  "stackedLine": {
    "drawGraphOutline": true,
    "prettyXAxis": true,
    "prettyYAxis": false,
    "scaleToMinimumValue": true,
    "scaled": true,
    "sendGraphCSV": false,
    "showAggregation": false,
    "showAverage": true,
    "showFrequency": false,
    "showLast": true,
    "showLegend": true,
    "showPeak": false,
    "showTimespan": false,
    "showTitle": true,
    "showValley": true
  },
  "table": {
    "column": {
      "exclude": [
        "string",
        "string",
        "string"
      ],
      "include": [
        "string",
        "string",
        "string",
        "string",
        "string",
        "string",
        "string",
        "string",
        "string",
        "string"
      ]
    },
    "dataPresentation": {
      "formatNumbers": false,
      "precision": 3
    },
    "table": {
      "blockVis": false,
      "hideHeaders": true,
      "wrapCells": false
    }
  }
}