{
  "content": [
    {
      "category": "string",
      "defaultSortOrder": 10,
      "id": 5,
      "isAggregated": true,
      "isEnabled": false,
      "lastUpdate": 9,
      "name": "string"
    },
    {
      "category": "string",
      "defaultSortOrder": 5,
      "id": 4,
      "isAggregated": true,
      "isEnabled": true,
      "lastUpdate": 3,
      "name": "string"
    },
    {
      "category": "string",
      "defaultSortOrder": 10,
      "id": 2,
      "isAggregated": true,
      "isEnabled": true,
      "lastUpdate": 3,
      "name": "string"
    },
    {
      "category": "string",
      "defaultSortOrder": 4,
      "id": 8,
      "isAggregated": true,
      "isEnabled": false,
      "lastUpdate": 8,
      "name": "string"
    },
    {
      "category": "string",
      "defaultSortOrder": 8,
      "id": 10,
      "isAggregated": false,
      "isEnabled": true,
      "lastUpdate": 8,
      "name": "string"
    }
  ],
  "pageNumber": 1,
  "pageSize": 2,
  "totalElements": 5,
  "totalPages": 6
}