{
  "ids": [
    9,
    8,
    6,
    1,
    6,
    8,
    3,
    9,
    10
  ],
  "indicatorTypes": [
    {
      "aggregations": [
        "minPer",
        "max",
        "min",
        "minPer",
        "max",
        "maxPer",
        "minPer",
        "avgPer",
        "max",
        "min"
      ],
      "ids": [
        1,
        1,
        5,
        1
      ],
      "objectTypeId": 5,
      "pluginId": 10
    },
    {
      "aggregations": [
        "minPer",
        "avgPer",
        "minPer"
      ],
      "ids": [
        2,
        1,
        5
      ],
      "objectTypeId": 2,
      "pluginId": 5
    },
    {
      "aggregations": [
        "maxPer",
        "avgPer"
      ],
      "ids": [
        6,
        1,
        6,
        2
      ],
      "objectTypeId": 2,
      "pluginId": 8
    },
    {
      "aggregations": [
        "max",
        "avg",
        "max",
        "avgPer",
        "minPer",
        "maxPer"
      ],
      "ids": [
        1,
        3,
        2,
        6,
        7
      ],
      "objectTypeId": 6,
      "pluginId": 7
    },
    {
      "aggregations": [
        "avg",
        "maxPer",
        "minPer",
        "max",
        "avg",
        "avg",
        "max",
        "max",
        "avgPer",
        "avgPer"
      ],
      "ids": [
        1,
        2,
        1,
        5,
        10,
        10
      ],
      "objectTypeId": 5,
      "pluginId": 9
    }
  ],
  "type": "DeviceGroupChildren"
}