{
  "fields": [
    {
      "defaultEntry": "string",
      "description": "string",
      "enumList": "string",
      "maxLength": 8,
      "name": "string",
      "type": "INTEGER",
      "valueRange": "string"
    }
  ],
  "name": "string",
  "technology": "string"
}