{
  "content": [
    {
      "id": 2,
      "name": "string",
      "type": "mac",
      "entityTypes": [
        "devicegroup",
        "objecttype"
      ],
      "singleton": false,
      "validationExpression": "string",
      "namespaceId": 4,
      "namespaceName": "string"
    },
    {
      "id": 8,
      "name": "string",
      "type": "url",
      "entityTypes": [
        "object",
        "objectgroup"
      ],
      "singleton": true,
      "validationExpression": "string",
      "namespaceId": 2,
      "namespaceName": "string"
    },
    {
      "id": 9,
      "name": "string",
      "type": "latLong",
      "entityTypes": [
        "objectgroup",
        "objecttype",
        "objectgroup",
        "object",
        "devicegroup"
      ],
      "singleton": true,
      "validationExpression": "string",
      "namespaceId": 1,
      "namespaceName": "string"
    },
    {
      "id": 7,
      "name": "string",
      "type": "mac",
      "entityTypes": [
        "device",
        "objecttype",
        "object",
        "object",
        "objectgroup"
      ],
      "singleton": true,
      "validationExpression": "string",
      "namespaceId": 1,
      "namespaceName": "string"
    },
    {
      "id": 7,
      "name": "string",
      "type": "url",
      "entityTypes": [
        "devicegroup",
        "objectgroup"
      ],
      "singleton": true,
      "validationExpression": "string",
      "namespaceId": 5,
      "namespaceName": "string"
    }
  ],
  "pageNumber": 2,
  "pageSize": 10,
  "totalElements": 4,
  "totalPages": 7
}