[
  {
    "apiKey": "string",
    "applicationName": "string",
    "creationDate": 5,
    "expirationDate": 10,
    "user": "string"
  },
  {
    "apiKey": "string",
    "applicationName": "string",
    "creationDate": 1,
    "expirationDate": 8,
    "user": "string"
  },
  {
    "apiKey": "string",
    "applicationName": "string",
    "creationDate": 3,
    "expirationDate": 4,
    "user": "string"
  }
]