{
  "actions": [
    {
      "name": "getPolicies",
      "protocol": "REST",
      "method": "GET",
      "entitypath": "{base_path}/{version}/policies?{query}",
      "requestSchema": "schema.json",
      "responseSchema": "schema.json",
      "timeout": 0,
      "sendEmpty": false,
      "sendGetBody": false,
      "requestDatatype": "JSON",
      "responseDatatype": "JSON",
      "headers": {},
      "responseObjects": [
        {
          "type": "default",
          "key": "",
          "mockFile": "mockdatafiles/getPolicies-default.json"
        }
      ]
    },
    {
      "name": "createPolicy",
      "protocol": "REST",
      "method": "POST",
      "entitypath": "{base_path}/{version}/policies?{query}",
      "requestSchema": "schema.json",
      "responseSchema": "schema.json",
      "timeout": 0,
      "sendEmpty": false,
      "requestDatatype": "JSON",
      "responseDatatype": "JSON",
      "headers": {},
      "responseObjects": [
        {
          "type": "default",
          "key": "",
          "mockFile": "mockdatafiles/createPolicy-default.json"
        }
      ]
    },
    {
      "name": "filterPolicies",
      "protocol": "REST",
      "method": "POST",
      "entitypath": "{base_path}/{version}/policies/filter?{query}",
      "requestSchema": "schema.json",
      "responseSchema": "schema.json",
      "timeout": 0,
      "sendEmpty": false,
      "requestDatatype": "JSON",
      "responseDatatype": "JSON",
      "headers": {},
      "responseObjects": [
        {
          "type": "default",
          "key": "",
          "mockFile": "mockdatafiles/filterPolicies-default.json"
        }
      ]
    },
    {
      "name": "getPolicyFolders",
      "protocol": "REST",
      "method": "GET",
      "entitypath": "{base_path}/{version}/policies/folders?{query}",
      "requestSchema": "schema.json",
      "responseSchema": "schema.json",
      "timeout": 0,
      "sendEmpty": false,
      "sendGetBody": false,
      "requestDatatype": "JSON",
      "responseDatatype": "JSON",
      "headers": {},
      "responseObjects": [
        {
          "type": "default",
          "key": "",
          "mockFile": "mockdatafiles/getPolicyFolders-default.json"
        }
      ]
    },
    {
      "name": "createPolicyFolder",
      "protocol": "REST",
      "method": "POST",
      "entitypath": "{base_path}/{version}/policies/folders?{query}",
      "requestSchema": "schema.json",
      "responseSchema": "schema.json",
      "timeout": 0,
      "sendEmpty": false,
      "requestDatatype": "JSON",
      "responseDatatype": "JSON",
      "headers": {},
      "responseObjects": [
        {
          "type": "default",
          "key": "",
          "mockFile": "mockdatafiles/createPolicyFolder-default.json"
        }
      ]
    },
    {
      "name": "updatePolicyFolder",
      "protocol": "REST",
      "method": "PUT",
      "entitypath": "{base_path}/{version}/policies/folders/{pathv1}?{query}",
      "requestSchema": "schema.json",
      "responseSchema": "schema.json",
      "timeout": 0,
      "sendEmpty": false,
      "requestDatatype": "JSON",
      "responseDatatype": "JSON",
      "headers": {},
      "responseObjects": [
        {
          "type": "default",
          "key": "",
          "mockFile": "mockdatafiles/updatePolicyFolder-default.json"
        }
      ]
    },
    {
      "name": "deletePolicyFolderById",
      "protocol": "REST",
      "method": "DELETE",
      "entitypath": "{base_path}/{version}/policies/folders/{pathv1}?{query}",
      "requestSchema": "schema.json",
      "responseSchema": "schema.json",
      "timeout": 0,
      "sendEmpty": false,
      "requestDatatype": "JSON",
      "responseDatatype": "JSON",
      "headers": {},
      "responseObjects": [
        {
          "type": "default",
          "key": "",
          "mockFile": "mockdatafiles/deletePolicyFolderById-default.json"
        }
      ]
    },
    {
      "name": "getPolicy",
      "protocol": "REST",
      "method": "GET",
      "entitypath": "{base_path}/{version}/policies/{pathv1}?{query}",
      "requestSchema": "schema.json",
      "responseSchema": "schema.json",
      "timeout": 0,
      "sendEmpty": false,
      "sendGetBody": false,
      "requestDatatype": "JSON",
      "responseDatatype": "JSON",
      "headers": {},
      "responseObjects": [
        {
          "type": "default",
          "key": "",
          "mockFile": "mockdatafiles/getPolicy-default.json"
        }
      ]
    },
    {
      "name": "updatePolicy",
      "protocol": "REST",
      "method": "PUT",
      "entitypath": "{base_path}/{version}/policies/{pathv1}?{query}",
      "requestSchema": "schema.json",
      "responseSchema": "schema.json",
      "timeout": 0,
      "sendEmpty": false,
      "requestDatatype": "JSON",
      "responseDatatype": "JSON",
      "headers": {},
      "responseObjects": [
        {
          "type": "default",
          "key": "",
          "mockFile": "mockdatafiles/updatePolicy-default.json"
        }
      ]
    },
    {
      "name": "deletePolicyById",
      "protocol": "REST",
      "method": "DELETE",
      "entitypath": "{base_path}/{version}/policies/{pathv1}?{query}",
      "requestSchema": "schema.json",
      "responseSchema": "schema.json",
      "timeout": 0,
      "sendEmpty": false,
      "requestDatatype": "JSON",
      "responseDatatype": "JSON",
      "headers": {},
      "responseObjects": [
        {
          "type": "default",
          "key": "",
          "mockFile": "mockdatafiles/deletePolicyById-default.json"
        }
      ]
    },
    {
      "name": "getActionsUsingGET",
      "protocol": "REST",
      "method": "GET",
      "entitypath": "{base_path}/{version}/policies/{pathv1}/actions?{query}",
      "requestSchema": "schema.json",
      "responseSchema": "schema.json",
      "timeout": 0,
      "sendEmpty": false,
      "sendGetBody": false,
      "requestDatatype": "JSON",
      "responseDatatype": "JSON",
      "headers": {},
      "responseObjects": [
        {
          "type": "default",
          "key": "",
          "mockFile": "mockdatafiles/getActionsUsingGET-default.json"
        }
      ]
    },
    {
      "name": "updatePolicyAction",
      "protocol": "REST",
      "method": "PUT",
      "entitypath": "{base_path}/{version}/policies/{pathv1}/actions?{query}",
      "requestSchema": "schema.json",
      "responseSchema": "schema.json",
      "timeout": 0,
      "sendEmpty": false,
      "requestDatatype": "JSON",
      "responseDatatype": "JSON",
      "headers": {},
      "responseObjects": [
        {
          "type": "default",
          "key": "",
          "mockFile": "mockdatafiles/updatePolicyAction-default.json"
        }
      ]
    },
    {
      "name": "deletePolicyActionById",
      "protocol": "REST",
      "method": "DELETE",
      "entitypath": "{base_path}/{version}/policies/{pathv1}/actions?{query}",
      "requestSchema": "schema.json",
      "responseSchema": "schema.json",
      "timeout": 0,
      "sendEmpty": false,
      "requestDatatype": "JSON",
      "responseDatatype": "JSON",
      "headers": {},
      "responseObjects": [
        {
          "type": "default",
          "key": "",
          "mockFile": "mockdatafiles/deletePolicyActionById-default.json"
        }
      ]
    },
    {
      "name": "findAllUsingGET",
      "protocol": "REST",
      "method": "GET",
      "entitypath": "{base_path}/{version}/policies/{pathv1}/conditions?{query}",
      "requestSchema": "schema.json",
      "responseSchema": "schema.json",
      "timeout": 0,
      "sendEmpty": false,
      "sendGetBody": false,
      "requestDatatype": "JSON",
      "responseDatatype": "JSON",
      "headers": {},
      "responseObjects": [
        {
          "type": "default",
          "key": "",
          "mockFile": "mockdatafiles/findAllUsingGET-default.json"
        }
      ]
    },
    {
      "name": "createPolicyCondition",
      "protocol": "REST",
      "method": "POST",
      "entitypath": "{base_path}/{version}/policies/{pathv1}/conditions?{query}",
      "requestSchema": "schema.json",
      "responseSchema": "schema.json",
      "timeout": 0,
      "sendEmpty": false,
      "requestDatatype": "JSON",
      "responseDatatype": "JSON",
      "headers": {},
      "responseObjects": [
        {
          "type": "default",
          "key": "",
          "mockFile": "mockdatafiles/createPolicyCondition-default.json"
        }
      ]
    },
    {
      "name": "getPolicyConditionById",
      "protocol": "REST",
      "method": "GET",
      "entitypath": "{base_path}/{version}/policies/{pathv1}/conditions/{pathv2}?{query}",
      "requestSchema": "schema.json",
      "responseSchema": "schema.json",
      "timeout": 0,
      "sendEmpty": false,
      "sendGetBody": false,
      "requestDatatype": "JSON",
      "responseDatatype": "JSON",
      "headers": {},
      "responseObjects": [
        {
          "type": "default",
          "key": "",
          "mockFile": "mockdatafiles/getPolicyConditionById-default.json"
        }
      ]
    },
    {
      "name": "updatePolicyCondition",
      "protocol": "REST",
      "method": "PUT",
      "entitypath": "{base_path}/{version}/policies/{pathv1}/conditions/{pathv2}?{query}",
      "requestSchema": "schema.json",
      "responseSchema": "schema.json",
      "timeout": 0,
      "sendEmpty": false,
      "requestDatatype": "JSON",
      "responseDatatype": "JSON",
      "headers": {},
      "responseObjects": [
        {
          "type": "default",
          "key": "",
          "mockFile": "mockdatafiles/updatePolicyCondition-default.json"
        }
      ]
    },
    {
      "name": "deletePolicyConditionById",
      "protocol": "REST",
      "method": "DELETE",
      "entitypath": "{base_path}/{version}/policies/{pathv1}/conditions/{pathv2}?{query}",
      "requestSchema": "schema.json",
      "responseSchema": "schema.json",
      "timeout": 0,
      "sendEmpty": false,
      "requestDatatype": "JSON",
      "responseDatatype": "JSON",
      "headers": {},
      "responseObjects": [
        {
          "type": "default",
          "key": "",
          "mockFile": "mockdatafiles/deletePolicyConditionById-default.json"
        }
      ]
    }
  ]
}