{
  "pie": {
    "showAggregation": true,
    "showAverage": true,
    "showFrequency": true,
    "showLast": false,
    "showLegend": true,
    "showPeak": false,
    "showTimespan": false,
    "showTitle": true,
    "showValley": false
  },
  "table": {
    "column": {
      "exclude": [
        "string",
        "string",
        "string",
        "string",
        "string",
        "string",
        "string",
        "string",
        "string"
      ],
      "include": [
        "string",
        "string",
        "string",
        "string",
        "string",
        "string",
        "string"
      ]
    },
    "dataPresentation": {
      "formatNumbers": true,
      "precision": 4
    },
    "table": {
      "blockVis": true,
      "hideHeaders": false,
      "wrapCells": true
    }
  }
}