{
  "aggregation": 6,
  "comparison": 9,
  "deviceId": 7,
  "duration": 9,
  "flowDto": {
    "elementId": 2,
    "unit": "T"
  },
  "id": 4,
  "message": "string",
  "objectId": 6,
  "pluginId": 8,
  "policyConditionId": 7,
  "policyId": 7,
  "pollId": 9,
  "sigmaDirection": 3,
  "thresholdId": 7,
  "type": 1,
  "unit": "string",
  "value": 6,
  "value2": 3
}