{
  "acknowledgedBy": "string",
  "alertFlowFalcon": {
    "alertId": 7,
    "directionId": 8,
    "filterId": 9,
    "id": 10,
    "interfaceId": 10,
    "netflowDeviceId": 4,
    "viewId": 7
  },
  "assignedTo": 3,
  "clearMessage": "string",
  "clearTime": 9,
  "closed": 6,
  "closedKey": 10,
  "comments": "string",
  "deviceId": 6,
  "endTime": 6,
  "id": 6,
  "ignoreComment": "string",
  "ignoreUid": 2,
  "ignoreUntil": 10,
  "indicatorId": 4,
  "isMaintenanceAlert": true,
  "lastProcessed": 10,
  "message": "string",
  "number": 2,
  "objectId": 5,
  "origin": "trap",
  "pluginName": "string",
  "pollId": 8,
  "severity": 3,
  "startTime": 2,
  "thresholdId": 6
}