{
  "attributeId": 5,
  "descriptionExpression": "string",
  "groupId": 7,
  "id": 1,
  "metadataValueExpression": "string",
  "mgtIpExpression": "string",
  "nameExpression": "string",
  "namespaceId": 6,
  "sysContactExpression": "string",
  "sysDescrExpression": "string",
  "sysLocationExpression": "string",
  "sysNameExpression": "string",
  "sysObjectIdExpression": "string",
  "walkCheckOid": "string"
}