{
  "name": "string",
  "settings": {
    "resultLimit": {
      "resultLimit": 10
    },
    "telephony": {
      "sortBy": "duration",
      "sortOrder": "ASC"
    }
  },
  "time": {
    "ranges": {
      "end": "string",
      "options": {},
      "start": "string",
      "type": "CustomWeek"
    },
    "timezone": "string"
  },
  "visualization": {
    "table": {
      "column": {
        "exclude": [
          "string"
        ],
        "include": [
          "string",
          "string",
          "string",
          "string",
          "string",
          "string",
          "string",
          "string"
        ]
      },
      "dataPresentation": {
        "formatNumbers": false,
        "precision": 4
      },
      "table": {
        "blockVis": false,
        "hideHeaders": true,
        "wrapCells": true
      }
    }
  }
}