{
  "content": [
    {
      "data": [
        {
          "deviceId": 8,
          "elementId": 7,
          "pluginId": 10,
          "reportId": 6
        },
        {
          "deviceId": 8,
          "elementId": 2,
          "pluginId": 2,
          "reportId": 1
        },
        {
          "deviceId": 6,
          "elementId": 4,
          "pluginId": 8,
          "reportId": 3
        },
        {
          "deviceId": 2,
          "elementId": 6,
          "pluginId": 7,
          "reportId": 6
        },
        {
          "deviceId": 6,
          "elementId": 7,
          "pluginId": 8,
          "reportId": 3
        },
        {
          "deviceId": 5,
          "elementId": 2,
          "pluginId": 10,
          "reportId": 7
        },
        {
          "deviceId": 5,
          "elementId": 5,
          "pluginId": 10,
          "reportId": 2
        },
        {
          "deviceId": 1,
          "elementId": 9,
          "pluginId": 6,
          "reportId": 9
        },
        {
          "deviceId": 1,
          "elementId": 9,
          "pluginId": 3,
          "reportId": 4
        },
        {
          "deviceId": 5,
          "elementId": 2,
          "pluginId": 5,
          "reportId": 1
        }
      ],
      "id": 8,
      "nodeAId": 1,
      "nodeBId": 8,
      "type": "ObjectGroup"
    },
    {
      "data": [
        {
          "deviceId": 3,
          "elementId": 10,
          "pluginId": 1,
          "reportId": 9
        },
        {
          "deviceId": 9,
          "elementId": 2,
          "pluginId": 8,
          "reportId": 9
        },
        {
          "deviceId": 4,
          "elementId": 5,
          "pluginId": 5,
          "reportId": 8
        },
        {
          "deviceId": 2,
          "elementId": 5,
          "pluginId": 8,
          "reportId": 6
        },
        {
          "deviceId": 10,
          "elementId": 10,
          "pluginId": 6,
          "reportId": 6
        },
        {
          "deviceId": 2,
          "elementId": 8,
          "pluginId": 4,
          "reportId": 6
        },
        {
          "deviceId": 5,
          "elementId": 9,
          "pluginId": 1,
          "reportId": 4
        },
        {
          "deviceId": 8,
          "elementId": 4,
          "pluginId": 7,
          "reportId": 1
        }
      ],
      "id": 7,
      "nodeAId": 9,
      "nodeBId": 1,
      "type": "DeviceGroup"
    },
    {
      "data": [
        {
          "deviceId": 7,
          "elementId": 8,
          "pluginId": 1,
          "reportId": 1
        },
        {
          "deviceId": 1,
          "elementId": 4,
          "pluginId": 1,
          "reportId": 7
        },
        {
          "deviceId": 10,
          "elementId": 5,
          "pluginId": 7,
          "reportId": 6
        },
        {
          "deviceId": 3,
          "elementId": 9,
          "pluginId": 10,
          "reportId": 5
        },
        {
          "deviceId": 3,
          "elementId": 7,
          "pluginId": 9,
          "reportId": 9
        },
        {
          "deviceId": 7,
          "elementId": 9,
          "pluginId": 1,
          "reportId": 2
        },
        {
          "deviceId": 7,
          "elementId": 7,
          "pluginId": 4,
          "reportId": 8
        },
        {
          "deviceId": 8,
          "elementId": 3,
          "pluginId": 4,
          "reportId": 2
        },
        {
          "deviceId": 10,
          "elementId": 5,
          "pluginId": 5,
          "reportId": 8
        }
      ],
      "id": 1,
      "nodeAId": 3,
      "nodeBId": 1,
      "type": "ObjectGroup"
    },
    {
      "data": [
        {
          "deviceId": 4,
          "elementId": 10,
          "pluginId": 3,
          "reportId": 7
        },
        {
          "deviceId": 9,
          "elementId": 5,
          "pluginId": 2,
          "reportId": 4
        },
        {
          "deviceId": 1,
          "elementId": 1,
          "pluginId": 10,
          "reportId": 7
        },
        {
          "deviceId": 6,
          "elementId": 7,
          "pluginId": 5,
          "reportId": 5
        },
        {
          "deviceId": 10,
          "elementId": 1,
          "pluginId": 7,
          "reportId": 2
        }
      ],
      "id": 6,
      "nodeAId": 4,
      "nodeBId": 10,
      "type": "Device"
    },
    {
      "data": [
        {
          "deviceId": 3,
          "elementId": 1,
          "pluginId": 10,
          "reportId": 10
        },
        {
          "deviceId": 3,
          "elementId": 1,
          "pluginId": 7,
          "reportId": 4
        },
        {
          "deviceId": 5,
          "elementId": 7,
          "pluginId": 9,
          "reportId": 7
        },
        {
          "deviceId": 2,
          "elementId": 4,
          "pluginId": 6,
          "reportId": 6
        },
        {
          "deviceId": 7,
          "elementId": 9,
          "pluginId": 5,
          "reportId": 2
        },
        {
          "deviceId": 7,
          "elementId": 5,
          "pluginId": 8,
          "reportId": 4
        },
        {
          "deviceId": 2,
          "elementId": 10,
          "pluginId": 9,
          "reportId": 7
        },
        {
          "deviceId": 10,
          "elementId": 5,
          "pluginId": 8,
          "reportId": 1
        }
      ],
      "id": 10,
      "nodeAId": 9,
      "nodeBId": 10,
      "type": "StatusMap"
    },
    {
      "data": [
        {
          "deviceId": 5,
          "elementId": 3,
          "pluginId": 4,
          "reportId": 4
        },
        {
          "deviceId": 1,
          "elementId": 2,
          "pluginId": 2,
          "reportId": 2
        },
        {
          "deviceId": 5,
          "elementId": 1,
          "pluginId": 5,
          "reportId": 8
        },
        {
          "deviceId": 9,
          "elementId": 5,
          "pluginId": 9,
          "reportId": 2
        },
        {
          "deviceId": 1,
          "elementId": 6,
          "pluginId": 7,
          "reportId": 1
        }
      ],
      "id": 5,
      "nodeAId": 3,
      "nodeBId": 5,
      "type": "StatusMap"
    }
  ],
  "pageNumber": 3,
  "pageSize": 9,
  "totalElements": 3,
  "totalPages": 10
}