{
  "content": [
    {
      "id": 7,
      "name": "string",
      "parentId": 3
    },
    {
      "id": 4,
      "name": "string",
      "parentId": 6
    },
    {
      "id": 8,
      "name": "string",
      "parentId": 8
    },
    {
      "id": 6,
      "name": "string",
      "parentId": 1
    },
    {
      "id": 4,
      "name": "string",
      "parentId": 7
    },
    {
      "id": 9,
      "name": "string",
      "parentId": 9
    },
    {
      "id": 8,
      "name": "string",
      "parentId": 6
    },
    {
      "id": 2,
      "name": "string",
      "parentId": 1
    }
  ],
  "pageNumber": 2,
  "pageSize": 3,
  "totalElements": 9,
  "totalPages": 4
}