{
  "content": [
    {
      "name": "string"
    },
    {
      "name": "string"
    },
    {
      "name": "string"
    },
    {
      "name": "string"
    }
  ],
  "pageNumber": 5,
  "pageSize": 8,
  "totalElements": 10,
  "totalPages": 4
}