{
  "actions": [
    {
      "name": "getDevices",
      "protocol": "REST",
      "method": "GET",
      "entitypath": "{base_path}/{version}/devices?{query}",
      "requestSchema": "schema.json",
      "responseSchema": "schema.json",
      "timeout": 0,
      "sendEmpty": false,
      "sendGetBody": false,
      "requestDatatype": "JSON",
      "responseDatatype": "JSON",
      "headers": {},
      "responseObjects": [
        {
          "type": "default",
          "key": "",
          "mockFile": "mockdatafiles/getDevices-default.json"
        }
      ]
    },
    {
      "name": "createDevice",
      "protocol": "REST",
      "method": "POST",
      "entitypath": "{base_path}/{version}/devices?{query}",
      "requestSchema": "schema.json",
      "responseSchema": "schema.json",
      "timeout": 0,
      "sendEmpty": false,
      "requestDatatype": "JSON",
      "responseDatatype": "JSON",
      "headers": {},
      "responseObjects": [
        {
          "type": "default",
          "key": "",
          "mockFile": "mockdatafiles/createDevice-default.json"
        }
      ]
    },
    {
      "name": "createDeviceData",
      "protocol": "REST",
      "method": "POST",
      "entitypath": "{base_path}/{version}/devices/data?{query}",
      "requestSchema": "schema.json",
      "responseSchema": "schema.json",
      "timeout": 0,
      "sendEmpty": false,
      "requestDatatype": "JSON",
      "responseDatatype": "JSON",
      "headers": {},
      "responseObjects": [
        {
          "type": "default",
          "key": "",
          "mockFile": ""
        }
      ]
    },
    {
      "name": "filterDevice",
      "protocol": "REST",
      "method": "POST",
      "entitypath": "{base_path}/{version}/devices/filter?{query}",
      "requestSchema": "schema.json",
      "responseSchema": "schema.json",
      "timeout": 0,
      "sendEmpty": false,
      "requestDatatype": "JSON",
      "responseDatatype": "JSON",
      "headers": {},
      "responseObjects": [
        {
          "type": "default",
          "key": "",
          "mockFile": "mockdatafiles/filterDevice-default.json"
        }
      ]
    },
    {
      "name": "getDeviceById",
      "protocol": "REST",
      "method": "GET",
      "entitypath": "{base_path}/{version}/devices/{pathv1}?{query}",
      "requestSchema": "schema.json",
      "responseSchema": "schema.json",
      "timeout": 0,
      "sendEmpty": false,
      "sendGetBody": false,
      "requestDatatype": "JSON",
      "responseDatatype": "JSON",
      "headers": {},
      "responseObjects": [
        {
          "type": "default",
          "key": "",
          "mockFile": "mockdatafiles/getDeviceById-default.json"
        }
      ]
    },
    {
      "name": "updateDeviceById",
      "protocol": "REST",
      "method": "PUT",
      "entitypath": "{base_path}/{version}/devices/{pathv1}?{query}",
      "requestSchema": "schema.json",
      "responseSchema": "schema.json",
      "timeout": 0,
      "sendEmpty": false,
      "requestDatatype": "JSON",
      "responseDatatype": "JSON",
      "headers": {},
      "responseObjects": [
        {
          "type": "default",
          "key": "",
          "mockFile": "mockdatafiles/updateDeviceById-default.json"
        }
      ]
    },
    {
      "name": "deleteDeviceById",
      "protocol": "REST",
      "method": "DELETE",
      "entitypath": "{base_path}/{version}/devices/{pathv1}?{query}",
      "requestSchema": "schema.json",
      "responseSchema": "schema.json",
      "timeout": 0,
      "sendEmpty": false,
      "requestDatatype": "JSON",
      "responseDatatype": "JSON",
      "headers": {},
      "responseObjects": [
        {
          "type": "default",
          "key": "",
          "mockFile": "mockdatafiles/deleteDeviceById-default.json"
        }
      ]
    },
    {
      "name": "partiallyUpdateDeviceById",
      "protocol": "REST",
      "method": "PATCH",
      "entitypath": "{base_path}/{version}/devices/{pathv1}?{query}",
      "requestSchema": "schema.json",
      "responseSchema": "schema.json",
      "timeout": 0,
      "sendEmpty": false,
      "requestDatatype": "JSON",
      "responseDatatype": "JSON",
      "headers": {},
      "responseObjects": [
        {
          "type": "default",
          "key": "",
          "mockFile": "mockdatafiles/partiallyUpdateDeviceById-default.json"
        }
      ]
    },
    {
      "name": "applyDeviceRules",
      "protocol": "REST",
      "method": "POST",
      "entitypath": "{base_path}/{version}/devices/{pathv1}/rules/apply?{query}",
      "requestSchema": "schema.json",
      "responseSchema": "schema.json",
      "timeout": 0,
      "sendEmpty": false,
      "requestDatatype": "JSON",
      "responseDatatype": "JSON",
      "headers": {},
      "responseObjects": [
        {
          "type": "default",
          "key": "",
          "mockFile": "mockdatafiles/applyDeviceRules-default.json"
        }
      ]
    }
  ]
}