{
  "content": [
    {
      "common": true,
      "custom": false,
      "direction": "DESC",
      "id": 7,
      "name": "string",
      "orderNumber": 6
    },
    {
      "common": false,
      "custom": true,
      "direction": "DESC",
      "id": 10,
      "name": "string",
      "orderNumber": 5
    }
  ],
  "pageNumber": 8,
  "pageSize": 2,
  "totalElements": 10,
  "totalPages": 7
}