{
  "alerts": [
    {
      "acknowledgedBy": "string",
      "alertFlowFalcon": {
        "alertId": 2,
        "directionId": 7,
        "filterId": 4,
        "id": 4,
        "interfaceId": 7,
        "netflowDeviceId": 5,
        "viewId": 9
      },
      "assignedTo": 2,
      "clearMessage": "string",
      "clearTime": 7,
      "closed": 6,
      "closedKey": 5,
      "comments": "string",
      "deviceId": 5,
      "endTime": 7,
      "id": 1,
      "ignoreComment": "string",
      "ignoreUid": 10,
      "ignoreUntil": 4,
      "indicatorId": 7,
      "isMaintenanceAlert": false,
      "lastProcessed": 6,
      "message": "string",
      "number": 6,
      "objectId": 7,
      "origin": "flow",
      "pluginName": "string",
      "pollId": 2,
      "severity": 9,
      "startTime": 5,
      "thresholdId": 2
    },
    {
      "acknowledgedBy": "string",
      "alertFlowFalcon": {
        "alertId": 7,
        "directionId": 6,
        "filterId": 3,
        "id": 8,
        "interfaceId": 1,
        "netflowDeviceId": 1,
        "viewId": 2
      },
      "assignedTo": 5,
      "clearMessage": "string",
      "clearTime": 4,
      "closed": 6,
      "closedKey": 4,
      "comments": "string",
      "deviceId": 3,
      "endTime": 9,
      "id": 2,
      "ignoreComment": "string",
      "ignoreUid": 1,
      "ignoreUntil": 8,
      "indicatorId": 6,
      "isMaintenanceAlert": false,
      "lastProcessed": 7,
      "message": "string",
      "number": 7,
      "objectId": 4,
      "origin": "system",
      "pluginName": "string",
      "pollId": 4,
      "severity": 2,
      "startTime": 9,
      "thresholdId": 4
    },
    {
      "acknowledgedBy": "string",
      "alertFlowFalcon": {
        "alertId": 4,
        "directionId": 2,
        "filterId": 2,
        "id": 4,
        "interfaceId": 2,
        "netflowDeviceId": 8,
        "viewId": 8
      },
      "assignedTo": 5,
      "clearMessage": "string",
      "clearTime": 6,
      "closed": 4,
      "closedKey": 10,
      "comments": "string",
      "deviceId": 8,
      "endTime": 1,
      "id": 3,
      "ignoreComment": "string",
      "ignoreUid": 4,
      "ignoreUntil": 5,
      "indicatorId": 10,
      "isMaintenanceAlert": false,
      "lastProcessed": 4,
      "message": "string",
      "number": 10,
      "objectId": 10,
      "origin": "system",
      "pluginName": "string",
      "pollId": 7,
      "severity": 8,
      "startTime": 9,
      "thresholdId": 6
    },
    {
      "acknowledgedBy": "string",
      "alertFlowFalcon": {
        "alertId": 10,
        "directionId": 8,
        "filterId": 6,
        "id": 6,
        "interfaceId": 6,
        "netflowDeviceId": 10,
        "viewId": 8
      },
      "assignedTo": 9,
      "clearMessage": "string",
      "clearTime": 7,
      "closed": 6,
      "closedKey": 10,
      "comments": "string",
      "deviceId": 3,
      "endTime": 10,
      "id": 10,
      "ignoreComment": "string",
      "ignoreUid": 6,
      "ignoreUntil": 3,
      "indicatorId": 10,
      "isMaintenanceAlert": false,
      "lastProcessed": 2,
      "message": "string",
      "number": 10,
      "objectId": 4,
      "origin": "system",
      "pluginName": "string",
      "pollId": 1,
      "severity": 5,
      "startTime": 4,
      "thresholdId": 7
    },
    {
      "acknowledgedBy": "string",
      "alertFlowFalcon": {
        "alertId": 1,
        "directionId": 3,
        "filterId": 6,
        "id": 5,
        "interfaceId": 3,
        "netflowDeviceId": 6,
        "viewId": 1
      },
      "assignedTo": 6,
      "clearMessage": "string",
      "clearTime": 1,
      "closed": 8,
      "closedKey": 3,
      "comments": "string",
      "deviceId": 1,
      "endTime": 5,
      "id": 8,
      "ignoreComment": "string",
      "ignoreUid": 10,
      "ignoreUntil": 5,
      "indicatorId": 3,
      "isMaintenanceAlert": false,
      "lastProcessed": 1,
      "message": "string",
      "number": 9,
      "objectId": 10,
      "origin": "flow",
      "pluginName": "string",
      "pollId": 6,
      "severity": 9,
      "startTime": 5,
      "thresholdId": 2
    },
    {
      "acknowledgedBy": "string",
      "alertFlowFalcon": {
        "alertId": 4,
        "directionId": 8,
        "filterId": 8,
        "id": 4,
        "interfaceId": 5,
        "netflowDeviceId": 5,
        "viewId": 4
      },
      "assignedTo": 10,
      "clearMessage": "string",
      "clearTime": 5,
      "closed": 2,
      "closedKey": 9,
      "comments": "string",
      "deviceId": 10,
      "endTime": 3,
      "id": 10,
      "ignoreComment": "string",
      "ignoreUid": 8,
      "ignoreUntil": 3,
      "indicatorId": 2,
      "isMaintenanceAlert": true,
      "lastProcessed": 7,
      "message": "string",
      "number": 10,
      "objectId": 9,
      "origin": "trap",
      "pluginName": "string",
      "pollId": 2,
      "severity": 3,
      "startTime": 8,
      "thresholdId": 2
    },
    {
      "acknowledgedBy": "string",
      "alertFlowFalcon": {
        "alertId": 2,
        "directionId": 5,
        "filterId": 10,
        "id": 4,
        "interfaceId": 4,
        "netflowDeviceId": 7,
        "viewId": 3
      },
      "assignedTo": 6,
      "clearMessage": "string",
      "clearTime": 5,
      "closed": 1,
      "closedKey": 6,
      "comments": "string",
      "deviceId": 7,
      "endTime": 4,
      "id": 3,
      "ignoreComment": "string",
      "ignoreUid": 3,
      "ignoreUntil": 3,
      "indicatorId": 9,
      "isMaintenanceAlert": false,
      "lastProcessed": 4,
      "message": "string",
      "number": 1,
      "objectId": 6,
      "origin": "trap",
      "pluginName": "string",
      "pollId": 9,
      "severity": 1,
      "startTime": 4,
      "thresholdId": 8
    },
    {
      "acknowledgedBy": "string",
      "alertFlowFalcon": {
        "alertId": 10,
        "directionId": 6,
        "filterId": 4,
        "id": 1,
        "interfaceId": 5,
        "netflowDeviceId": 6,
        "viewId": 10
      },
      "assignedTo": 7,
      "clearMessage": "string",
      "clearTime": 10,
      "closed": 3,
      "closedKey": 9,
      "comments": "string",
      "deviceId": 4,
      "endTime": 10,
      "id": 5,
      "ignoreComment": "string",
      "ignoreUid": 10,
      "ignoreUntil": 10,
      "indicatorId": 4,
      "isMaintenanceAlert": false,
      "lastProcessed": 1,
      "message": "string",
      "number": 10,
      "objectId": 1,
      "origin": "flow",
      "pluginName": "string",
      "pollId": 9,
      "severity": 9,
      "startTime": 5,
      "thresholdId": 8
    }
  ],
  "allowDelete": true,
  "alternateName": "string",
  "dateAdded": 2,
  "description": "string",
  "disableConcurrentPolling": true,
  "disablePolling": false,
  "disableThresholding": true,
  "id": 9,
  "ipAddress": "string",
  "isDeleted": true,
  "isNew": false,
  "lastDiscovery": 8,
  "manualIP": false,
  "name": "string",
  "numElements": 2,
  "objects": [
    {
      "alternateName": "string",
      "dateAdded": 2,
      "description": "string",
      "deviceId": 2,
      "enabled": {},
      "extendedInfo": {},
      "id": 5,
      "indicators": [
        {},
        {},
        {},
        {},
        {}
      ],
      "isDeleted": false,
      "isEnabled": false,
      "isVisible": true,
      "name": "string",
      "pluginId": 10,
      "pluginObjectTypeId": 3,
      "subtypeId": 9
    },
    {
      "alternateName": "string",
      "dateAdded": 9,
      "description": "string",
      "deviceId": 3,
      "enabled": {},
      "extendedInfo": {},
      "id": 1,
      "indicators": [
        {},
        {},
        {},
        {},
        {},
        {},
        {},
        {},
        {},
        {}
      ],
      "isDeleted": false,
      "isEnabled": false,
      "isVisible": true,
      "name": "string",
      "pluginId": 10,
      "pluginObjectTypeId": 9,
      "subtypeId": 7
    },
    {
      "alternateName": "string",
      "dateAdded": 1,
      "description": "string",
      "deviceId": 9,
      "enabled": {},
      "extendedInfo": {},
      "id": 4,
      "indicators": [
        {},
        {},
        {},
        {},
        {}
      ],
      "isDeleted": true,
      "isEnabled": true,
      "isVisible": false,
      "name": "string",
      "pluginId": 5,
      "pluginObjectTypeId": 7,
      "subtypeId": 6
    },
    {
      "alternateName": "string",
      "dateAdded": 5,
      "description": "string",
      "deviceId": 10,
      "enabled": {},
      "extendedInfo": {},
      "id": 2,
      "indicators": [
        {},
        {},
        {},
        {},
        {},
        {},
        {}
      ],
      "isDeleted": false,
      "isEnabled": true,
      "isVisible": false,
      "name": "string",
      "pluginId": 6,
      "pluginObjectTypeId": 5,
      "subtypeId": 10
    },
    {
      "alternateName": "string",
      "dateAdded": 9,
      "description": "string",
      "deviceId": 8,
      "enabled": {},
      "extendedInfo": {},
      "id": 8,
      "indicators": [
        {},
        {},
        {},
        {},
        {}
      ],
      "isDeleted": false,
      "isEnabled": true,
      "isVisible": true,
      "name": "string",
      "pluginId": 9,
      "pluginObjectTypeId": 7,
      "subtypeId": 3
    },
    {
      "alternateName": "string",
      "dateAdded": 8,
      "description": "string",
      "deviceId": 7,
      "enabled": {},
      "extendedInfo": {},
      "id": 1,
      "indicators": [
        {},
        {},
        {},
        {}
      ],
      "isDeleted": true,
      "isEnabled": true,
      "isVisible": false,
      "name": "string",
      "pluginId": 2,
      "pluginObjectTypeId": 1,
      "subtypeId": 8
    }
  ],
  "peerId": 7,
  "pluginInfo": {},
  "pluginManagerId": 10,
  "pollFrequency": 8,
  "timezone": "string",
  "workhoursGroupId": 5
}