{
  "actions": [
    {
      "name": "getObjectGroups",
      "protocol": "REST",
      "method": "GET",
      "entitypath": "{base_path}/{version}/objectgroups?{query}",
      "requestSchema": "schema.json",
      "responseSchema": "schema.json",
      "timeout": 0,
      "sendEmpty": false,
      "sendGetBody": false,
      "requestDatatype": "JSON",
      "responseDatatype": "JSON",
      "headers": {},
      "responseObjects": [
        {
          "type": "default",
          "key": "",
          "mockFile": "mockdatafiles/getObjectGroups-default.json"
        }
      ]
    },
    {
      "name": "createObjectGroup",
      "protocol": "REST",
      "method": "POST",
      "entitypath": "{base_path}/{version}/objectgroups?{query}",
      "requestSchema": "schema.json",
      "responseSchema": "schema.json",
      "timeout": 0,
      "sendEmpty": false,
      "requestDatatype": "JSON",
      "responseDatatype": "JSON",
      "headers": {},
      "responseObjects": [
        {
          "type": "default",
          "key": "",
          "mockFile": "mockdatafiles/createObjectGroup-default.json"
        }
      ]
    },
    {
      "name": "getAncestors",
      "protocol": "REST",
      "method": "GET",
      "entitypath": "{base_path}/{version}/objectgroups/ancestors/{pathv1}?{query}",
      "requestSchema": "schema.json",
      "responseSchema": "schema.json",
      "timeout": 0,
      "sendEmpty": false,
      "sendGetBody": false,
      "requestDatatype": "JSON",
      "responseDatatype": "JSON",
      "headers": {},
      "responseObjects": [
        {
          "type": "default",
          "key": "",
          "mockFile": "mockdatafiles/getAncestors-default.json"
        }
      ]
    },
    {
      "name": "findObjectGroup",
      "protocol": "REST",
      "method": "POST",
      "entitypath": "{base_path}/{version}/objectgroups/filter?{query}",
      "requestSchema": "schema.json",
      "responseSchema": "schema.json",
      "timeout": 0,
      "sendEmpty": false,
      "requestDatatype": "JSON",
      "responseDatatype": "JSON",
      "headers": {},
      "responseObjects": [
        {
          "type": "default",
          "key": "",
          "mockFile": "mockdatafiles/findObjectGroup-default.json"
        }
      ]
    },
    {
      "name": "filterObjectGroupMappings",
      "protocol": "REST",
      "method": "POST",
      "entitypath": "{base_path}/{version}/objectgroups/members/filter?{query}",
      "requestSchema": "schema.json",
      "responseSchema": "schema.json",
      "timeout": 0,
      "sendEmpty": false,
      "requestDatatype": "JSON",
      "responseDatatype": "JSON",
      "headers": {},
      "responseObjects": [
        {
          "type": "default",
          "key": "",
          "mockFile": "mockdatafiles/filterObjectGroupMappings-default.json"
        }
      ]
    },
    {
      "name": "getObjectGroupById",
      "protocol": "REST",
      "method": "GET",
      "entitypath": "{base_path}/{version}/objectgroups/{pathv1}?{query}",
      "requestSchema": "schema.json",
      "responseSchema": "schema.json",
      "timeout": 0,
      "sendEmpty": false,
      "sendGetBody": false,
      "requestDatatype": "JSON",
      "responseDatatype": "JSON",
      "headers": {},
      "responseObjects": [
        {
          "type": "default",
          "key": "",
          "mockFile": "mockdatafiles/getObjectGroupById-default.json"
        }
      ]
    },
    {
      "name": "updateObjectGroupById",
      "protocol": "REST",
      "method": "PUT",
      "entitypath": "{base_path}/{version}/objectgroups/{pathv1}?{query}",
      "requestSchema": "schema.json",
      "responseSchema": "schema.json",
      "timeout": 0,
      "sendEmpty": false,
      "requestDatatype": "JSON",
      "responseDatatype": "JSON",
      "headers": {},
      "responseObjects": [
        {
          "type": "default",
          "key": "",
          "mockFile": "mockdatafiles/updateObjectGroupById-default.json"
        }
      ]
    },
    {
      "name": "deleteObjectGroupById",
      "protocol": "REST",
      "method": "DELETE",
      "entitypath": "{base_path}/{version}/objectgroups/{pathv1}?{query}",
      "requestSchema": "schema.json",
      "responseSchema": "schema.json",
      "timeout": 0,
      "sendEmpty": false,
      "requestDatatype": "JSON",
      "responseDatatype": "JSON",
      "headers": {},
      "responseObjects": [
        {
          "type": "default",
          "key": "",
          "mockFile": "mockdatafiles/deleteObjectGroupById-default.json"
        }
      ]
    },
    {
      "name": "partiallyUpdateObjectGroupById",
      "protocol": "REST",
      "method": "PATCH",
      "entitypath": "{base_path}/{version}/objectgroups/{pathv1}?{query}",
      "requestSchema": "schema.json",
      "responseSchema": "schema.json",
      "timeout": 0,
      "sendEmpty": false,
      "requestDatatype": "JSON",
      "responseDatatype": "JSON",
      "headers": {},
      "responseObjects": [
        {
          "type": "default",
          "key": "",
          "mockFile": "mockdatafiles/partiallyUpdateObjectGroupById-default.json"
        }
      ]
    },
    {
      "name": "getApiV2ObjectgroupsIdAncestors",
      "protocol": "REST",
      "method": "GET",
      "entitypath": "{base_path}/{version}/objectgroups/{pathv1}/ancestors?{query}",
      "requestSchema": "schema.json",
      "responseSchema": "schema.json",
      "timeout": 0,
      "sendEmpty": false,
      "sendGetBody": false,
      "requestDatatype": "JSON",
      "responseDatatype": "JSON",
      "headers": {},
      "responseObjects": [
        {
          "type": "default",
          "key": "",
          "mockFile": "mockdatafiles/getApiV2ObjectgroupsIdAncestors-default.json"
        }
      ]
    },
    {
      "name": "getObjectGroupMappings",
      "protocol": "REST",
      "method": "GET",
      "entitypath": "{base_path}/{version}/objectgroups/{pathv1}/members?{query}",
      "requestSchema": "schema.json",
      "responseSchema": "schema.json",
      "timeout": 0,
      "sendEmpty": false,
      "sendGetBody": false,
      "requestDatatype": "JSON",
      "responseDatatype": "JSON",
      "headers": {},
      "responseObjects": [
        {
          "type": "default",
          "key": "",
          "mockFile": "mockdatafiles/getObjectGroupMappings-default.json"
        }
      ]
    },
    {
      "name": "addObjectGroupMember",
      "protocol": "REST",
      "method": "POST",
      "entitypath": "{base_path}/{version}/objectgroups/{pathv1}/members?{query}",
      "requestSchema": "schema.json",
      "responseSchema": "schema.json",
      "timeout": 0,
      "sendEmpty": false,
      "requestDatatype": "JSON",
      "responseDatatype": "JSON",
      "headers": {},
      "responseObjects": [
        {
          "type": "default",
          "key": "",
          "mockFile": ""
        }
      ]
    },
    {
      "name": "removeObjectGroupMember",
      "protocol": "REST",
      "method": "DELETE",
      "entitypath": "{base_path}/{version}/objectgroups/{pathv1}/members?{query}",
      "requestSchema": "schema.json",
      "responseSchema": "schema.json",
      "timeout": 0,
      "sendEmpty": false,
      "requestDatatype": "JSON",
      "responseDatatype": "JSON",
      "headers": {},
      "responseObjects": [
        {
          "type": "default",
          "key": "",
          "mockFile": ""
        }
      ]
    }
  ]
}