{
  "actions": [
    {
      "name": "getWorkHours",
      "protocol": "REST",
      "method": "GET",
      "entitypath": "{base_path}/{version}/workhours?{query}",
      "requestSchema": "schema.json",
      "responseSchema": "schema.json",
      "timeout": 0,
      "sendEmpty": false,
      "sendGetBody": false,
      "requestDatatype": "JSON",
      "responseDatatype": "JSON",
      "headers": {},
      "responseObjects": [
        {
          "type": "default",
          "key": "",
          "mockFile": "mockdatafiles/getWorkHours-default.json"
        }
      ]
    },
    {
      "name": "createWorkHours",
      "protocol": "REST",
      "method": "POST",
      "entitypath": "{base_path}/{version}/workhours?{query}",
      "requestSchema": "schema.json",
      "responseSchema": "schema.json",
      "timeout": 0,
      "sendEmpty": false,
      "requestDatatype": "JSON",
      "responseDatatype": "JSON",
      "headers": {},
      "responseObjects": [
        {
          "type": "default",
          "key": "",
          "mockFile": "mockdatafiles/createWorkHours-default.json"
        }
      ]
    },
    {
      "name": "getWorkHoursByGroup",
      "protocol": "REST",
      "method": "GET",
      "entitypath": "{base_path}/{version}/workhours/{pathv1}?{query}",
      "requestSchema": "schema.json",
      "responseSchema": "schema.json",
      "timeout": 0,
      "sendEmpty": false,
      "sendGetBody": false,
      "requestDatatype": "JSON",
      "responseDatatype": "JSON",
      "headers": {},
      "responseObjects": [
        {
          "type": "default",
          "key": "",
          "mockFile": "mockdatafiles/getWorkHoursByGroup-default.json"
        }
      ]
    },
    {
      "name": "updateWorkHoursByGroupId",
      "protocol": "REST",
      "method": "PUT",
      "entitypath": "{base_path}/{version}/workhours/{pathv1}?{query}",
      "requestSchema": "schema.json",
      "responseSchema": "schema.json",
      "timeout": 0,
      "sendEmpty": false,
      "requestDatatype": "JSON",
      "responseDatatype": "JSON",
      "headers": {},
      "responseObjects": [
        {
          "type": "default",
          "key": "",
          "mockFile": "mockdatafiles/updateWorkHoursByGroupId-default.json"
        }
      ]
    },
    {
      "name": "deleteWorkHoursGroupById",
      "protocol": "REST",
      "method": "DELETE",
      "entitypath": "{base_path}/{version}/workhours/{pathv1}?{query}",
      "requestSchema": "schema.json",
      "responseSchema": "schema.json",
      "timeout": 0,
      "sendEmpty": false,
      "requestDatatype": "JSON",
      "responseDatatype": "JSON",
      "headers": {},
      "responseObjects": [
        {
          "type": "default",
          "key": "",
          "mockFile": "mockdatafiles/deleteWorkHoursGroupById-default.json"
        }
      ]
    }
  ]
}