{
  "content": [
    {
      "id": 7,
      "name": "string",
      "originIp": "string",
      "overrideName": 6,
      "peer": 10,
      "systemName": "string",
      "versions": "string",
      "visible": 6
    },
    {
      "id": 2,
      "name": "string",
      "originIp": "string",
      "overrideName": 10,
      "peer": 4,
      "systemName": "string",
      "versions": "string",
      "visible": 8
    },
    {
      "id": 3,
      "name": "string",
      "originIp": "string",
      "overrideName": 6,
      "peer": 5,
      "systemName": "string",
      "versions": "string",
      "visible": 5
    },
    {
      "id": 4,
      "name": "string",
      "originIp": "string",
      "overrideName": 2,
      "peer": 8,
      "systemName": "string",
      "versions": "string",
      "visible": 6
    }
  ],
  "pageNumber": 6,
  "pageSize": 1,
  "totalElements": 4,
  "totalPages": 4
}