{
  "attachmentType": "TOPOLOGY",
  "result": [
    {
      "baselineData": {
        "avgY": 6,
        "data": [
          {
            "focus": 8,
            "time": 7,
            "value": 4
          }
        ],
        "maxX": 3,
        "maxY": 10,
        "maxYCap": 8,
        "minX": 9,
        "minY": 6,
        "percentiles": 8,
        "postData": {
          "focus": {},
          "time": {},
          "value": {}
        },
        "preData": {
          "focus": {},
          "time": {},
          "value": {}
        },
        "total": 7,
        "trendValueA": 1,
        "trendValueB": 6,
        "unit": "string"
      },
      "deviceId": 7,
      "deviceName": "string",
      "frequency": 6,
      "indicatorData": {
        "avgY": 5,
        "data": [
          {
            "focus": 9,
            "time": 3,
            "value": 8
          },
          {
            "focus": 6,
            "time": 6,
            "value": 10
          },
          {
            "focus": 9,
            "time": 3,
            "value": 3
          },
          {
            "focus": 5,
            "time": 10,
            "value": 9
          },
          {
            "focus": 4,
            "time": 8,
            "value": 2
          },
          {
            "focus": 3,
            "time": 5,
            "value": 9
          },
          {
            "focus": 4,
            "time": 9,
            "value": 4
          }
        ],
        "maxX": 10,
        "maxY": 7,
        "maxYCap": 3,
        "minX": 8,
        "minY": 3,
        "percentiles": 3,
        "postData": {
          "focus": {},
          "time": {},
          "value": {}
        },
        "preData": {
          "focus": {},
          "time": {},
          "value": {}
        },
        "total": 2,
        "trendValueA": 1,
        "trendValueB": 3,
        "unit": "string"
      },
      "indicatorId": 10,
      "indicatorName": "string",
      "indicatorTypeDescription": "string",
      "indicatorTypeId": 5,
      "objectDescription": "string",
      "objectId": 9,
      "objectName": "string",
      "pluginId": 4,
      "pluginName": "string",
      "sigmaData": {
        "avgY": 6,
        "data": [
          {
            "focus": 4,
            "time": 4,
            "value": 8
          },
          {
            "focus": 10,
            "time": 10,
            "value": 10
          },
          {
            "focus": 7,
            "time": 4,
            "value": 9
          },
          {
            "focus": 4,
            "time": 1,
            "value": 2
          },
          {
            "focus": 8,
            "time": 10,
            "value": 10
          }
        ],
        "maxX": 1,
        "maxY": 2,
        "maxYCap": 3,
        "minX": 8,
        "minY": 1,
        "percentiles": 4,
        "postData": {
          "focus": {},
          "time": {},
          "value": {}
        },
        "preData": {
          "focus": {},
          "time": {},
          "value": {}
        },
        "total": 6,
        "trendValueA": 6,
        "trendValueB": 7,
        "unit": "string"
      },
      "timeOverTimeData": {
        "avgY": 3,
        "data": [
          {
            "focus": 1,
            "time": 5,
            "value": 6
          },
          {
            "focus": 7,
            "time": 2,
            "value": 3
          },
          {
            "focus": 10,
            "time": 8,
            "value": 3
          }
        ],
        "maxX": 4,
        "maxY": 6,
        "maxYCap": 4,
        "minX": 2,
        "minY": 10,
        "percentiles": 8,
        "postData": {
          "focus": {},
          "time": {},
          "value": {}
        },
        "preData": {
          "focus": {},
          "time": {},
          "value": {}
        },
        "total": 8,
        "trendValueA": 5,
        "trendValueB": 1,
        "unit": "string"
      }
    },
    {
      "baselineData": {
        "avgY": 1,
        "data": [
          {
            "focus": 4,
            "time": 7,
            "value": 8
          },
          {
            "focus": 2,
            "time": 5,
            "value": 3
          }
        ],
        "maxX": 8,
        "maxY": 2,
        "maxYCap": 3,
        "minX": 5,
        "minY": 6,
        "percentiles": 8,
        "postData": {
          "focus": {},
          "time": {},
          "value": {}
        },
        "preData": {
          "focus": {},
          "time": {},
          "value": {}
        },
        "total": 5,
        "trendValueA": 7,
        "trendValueB": 5,
        "unit": "string"
      },
      "deviceId": 1,
      "deviceName": "string",
      "frequency": 8,
      "indicatorData": {
        "avgY": 8,
        "data": [
          {
            "focus": 9,
            "time": 2,
            "value": 6
          },
          {
            "focus": 5,
            "time": 4,
            "value": 1
          },
          {
            "focus": 9,
            "time": 3,
            "value": 9
          },
          {
            "focus": 5,
            "time": 1,
            "value": 6
          },
          {
            "focus": 1,
            "time": 7,
            "value": 3
          },
          {
            "focus": 10,
            "time": 10,
            "value": 10
          },
          {
            "focus": 6,
            "time": 2,
            "value": 10
          },
          {
            "focus": 3,
            "time": 9,
            "value": 10
          }
        ],
        "maxX": 2,
        "maxY": 6,
        "maxYCap": 10,
        "minX": 3,
        "minY": 5,
        "percentiles": 6,
        "postData": {
          "focus": {},
          "time": {},
          "value": {}
        },
        "preData": {
          "focus": {},
          "time": {},
          "value": {}
        },
        "total": 3,
        "trendValueA": 10,
        "trendValueB": 8,
        "unit": "string"
      },
      "indicatorId": 5,
      "indicatorName": "string",
      "indicatorTypeDescription": "string",
      "indicatorTypeId": 8,
      "objectDescription": "string",
      "objectId": 1,
      "objectName": "string",
      "pluginId": 7,
      "pluginName": "string",
      "sigmaData": {
        "avgY": 6,
        "data": [
          {
            "focus": 2,
            "time": 1,
            "value": 8
          },
          {
            "focus": 4,
            "time": 4,
            "value": 5
          },
          {
            "focus": 8,
            "time": 4,
            "value": 8
          },
          {
            "focus": 6,
            "time": 8,
            "value": 2
          },
          {
            "focus": 7,
            "time": 6,
            "value": 1
          }
        ],
        "maxX": 1,
        "maxY": 2,
        "maxYCap": 6,
        "minX": 6,
        "minY": 10,
        "percentiles": 6,
        "postData": {
          "focus": {},
          "time": {},
          "value": {}
        },
        "preData": {
          "focus": {},
          "time": {},
          "value": {}
        },
        "total": 1,
        "trendValueA": 7,
        "trendValueB": 7,
        "unit": "string"
      },
      "timeOverTimeData": {
        "avgY": 1,
        "data": [
          {
            "focus": 9,
            "time": 8,
            "value": 2
          },
          {
            "focus": 7,
            "time": 4,
            "value": 7
          }
        ],
        "maxX": 7,
        "maxY": 9,
        "maxYCap": 4,
        "minX": 2,
        "minY": 3,
        "percentiles": 6,
        "postData": {
          "focus": {},
          "time": {},
          "value": {}
        },
        "preData": {
          "focus": {},
          "time": {},
          "value": {}
        },
        "total": 1,
        "trendValueA": 1,
        "trendValueB": 5,
        "unit": "string"
      }
    },
    {
      "baselineData": {
        "avgY": 5,
        "data": [
          {
            "focus": 6,
            "time": 5,
            "value": 10
          },
          {
            "focus": 9,
            "time": 2,
            "value": 9
          },
          {
            "focus": 4,
            "time": 10,
            "value": 9
          }
        ],
        "maxX": 1,
        "maxY": 2,
        "maxYCap": 3,
        "minX": 5,
        "minY": 5,
        "percentiles": 9,
        "postData": {
          "focus": {},
          "time": {},
          "value": {}
        },
        "preData": {
          "focus": {},
          "time": {},
          "value": {}
        },
        "total": 2,
        "trendValueA": 10,
        "trendValueB": 10,
        "unit": "string"
      },
      "deviceId": 3,
      "deviceName": "string",
      "frequency": 10,
      "indicatorData": {
        "avgY": 6,
        "data": [
          {
            "focus": 8,
            "time": 8,
            "value": 10
          },
          {
            "focus": 3,
            "time": 9,
            "value": 3
          },
          {
            "focus": 8,
            "time": 8,
            "value": 4
          },
          {
            "focus": 2,
            "time": 2,
            "value": 4
          },
          {
            "focus": 10,
            "time": 10,
            "value": 9
          }
        ],
        "maxX": 3,
        "maxY": 8,
        "maxYCap": 6,
        "minX": 8,
        "minY": 8,
        "percentiles": 5,
        "postData": {
          "focus": {},
          "time": {},
          "value": {}
        },
        "preData": {
          "focus": {},
          "time": {},
          "value": {}
        },
        "total": 3,
        "trendValueA": 1,
        "trendValueB": 7,
        "unit": "string"
      },
      "indicatorId": 3,
      "indicatorName": "string",
      "indicatorTypeDescription": "string",
      "indicatorTypeId": 3,
      "objectDescription": "string",
      "objectId": 2,
      "objectName": "string",
      "pluginId": 7,
      "pluginName": "string",
      "sigmaData": {
        "avgY": 9,
        "data": [
          {
            "focus": 2,
            "time": 2,
            "value": 4
          },
          {
            "focus": 1,
            "time": 8,
            "value": 8
          },
          {
            "focus": 6,
            "time": 1,
            "value": 4
          },
          {
            "focus": 9,
            "time": 10,
            "value": 10
          },
          {
            "focus": 7,
            "time": 6,
            "value": 3
          },
          {
            "focus": 1,
            "time": 9,
            "value": 8
          },
          {
            "focus": 3,
            "time": 8,
            "value": 5
          }
        ],
        "maxX": 8,
        "maxY": 6,
        "maxYCap": 3,
        "minX": 6,
        "minY": 6,
        "percentiles": 7,
        "postData": {
          "focus": {},
          "time": {},
          "value": {}
        },
        "preData": {
          "focus": {},
          "time": {},
          "value": {}
        },
        "total": 8,
        "trendValueA": 4,
        "trendValueB": 8,
        "unit": "string"
      },
      "timeOverTimeData": {
        "avgY": 3,
        "data": [
          {
            "focus": 1,
            "time": 3,
            "value": 1
          },
          {
            "focus": 8,
            "time": 1,
            "value": 4
          },
          {
            "focus": 4,
            "time": 7,
            "value": 7
          },
          {
            "focus": 9,
            "time": 7,
            "value": 2
          },
          {
            "focus": 10,
            "time": 10,
            "value": 10
          }
        ],
        "maxX": 3,
        "maxY": 7,
        "maxYCap": 1,
        "minX": 3,
        "minY": 9,
        "percentiles": 7,
        "postData": {
          "focus": {},
          "time": {},
          "value": {}
        },
        "preData": {
          "focus": {},
          "time": {},
          "value": {}
        },
        "total": 7,
        "trendValueA": 2,
        "trendValueB": 1,
        "unit": "string"
      }
    }
  ],
  "timeRanges": [
    {
      "endTime": 7,
      "name": "string",
      "startTime": 10
    },
    {
      "endTime": 8,
      "name": "string",
      "startTime": 1
    },
    {
      "endTime": 5,
      "name": "string",
      "startTime": 2
    },
    {
      "endTime": 10,
      "name": "string",
      "startTime": 1
    },
    {
      "endTime": 4,
      "name": "string",
      "startTime": 3
    },
    {
      "endTime": 10,
      "name": "string",
      "startTime": 6
    },
    {
      "endTime": 4,
      "name": "string",
      "startTime": 4
    },
    {
      "endTime": 6,
      "name": "string",
      "startTime": 6
    },
    {
      "endTime": 3,
      "name": "string",
      "startTime": 7
    }
  ]
}