{
  "table": {
    "column": {
      "exclude": [
        "string"
      ],
      "include": [
        "string",
        "string"
      ]
    },
    "dataPresentation": {
      "formatNumbers": true,
      "precision": 10
    },
    "table": {
      "blockVis": true,
      "hideHeaders": false,
      "wrapCells": true
    }
  }
}