{
  "deviceType": {
    "id": 9,
    "name": "string",
    "parentId": 10
  },
  "devices": [
    {
      "allowDelete": true,
      "alternateName": "string",
      "dateAdded": 5,
      "description": "string",
      "disableConcurrentPolling": true,
      "disablePolling": true,
      "disableThresholding": false,
      "id": 4,
      "ipAddress": "string",
      "isDeleted": false,
      "isNew": false,
      "lastDiscovery": 3,
      "manualIP": false,
      "name": "string",
      "numElements": 3,
      "objects": [
        {
          "alternateName": "string",
          "dateAdded": 5,
          "description": "string",
          "deviceId": 6,
          "enabled": {},
          "extendedInfo": {},
          "id": 1,
          "indicators": [
            {},
            {},
            {},
            {}
          ],
          "isDeleted": true,
          "isEnabled": false,
          "isVisible": false,
          "name": "string",
          "pluginId": 6,
          "pluginObjectTypeId": 10,
          "subtypeId": 9
        },
        {
          "alternateName": "string",
          "dateAdded": 1,
          "description": "string",
          "deviceId": 1,
          "enabled": {},
          "extendedInfo": {},
          "id": 7,
          "indicators": [
            {},
            {},
            {},
            {},
            {},
            {},
            {},
            {},
            {},
            {}
          ],
          "isDeleted": false,
          "isEnabled": false,
          "isVisible": true,
          "name": "string",
          "pluginId": 4,
          "pluginObjectTypeId": 3,
          "subtypeId": 6
        },
        {
          "alternateName": "string",
          "dateAdded": 5,
          "description": "string",
          "deviceId": 3,
          "enabled": {},
          "extendedInfo": {},
          "id": 1,
          "indicators": [
            {},
            {},
            {},
            {},
            {},
            {},
            {},
            {}
          ],
          "isDeleted": false,
          "isEnabled": true,
          "isVisible": false,
          "name": "string",
          "pluginId": 3,
          "pluginObjectTypeId": 3,
          "subtypeId": 10
        },
        {
          "alternateName": "string",
          "dateAdded": 7,
          "description": "string",
          "deviceId": 3,
          "enabled": {},
          "extendedInfo": {},
          "id": 2,
          "indicators": [
            {},
            {},
            {},
            {}
          ],
          "isDeleted": true,
          "isEnabled": false,
          "isVisible": true,
          "name": "string",
          "pluginId": 4,
          "pluginObjectTypeId": 6,
          "subtypeId": 10
        }
      ],
      "peerId": 7,
      "pluginInfo": {},
      "pluginManagerId": 4,
      "pollFrequency": 6,
      "timezone": "string",
      "workhoursGroupId": 7
    }
  ],
  "objectTypes": [
    {
      "extendedInfo": {},
      "id": 1,
      "indicatorTypes": [
        {
          "allowMaximumValue": {},
          "dataUnits": {},
          "description": {},
          "displayUnits": {},
          "extendedInfo": {},
          "format": {},
          "id": {},
          "isDefault": {},
          "isEnabled": {},
          "name": {},
          "pluginId": {},
          "pluginObjectTypeId": {},
          "syntheticExpression": {},
          "syntheticMaximumExpression": {}
        },
        {
          "allowMaximumValue": {},
          "dataUnits": {},
          "description": {},
          "displayUnits": {},
          "extendedInfo": {},
          "format": {},
          "id": {},
          "isDefault": {},
          "isEnabled": {},
          "name": {},
          "pluginId": {},
          "pluginObjectTypeId": {},
          "syntheticExpression": {},
          "syntheticMaximumExpression": {}
        }
      ],
      "isEditable": true,
      "isEnabled": false,
      "name": "string",
      "objectTypes": [
        {
          "extendedInfo": {},
          "id": {},
          "indicatorTypes": {},
          "isEditable": {},
          "isEnabled": {},
          "name": {},
          "objectTypes": {},
          "parentObjectTypeId": {},
          "pluginId": {}
        },
        {
          "extendedInfo": {},
          "id": {},
          "indicatorTypes": {},
          "isEditable": {},
          "isEnabled": {},
          "name": {},
          "objectTypes": {},
          "parentObjectTypeId": {},
          "pluginId": {}
        },
        {
          "extendedInfo": {},
          "id": {},
          "indicatorTypes": {},
          "isEditable": {},
          "isEnabled": {},
          "name": {},
          "objectTypes": {},
          "parentObjectTypeId": {},
          "pluginId": {}
        },
        {
          "extendedInfo": {},
          "id": {},
          "indicatorTypes": {},
          "isEditable": {},
          "isEnabled": {},
          "name": {},
          "objectTypes": {},
          "parentObjectTypeId": {},
          "pluginId": {}
        }
      ],
      "parentObjectTypeId": 6,
      "pluginId": 10
    },
    {
      "extendedInfo": {},
      "id": 7,
      "indicatorTypes": [
        {
          "allowMaximumValue": {},
          "dataUnits": {},
          "description": {},
          "displayUnits": {},
          "extendedInfo": {},
          "format": {},
          "id": {},
          "isDefault": {},
          "isEnabled": {},
          "name": {},
          "pluginId": {},
          "pluginObjectTypeId": {},
          "syntheticExpression": {},
          "syntheticMaximumExpression": {}
        },
        {
          "allowMaximumValue": {},
          "dataUnits": {},
          "description": {},
          "displayUnits": {},
          "extendedInfo": {},
          "format": {},
          "id": {},
          "isDefault": {},
          "isEnabled": {},
          "name": {},
          "pluginId": {},
          "pluginObjectTypeId": {},
          "syntheticExpression": {},
          "syntheticMaximumExpression": {}
        },
        {
          "allowMaximumValue": {},
          "dataUnits": {},
          "description": {},
          "displayUnits": {},
          "extendedInfo": {},
          "format": {},
          "id": {},
          "isDefault": {},
          "isEnabled": {},
          "name": {},
          "pluginId": {},
          "pluginObjectTypeId": {},
          "syntheticExpression": {},
          "syntheticMaximumExpression": {}
        },
        {
          "allowMaximumValue": {},
          "dataUnits": {},
          "description": {},
          "displayUnits": {},
          "extendedInfo": {},
          "format": {},
          "id": {},
          "isDefault": {},
          "isEnabled": {},
          "name": {},
          "pluginId": {},
          "pluginObjectTypeId": {},
          "syntheticExpression": {},
          "syntheticMaximumExpression": {}
        },
        {
          "allowMaximumValue": {},
          "dataUnits": {},
          "description": {},
          "displayUnits": {},
          "extendedInfo": {},
          "format": {},
          "id": {},
          "isDefault": {},
          "isEnabled": {},
          "name": {},
          "pluginId": {},
          "pluginObjectTypeId": {},
          "syntheticExpression": {},
          "syntheticMaximumExpression": {}
        },
        {
          "allowMaximumValue": {},
          "dataUnits": {},
          "description": {},
          "displayUnits": {},
          "extendedInfo": {},
          "format": {},
          "id": {},
          "isDefault": {},
          "isEnabled": {},
          "name": {},
          "pluginId": {},
          "pluginObjectTypeId": {},
          "syntheticExpression": {},
          "syntheticMaximumExpression": {}
        }
      ],
      "isEditable": false,
      "isEnabled": true,
      "name": "string",
      "objectTypes": [
        {
          "extendedInfo": {},
          "id": {},
          "indicatorTypes": {},
          "isEditable": {},
          "isEnabled": {},
          "name": {},
          "objectTypes": {},
          "parentObjectTypeId": {},
          "pluginId": {}
        },
        {
          "extendedInfo": {},
          "id": {},
          "indicatorTypes": {},
          "isEditable": {},
          "isEnabled": {},
          "name": {},
          "objectTypes": {},
          "parentObjectTypeId": {},
          "pluginId": {}
        }
      ],
      "parentObjectTypeId": 10,
      "pluginId": 4
    },
    {
      "extendedInfo": {},
      "id": 4,
      "indicatorTypes": [
        {
          "allowMaximumValue": {},
          "dataUnits": {},
          "description": {},
          "displayUnits": {},
          "extendedInfo": {},
          "format": {},
          "id": {},
          "isDefault": {},
          "isEnabled": {},
          "name": {},
          "pluginId": {},
          "pluginObjectTypeId": {},
          "syntheticExpression": {},
          "syntheticMaximumExpression": {}
        },
        {
          "allowMaximumValue": {},
          "dataUnits": {},
          "description": {},
          "displayUnits": {},
          "extendedInfo": {},
          "format": {},
          "id": {},
          "isDefault": {},
          "isEnabled": {},
          "name": {},
          "pluginId": {},
          "pluginObjectTypeId": {},
          "syntheticExpression": {},
          "syntheticMaximumExpression": {}
        },
        {
          "allowMaximumValue": {},
          "dataUnits": {},
          "description": {},
          "displayUnits": {},
          "extendedInfo": {},
          "format": {},
          "id": {},
          "isDefault": {},
          "isEnabled": {},
          "name": {},
          "pluginId": {},
          "pluginObjectTypeId": {},
          "syntheticExpression": {},
          "syntheticMaximumExpression": {}
        }
      ],
      "isEditable": false,
      "isEnabled": false,
      "name": "string",
      "objectTypes": [
        {
          "extendedInfo": {},
          "id": {},
          "indicatorTypes": {},
          "isEditable": {},
          "isEnabled": {},
          "name": {},
          "objectTypes": {},
          "parentObjectTypeId": {},
          "pluginId": {}
        },
        {
          "extendedInfo": {},
          "id": {},
          "indicatorTypes": {},
          "isEditable": {},
          "isEnabled": {},
          "name": {},
          "objectTypes": {},
          "parentObjectTypeId": {},
          "pluginId": {}
        },
        {
          "extendedInfo": {},
          "id": {},
          "indicatorTypes": {},
          "isEditable": {},
          "isEnabled": {},
          "name": {},
          "objectTypes": {},
          "parentObjectTypeId": {},
          "pluginId": {}
        }
      ],
      "parentObjectTypeId": 6,
      "pluginId": 9
    },
    {
      "extendedInfo": {},
      "id": 2,
      "indicatorTypes": [
        {
          "allowMaximumValue": {},
          "dataUnits": {},
          "description": {},
          "displayUnits": {},
          "extendedInfo": {},
          "format": {},
          "id": {},
          "isDefault": {},
          "isEnabled": {},
          "name": {},
          "pluginId": {},
          "pluginObjectTypeId": {},
          "syntheticExpression": {},
          "syntheticMaximumExpression": {}
        },
        {
          "allowMaximumValue": {},
          "dataUnits": {},
          "description": {},
          "displayUnits": {},
          "extendedInfo": {},
          "format": {},
          "id": {},
          "isDefault": {},
          "isEnabled": {},
          "name": {},
          "pluginId": {},
          "pluginObjectTypeId": {},
          "syntheticExpression": {},
          "syntheticMaximumExpression": {}
        },
        {
          "allowMaximumValue": {},
          "dataUnits": {},
          "description": {},
          "displayUnits": {},
          "extendedInfo": {},
          "format": {},
          "id": {},
          "isDefault": {},
          "isEnabled": {},
          "name": {},
          "pluginId": {},
          "pluginObjectTypeId": {},
          "syntheticExpression": {},
          "syntheticMaximumExpression": {}
        },
        {
          "allowMaximumValue": {},
          "dataUnits": {},
          "description": {},
          "displayUnits": {},
          "extendedInfo": {},
          "format": {},
          "id": {},
          "isDefault": {},
          "isEnabled": {},
          "name": {},
          "pluginId": {},
          "pluginObjectTypeId": {},
          "syntheticExpression": {},
          "syntheticMaximumExpression": {}
        },
        {
          "allowMaximumValue": {},
          "dataUnits": {},
          "description": {},
          "displayUnits": {},
          "extendedInfo": {},
          "format": {},
          "id": {},
          "isDefault": {},
          "isEnabled": {},
          "name": {},
          "pluginId": {},
          "pluginObjectTypeId": {},
          "syntheticExpression": {},
          "syntheticMaximumExpression": {}
        },
        {
          "allowMaximumValue": {},
          "dataUnits": {},
          "description": {},
          "displayUnits": {},
          "extendedInfo": {},
          "format": {},
          "id": {},
          "isDefault": {},
          "isEnabled": {},
          "name": {},
          "pluginId": {},
          "pluginObjectTypeId": {},
          "syntheticExpression": {},
          "syntheticMaximumExpression": {}
        },
        {
          "allowMaximumValue": {},
          "dataUnits": {},
          "description": {},
          "displayUnits": {},
          "extendedInfo": {},
          "format": {},
          "id": {},
          "isDefault": {},
          "isEnabled": {},
          "name": {},
          "pluginId": {},
          "pluginObjectTypeId": {},
          "syntheticExpression": {},
          "syntheticMaximumExpression": {}
        }
      ],
      "isEditable": true,
      "isEnabled": false,
      "name": "string",
      "objectTypes": [
        {
          "extendedInfo": {},
          "id": {},
          "indicatorTypes": {},
          "isEditable": {},
          "isEnabled": {},
          "name": {},
          "objectTypes": {},
          "parentObjectTypeId": {},
          "pluginId": {}
        },
        {
          "extendedInfo": {},
          "id": {},
          "indicatorTypes": {},
          "isEditable": {},
          "isEnabled": {},
          "name": {},
          "objectTypes": {},
          "parentObjectTypeId": {},
          "pluginId": {}
        },
        {
          "extendedInfo": {},
          "id": {},
          "indicatorTypes": {},
          "isEditable": {},
          "isEnabled": {},
          "name": {},
          "objectTypes": {},
          "parentObjectTypeId": {},
          "pluginId": {}
        },
        {
          "extendedInfo": {},
          "id": {},
          "indicatorTypes": {},
          "isEditable": {},
          "isEnabled": {},
          "name": {},
          "objectTypes": {},
          "parentObjectTypeId": {},
          "pluginId": {}
        },
        {
          "extendedInfo": {},
          "id": {},
          "indicatorTypes": {},
          "isEditable": {},
          "isEnabled": {},
          "name": {},
          "objectTypes": {},
          "parentObjectTypeId": {},
          "pluginId": {}
        },
        {
          "extendedInfo": {},
          "id": {},
          "indicatorTypes": {},
          "isEditable": {},
          "isEnabled": {},
          "name": {},
          "objectTypes": {},
          "parentObjectTypeId": {},
          "pluginId": {}
        }
      ],
      "parentObjectTypeId": 7,
      "pluginId": 9
    },
    {
      "extendedInfo": {},
      "id": 8,
      "indicatorTypes": [
        {
          "allowMaximumValue": {},
          "dataUnits": {},
          "description": {},
          "displayUnits": {},
          "extendedInfo": {},
          "format": {},
          "id": {},
          "isDefault": {},
          "isEnabled": {},
          "name": {},
          "pluginId": {},
          "pluginObjectTypeId": {},
          "syntheticExpression": {},
          "syntheticMaximumExpression": {}
        },
        {
          "allowMaximumValue": {},
          "dataUnits": {},
          "description": {},
          "displayUnits": {},
          "extendedInfo": {},
          "format": {},
          "id": {},
          "isDefault": {},
          "isEnabled": {},
          "name": {},
          "pluginId": {},
          "pluginObjectTypeId": {},
          "syntheticExpression": {},
          "syntheticMaximumExpression": {}
        },
        {
          "allowMaximumValue": {},
          "dataUnits": {},
          "description": {},
          "displayUnits": {},
          "extendedInfo": {},
          "format": {},
          "id": {},
          "isDefault": {},
          "isEnabled": {},
          "name": {},
          "pluginId": {},
          "pluginObjectTypeId": {},
          "syntheticExpression": {},
          "syntheticMaximumExpression": {}
        },
        {
          "allowMaximumValue": {},
          "dataUnits": {},
          "description": {},
          "displayUnits": {},
          "extendedInfo": {},
          "format": {},
          "id": {},
          "isDefault": {},
          "isEnabled": {},
          "name": {},
          "pluginId": {},
          "pluginObjectTypeId": {},
          "syntheticExpression": {},
          "syntheticMaximumExpression": {}
        },
        {
          "allowMaximumValue": {},
          "dataUnits": {},
          "description": {},
          "displayUnits": {},
          "extendedInfo": {},
          "format": {},
          "id": {},
          "isDefault": {},
          "isEnabled": {},
          "name": {},
          "pluginId": {},
          "pluginObjectTypeId": {},
          "syntheticExpression": {},
          "syntheticMaximumExpression": {}
        },
        {
          "allowMaximumValue": {},
          "dataUnits": {},
          "description": {},
          "displayUnits": {},
          "extendedInfo": {},
          "format": {},
          "id": {},
          "isDefault": {},
          "isEnabled": {},
          "name": {},
          "pluginId": {},
          "pluginObjectTypeId": {},
          "syntheticExpression": {},
          "syntheticMaximumExpression": {}
        },
        {
          "allowMaximumValue": {},
          "dataUnits": {},
          "description": {},
          "displayUnits": {},
          "extendedInfo": {},
          "format": {},
          "id": {},
          "isDefault": {},
          "isEnabled": {},
          "name": {},
          "pluginId": {},
          "pluginObjectTypeId": {},
          "syntheticExpression": {},
          "syntheticMaximumExpression": {}
        },
        {
          "allowMaximumValue": {},
          "dataUnits": {},
          "description": {},
          "displayUnits": {},
          "extendedInfo": {},
          "format": {},
          "id": {},
          "isDefault": {},
          "isEnabled": {},
          "name": {},
          "pluginId": {},
          "pluginObjectTypeId": {},
          "syntheticExpression": {},
          "syntheticMaximumExpression": {}
        },
        {
          "allowMaximumValue": {},
          "dataUnits": {},
          "description": {},
          "displayUnits": {},
          "extendedInfo": {},
          "format": {},
          "id": {},
          "isDefault": {},
          "isEnabled": {},
          "name": {},
          "pluginId": {},
          "pluginObjectTypeId": {},
          "syntheticExpression": {},
          "syntheticMaximumExpression": {}
        },
        {
          "allowMaximumValue": {},
          "dataUnits": {},
          "description": {},
          "displayUnits": {},
          "extendedInfo": {},
          "format": {},
          "id": {},
          "isDefault": {},
          "isEnabled": {},
          "name": {},
          "pluginId": {},
          "pluginObjectTypeId": {},
          "syntheticExpression": {},
          "syntheticMaximumExpression": {}
        }
      ],
      "isEditable": false,
      "isEnabled": false,
      "name": "string",
      "objectTypes": [
        {
          "extendedInfo": {},
          "id": {},
          "indicatorTypes": {},
          "isEditable": {},
          "isEnabled": {},
          "name": {},
          "objectTypes": {},
          "parentObjectTypeId": {},
          "pluginId": {}
        },
        {
          "extendedInfo": {},
          "id": {},
          "indicatorTypes": {},
          "isEditable": {},
          "isEnabled": {},
          "name": {},
          "objectTypes": {},
          "parentObjectTypeId": {},
          "pluginId": {}
        },
        {
          "extendedInfo": {},
          "id": {},
          "indicatorTypes": {},
          "isEditable": {},
          "isEnabled": {},
          "name": {},
          "objectTypes": {},
          "parentObjectTypeId": {},
          "pluginId": {}
        },
        {
          "extendedInfo": {},
          "id": {},
          "indicatorTypes": {},
          "isEditable": {},
          "isEnabled": {},
          "name": {},
          "objectTypes": {},
          "parentObjectTypeId": {},
          "pluginId": {}
        },
        {
          "extendedInfo": {},
          "id": {},
          "indicatorTypes": {},
          "isEditable": {},
          "isEnabled": {},
          "name": {},
          "objectTypes": {},
          "parentObjectTypeId": {},
          "pluginId": {}
        },
        {
          "extendedInfo": {},
          "id": {},
          "indicatorTypes": {},
          "isEditable": {},
          "isEnabled": {},
          "name": {},
          "objectTypes": {},
          "parentObjectTypeId": {},
          "pluginId": {}
        },
        {
          "extendedInfo": {},
          "id": {},
          "indicatorTypes": {},
          "isEditable": {},
          "isEnabled": {},
          "name": {},
          "objectTypes": {},
          "parentObjectTypeId": {},
          "pluginId": {}
        },
        {
          "extendedInfo": {},
          "id": {},
          "indicatorTypes": {},
          "isEditable": {},
          "isEnabled": {},
          "name": {},
          "objectTypes": {},
          "parentObjectTypeId": {},
          "pluginId": {}
        },
        {
          "extendedInfo": {},
          "id": {},
          "indicatorTypes": {},
          "isEditable": {},
          "isEnabled": {},
          "name": {},
          "objectTypes": {},
          "parentObjectTypeId": {},
          "pluginId": {}
        },
        {
          "extendedInfo": {},
          "id": {},
          "indicatorTypes": {},
          "isEditable": {},
          "isEnabled": {},
          "name": {},
          "objectTypes": {},
          "parentObjectTypeId": {},
          "pluginId": {}
        }
      ],
      "parentObjectTypeId": 10,
      "pluginId": 1
    }
  ]
}