{
  "allowDelete": false,
  "alternateName": "string",
  "dateAdded": 1,
  "description": "string",
  "disableConcurrentPolling": true,
  "disablePolling": false,
  "disableThresholding": true,
  "id": 9,
  "ipAddress": "string",
  "isDeleted": false,
  "isNew": true,
  "lastDiscovery": 5,
  "manualIP": true,
  "name": "string",
  "numElements": 8,
  "objects": [
    {
      "alternateName": "string",
      "dateAdded": 9,
      "description": "string",
      "deviceId": 5,
      "enabled": {},
      "extendedInfo": {},
      "id": 7,
      "indicators": [
        {},
        {},
        {},
        {},
        {},
        {},
        {},
        {},
        {}
      ],
      "isDeleted": false,
      "isEnabled": false,
      "isVisible": false,
      "name": "string",
      "pluginId": 6,
      "pluginObjectTypeId": 1,
      "subtypeId": 2
    },
    {
      "alternateName": "string",
      "dateAdded": 1,
      "description": "string",
      "deviceId": 5,
      "enabled": {},
      "extendedInfo": {},
      "id": 1,
      "indicators": [
        {},
        {},
        {},
        {},
        {},
        {}
      ],
      "isDeleted": false,
      "isEnabled": true,
      "isVisible": true,
      "name": "string",
      "pluginId": 10,
      "pluginObjectTypeId": 2,
      "subtypeId": 9
    },
    {
      "alternateName": "string",
      "dateAdded": 4,
      "description": "string",
      "deviceId": 3,
      "enabled": {},
      "extendedInfo": {},
      "id": 10,
      "indicators": [
        {},
        {},
        {},
        {},
        {},
        {},
        {},
        {},
        {}
      ],
      "isDeleted": false,
      "isEnabled": true,
      "isVisible": false,
      "name": "string",
      "pluginId": 2,
      "pluginObjectTypeId": 9,
      "subtypeId": 4
    }
  ],
  "peerId": 6,
  "pluginInfo": {},
  "pluginManagerId": 10,
  "pollFrequency": 5,
  "timezone": "string",
  "workhoursGroupId": 9
}