{  
   "description":"string",
   "deviceId":0,
   "extendedInfo":{  

   },
   "id":0,
   "indicators":[  
      {  
         "deviceId":0,
         "evaluationOrder":0,
         "extendedInfo":{  

         },
         "format":"GAUGE",
         "id":0,
         "isBaselining":true,
         "isDeleted":true,
         "isEnabled":true,
         "lastInvalidationTime":0,
         "maxValue":0,
         "objectId":0,
         "pluginId":0,
         "pluginIndicatorTypeId":0,
         "syntheticExpression":"string"
      }
   ],
   "isDeleted":true,
   "isEnabled":true,
   "isVisible":true,
   "name":"string",
   "pluginId":0,
   "pluginObjectTypeId":0,
   "subtypeId":0
}
