{  
   "name":"All Device Groups",
   "parentId":1,
   "id":2,
   "devices":[  
      {  
         "id":1,
         "isDeleted":false,
         "isNew":false,
         "name":"ASR1K-TEST",
         "alternateName":"",
         "description":"",
         "ipAddress":"10.10.10.10",
         "peerId":1,
         "pollFrequency":300,
         "dateAdded":1497888919000,
         "lastDiscovery":1506484815000,
         "allowDelete":true,
         "disablePolling":false,
         "disableConcurrentPolling":false,
         "disableThresholding":false,
         "timezone":"America/New_York",
         "workhoursGroupId":1,
         "numElements":319,
         "pluginInfo":null,
         "objects":null,
         "pluginManagerId":null
      }
   ]
}
