{
  "name": "string",
  "resource": {
    "deviceId": 5,
    "ids": [
      8
    ],
    "type": "Object"
  },
  "visualization": {
    "table": {
      "columnSetting": {
        "exclude": [
          "string",
          "string"
        ],
        "include": [
          "string",
          "string",
          "string",
          "string",
          "string",
          "string"
        ]
      },
      "csvSetting": {
        "expandTimeseries": true,
        "formatTimestamp": false
      },
      "dataPresentationSetting": {
        "formatNumbers": false,
        "precision": 9
      },
      "tableSetting": {
        "blockVis": true,
        "hideHeaders": false,
        "wrapCells": true
      }
    }
  }
}