{
  "filters": {
    "alertId": {
      "filterExpression": "string",
      "filterExpressionText": "string",
      "group": "string",
      "id": "string",
      "operations": [
        "string",
        "string",
        "string",
        "string",
        "string"
      ],
      "title": "string",
      "values": {},
      "valuesDataStore": {
        "keyField": "string",
        "method": "string",
        "parameters": "string",
        "url": "string",
        "valueField": "string"
      },
      "valuesDescription": "string"
    },
    "alertTypes": {
      "filterExpression": "string",
      "filterExpressionText": "string",
      "group": "string",
      "id": "string",
      "operations": [
        "string",
        "string",
        "string",
        "string",
        "string",
        "string"
      ],
      "title": "string",
      "values": {},
      "valuesDataStore": {
        "keyField": "string",
        "method": "string",
        "parameters": "string",
        "url": "string",
        "valueField": "string"
      },
      "valuesDescription": "string"
    },
    "assignedTo": {
      "filterExpression": "string",
      "filterExpressionText": "string",
      "group": "string",
      "id": "string",
      "operations": [
        "string",
        "string"
      ],
      "title": "string",
      "values": {},
      "valuesDataStore": {
        "keyField": "string",
        "method": "string",
        "parameters": "string",
        "url": "string",
        "valueField": "string"
      },
      "valuesDescription": "string"
    },
    "isClosed": {
      "filterExpression": "string",
      "filterExpressionText": "string",
      "group": "string",
      "id": "string",
      "operations": [
        "string"
      ],
      "title": "string",
      "values": {},
      "valuesDataStore": {
        "keyField": "string",
        "method": "string",
        "parameters": "string",
        "url": "string",
        "valueField": "string"
      },
      "valuesDescription": "string"
    },
    "message": {
      "filterExpression": "string",
      "filterExpressionText": "string",
      "group": "string",
      "id": "string",
      "operations": [
        "string",
        "string",
        "string",
        "string",
        "string",
        "string",
        "string",
        "string"
      ],
      "title": "string",
      "values": {},
      "valuesDataStore": {
        "keyField": "string",
        "method": "string",
        "parameters": "string",
        "url": "string",
        "valueField": "string"
      },
      "valuesDescription": "string"
    },
    "policyId": {
      "filterExpression": "string",
      "filterExpressionText": "string",
      "group": "string",
      "id": "string",
      "operations": [
        "string",
        "string",
        "string",
        "string",
        "string",
        "string"
      ],
      "title": "string",
      "values": {},
      "valuesDataStore": {
        "keyField": "string",
        "method": "string",
        "parameters": "string",
        "url": "string",
        "valueField": "string"
      },
      "valuesDescription": "string"
    },
    "severity": {
      "filterExpression": "string",
      "filterExpressionText": "string",
      "group": "string",
      "id": "string",
      "operations": [
        "string",
        "string",
        "string",
        "string",
        "string",
        "string",
        "string",
        "string"
      ],
      "title": "string",
      "values": {},
      "valuesDataStore": {
        "keyField": "string",
        "method": "string",
        "parameters": "string",
        "url": "string",
        "valueField": "string"
      },
      "valuesDescription": "string"
    },
    "showIgnored": {
      "filterExpression": "string",
      "filterExpressionText": "string",
      "group": "string",
      "id": "string",
      "operations": [
        "string",
        "string",
        "string",
        "string",
        "string",
        "string",
        "string",
        "string",
        "string"
      ],
      "title": "string",
      "values": {},
      "valuesDataStore": {
        "keyField": "string",
        "method": "string",
        "parameters": "string",
        "url": "string",
        "valueField": "string"
      },
      "valuesDescription": "string"
    },
    "thresholdId": {
      "filterExpression": "string",
      "filterExpressionText": "string",
      "group": "string",
      "id": "string",
      "operations": [
        "string",
        "string",
        "string",
        "string",
        "string",
        "string"
      ],
      "title": "string",
      "values": {},
      "valuesDataStore": {
        "keyField": "string",
        "method": "string",
        "parameters": "string",
        "url": "string",
        "valueField": "string"
      },
      "valuesDescription": "string"
    }
  },
  "operations": {}
}