{
  "content": [
    {
      "attributeId": 9,
      "descriptionExpression": "string",
      "groupId": 6,
      "id": 4,
      "metadataValueExpression": "string",
      "mgtIpExpression": "string",
      "nameExpression": "string",
      "namespaceId": 6,
      "sysContactExpression": "string",
      "sysDescrExpression": "string",
      "sysLocationExpression": "string",
      "sysNameExpression": "string",
      "sysObjectIdExpression": "string",
      "walkCheckOid": "string"
    },
    {
      "attributeId": 5,
      "descriptionExpression": "string",
      "groupId": 1,
      "id": 5,
      "metadataValueExpression": "string",
      "mgtIpExpression": "string",
      "nameExpression": "string",
      "namespaceId": 6,
      "sysContactExpression": "string",
      "sysDescrExpression": "string",
      "sysLocationExpression": "string",
      "sysNameExpression": "string",
      "sysObjectIdExpression": "string",
      "walkCheckOid": "string"
    },
    {
      "attributeId": 1,
      "descriptionExpression": "string",
      "groupId": 7,
      "id": 9,
      "metadataValueExpression": "string",
      "mgtIpExpression": "string",
      "nameExpression": "string",
      "namespaceId": 2,
      "sysContactExpression": "string",
      "sysDescrExpression": "string",
      "sysLocationExpression": "string",
      "sysNameExpression": "string",
      "sysObjectIdExpression": "string",
      "walkCheckOid": "string"
    },
    {
      "attributeId": 2,
      "descriptionExpression": "string",
      "groupId": 10,
      "id": 9,
      "metadataValueExpression": "string",
      "mgtIpExpression": "string",
      "nameExpression": "string",
      "namespaceId": 9,
      "sysContactExpression": "string",
      "sysDescrExpression": "string",
      "sysLocationExpression": "string",
      "sysNameExpression": "string",
      "sysObjectIdExpression": "string",
      "walkCheckOid": "string"
    },
    {
      "attributeId": 7,
      "descriptionExpression": "string",
      "groupId": 1,
      "id": 2,
      "metadataValueExpression": "string",
      "mgtIpExpression": "string",
      "nameExpression": "string",
      "namespaceId": 7,
      "sysContactExpression": "string",
      "sysDescrExpression": "string",
      "sysLocationExpression": "string",
      "sysNameExpression": "string",
      "sysObjectIdExpression": "string",
      "walkCheckOid": "string"
    }
  ],
  "pageNumber": 10,
  "pageSize": 7,
  "totalElements": 3,
  "totalPages": 10
}