{
  "actions": [
    {
      "name": "getIndicators",
      "protocol": "REST",
      "method": "GET",
      "entitypath": "{base_path}/{version}/devices/{pathv1}/objects/{pathv2}/indicators/{pathv3}?{query}",
      "requestSchema": "schema.json",
      "responseSchema": "schema.json",
      "timeout": 0,
      "sendEmpty": false,
      "sendGetBody": false,
      "requestDatatype": "JSON",
      "responseDatatype": "JSON",
      "headers": {},
      "responseObjects": [
        {
          "type": "withpathv3",
          "key": "",
          "mockFile": "mockdatafiles/getindicatorsingle.json"
        },
        {
          "type": "default",
          "key": "content",
          "mockFile": "mockdatafiles/getindicatormultiple.json"
        }
      ]
    },
    {
      "name": "getIndicatorData",
      "protocol": "REST",
      "method": "GET",
      "entitypath": "{base_path}/{version}/devices/{pathv1}/objects/{pathv2}/indicators/{pathv3}/data?{query}",
      "requestSchema": "datareqschema.json",
      "responseSchema": "dataschema.json",
      "timeout": 0,
      "sendEmpty": false,
      "sendGetBody": false,
      "requestDatatype": "JSON",
      "responseDatatype": "JSON",
      "headers": {},
      "responseObjects": [
        {
          "type": "default",
          "key": "",
          "mockFile": "mockdatafiles/getindicatordata.json"
        }
      ]
    },
    {
      "name": "createIndicatorData",
      "protocol": "REST",
      "method": "POST",
      "entitypath": "{base_path}/{version}/device-indicators/data?{query}",
      "requestSchema": "createreqschema.json",
      "responseSchema": "schema.json",
      "timeout": 0,
      "sendEmpty": false,
      "sendGetBody": false,
      "requestDatatype": "JSON",
      "responseDatatype": "JSON",
      "headers": {},
      "responseObjects": [
        {
          "type": "default",
          "key": "",
          "mockFile": "mockdatafiles/postindicator.json"
        }
      ]
    }
  ]
}