{
  "content": [
    {
      "allowMaximumValue": true,
      "dataUnits": "string",
      "description": "string",
      "displayUnits": "string",
      "extendedInfo": {},
      "format": "COUNTER64",
      "id": 9,
      "isDefault": false,
      "isEnabled": false,
      "name": "string",
      "pluginId": 6,
      "pluginObjectTypeId": 10,
      "syntheticExpression": "string",
      "syntheticMaximumExpression": "string"
    },
    {
      "allowMaximumValue": false,
      "dataUnits": "string",
      "description": "string",
      "displayUnits": "string",
      "extendedInfo": {},
      "format": "COUNTER32",
      "id": 10,
      "isDefault": false,
      "isEnabled": false,
      "name": "string",
      "pluginId": 10,
      "pluginObjectTypeId": 3,
      "syntheticExpression": "string",
      "syntheticMaximumExpression": "string"
    },
    {
      "allowMaximumValue": true,
      "dataUnits": "string",
      "description": "string",
      "displayUnits": "string",
      "extendedInfo": {},
      "format": "GAUGE",
      "id": 1,
      "isDefault": true,
      "isEnabled": false,
      "name": "string",
      "pluginId": 7,
      "pluginObjectTypeId": 2,
      "syntheticExpression": "string",
      "syntheticMaximumExpression": "string"
    },
    {
      "allowMaximumValue": false,
      "dataUnits": "string",
      "description": "string",
      "displayUnits": "string",
      "extendedInfo": {},
      "format": "GAUGE",
      "id": 10,
      "isDefault": false,
      "isEnabled": false,
      "name": "string",
      "pluginId": 9,
      "pluginObjectTypeId": 5,
      "syntheticExpression": "string",
      "syntheticMaximumExpression": "string"
    },
    {
      "allowMaximumValue": false,
      "dataUnits": "string",
      "description": "string",
      "displayUnits": "string",
      "extendedInfo": {},
      "format": "GAUGE",
      "id": 6,
      "isDefault": true,
      "isEnabled": true,
      "name": "string",
      "pluginId": 10,
      "pluginObjectTypeId": 1,
      "syntheticExpression": "string",
      "syntheticMaximumExpression": "string"
    }
  ],
  "pageNumber": 10,
  "pageSize": 5,
  "totalElements": 1,
  "totalPages": 5
}