{
  "bar": {
    "drawGraphOutline": false,
    "prettyXAxis": true,
    "prettyYAxis": false,
    "scaleToMinimumValue": true,
    "scaled": true,
    "showAggregation": false,
    "showAverage": true,
    "showFrequency": true,
    "showLast": false,
    "showLegend": true,
    "showPeak": true,
    "showTimespan": true,
    "showTitle": false,
    "showValley": true
  },
  "pie": {
    "showAggregation": true,
    "showAverage": true,
    "showFrequency": true,
    "showLast": false,
    "showLegend": true,
    "showPeak": false,
    "showTimespan": false,
    "showTitle": false,
    "showValley": false
  },
  "table": {
    "columnSetting": {
      "exclude": [
        "string",
        "string",
        "string"
      ],
      "include": [
        "string",
        "string",
        "string",
        "string",
        "string",
        "string"
      ]
    },
    "csvSetting": {
      "expandTimeseries": true,
      "formatTimestamp": true
    },
    "dataPresentationSetting": {
      "formatNumbers": true,
      "precision": 5
    },
    "tableSetting": {
      "blockVis": true,
      "hideHeaders": false,
      "wrapCells": false
    }
  }
}