{
  "content": [
    {
      "extendedInfo": {},
      "id": 5,
      "isEditable": true,
      "isEnabled": false,
      "name": "string",
      "parentObjectTypeId": 3,
      "pluginId": 7
    },
    {
      "extendedInfo": {},
      "id": 6,
      "isEditable": false,
      "isEnabled": true,
      "name": "string",
      "parentObjectTypeId": 7,
      "pluginId": 8
    },
    {
      "extendedInfo": {},
      "id": 5,
      "isEditable": true,
      "isEnabled": false,
      "name": "string",
      "parentObjectTypeId": 8,
      "pluginId": 2
    },
    {
      "extendedInfo": {},
      "id": 1,
      "isEditable": true,
      "isEnabled": false,
      "name": "string",
      "parentObjectTypeId": 8,
      "pluginId": 1
    },
    {
      "extendedInfo": {},
      "id": 7,
      "isEditable": true,
      "isEnabled": false,
      "name": "string",
      "parentObjectTypeId": 7,
      "pluginId": 6
    },
    {
      "extendedInfo": {},
      "id": 7,
      "isEditable": true,
      "isEnabled": true,
      "name": "string",
      "parentObjectTypeId": 8,
      "pluginId": 4
    },
    {
      "extendedInfo": {},
      "id": 4,
      "isEditable": false,
      "isEnabled": true,
      "name": "string",
      "parentObjectTypeId": 7,
      "pluginId": 8
    },
    {
      "extendedInfo": {},
      "id": 4,
      "isEditable": false,
      "isEnabled": false,
      "name": "string",
      "parentObjectTypeId": 9,
      "pluginId": 10
    },
    {
      "extendedInfo": {},
      "id": 8,
      "isEditable": true,
      "isEnabled": false,
      "name": "string",
      "parentObjectTypeId": 10,
      "pluginId": 5
    },
    {
      "extendedInfo": {},
      "id": 1,
      "isEditable": true,
      "isEnabled": false,
      "name": "string",
      "parentObjectTypeId": 5,
      "pluginId": 3
    }
  ],
  "pageNumber": 1,
  "pageSize": 1,
  "totalElements": 5,
  "totalPages": 9
}