{
  "name": "string",
  "resource": {
    "group": {
      "id": 1,
      "indicatorTypes": {
        "ids": [
          6,
          9,
          3,
          7,
          7,
          2
        ],
        "objectTypeId": 8,
        "pluginId": 1
      },
      "type": "ObjectGroup"
    },
    "indicators": [
      {
        "deviceId": 4,
        "ids": [
          9,
          10,
          5,
          8,
          8,
          2,
          9,
          1,
          5,
          10
        ],
        "objectId": 2,
        "pluginId": 9
      }
    ]
  },
  "settings": {
    "rawDataSetting": {
      "dataAggregationSetting": {
        "aggregationType": "autoStackedBar",
        "aggregationUnits": "years",
        "aggregationValue": 2,
        "useAggregation": true
      },
      "rawDataSetting": {
        "fitTimeSpanTo": "days",
        "percentiles": 8,
        "projectionTime": 2,
        "reduceData": true,
        "standardDeviation": 6,
        "timeOverTimeOnly": true,
        "timeOverTimeType": "minimum",
        "timeOverTimeUnits": "days",
        "timeOverTimeValue": 8,
        "trend": "none",
        "trendType": "power",
        "useBaseline": false,
        "usePercentiles": "string",
        "useTimeOverTime": false
      },
      "unitsSetting": {
        "percentage": false,
        "preferredUnits": "bytes"
      },
      "workHoursSetting": {
        "customWorkhours": [
          {},
          {},
          {},
          {},
          {},
          {}
        ],
        "type": {},
        "workHoursGroupId": 7
      }
    },
    "sourceFields": {
      "fields": [
        "string",
        "string"
      ],
      "sort": [
        [
          "string",
          "string",
          "string",
          "string",
          "string",
          "string",
          "string",
          "string",
          "string",
          "string"
        ],
        [
          "string",
          "string",
          "string",
          "string"
        ],
        [
          "string",
          "string"
        ],
        [
          "string",
          "string",
          "string",
          "string",
          "string"
        ],
        [
          "string"
        ],
        [
          "string"
        ],
        [
          "string",
          "string",
          "string",
          "string",
          "string",
          "string"
        ],
        [
          "string",
          "string",
          "string",
          "string",
          "string"
        ],
        [
          "string",
          "string",
          "string",
          "string",
          "string",
          "string",
          "string",
          "string"
        ]
      ]
    }
  },
  "timeSettings": {
    "ranges": {
      "end": "string",
      "start": "string",
      "type": "CustomWeek"
    },
    "timezone": "string"
  },
  "visualization": {
    "bar": {
      "drawGraphOutline": false,
      "prettyXAxis": true,
      "prettyYAxis": false,
      "scaleToMinimumValue": false,
      "scaled": false,
      "showAggregation": true,
      "showAverage": false,
      "showFrequency": false,
      "showLast": true,
      "showLegend": true,
      "showPeak": false,
      "showTimespan": false,
      "showTitle": false,
      "showValley": false
    },
    "line": {
      "drawGraphOutline": false,
      "dualYAxes": false,
      "logScale": false,
      "prettyXAxis": true,
      "prettyYAxis": true,
      "scaleToMinimumValue": true,
      "scaled": true,
      "showAggregation": false,
      "showAverage": true,
      "showFrequency": true,
      "showLast": true,
      "showLegend": false,
      "showPeak": true,
      "showTimespan": true,
      "showTitle": true,
      "showValley": false
    },
    "pie": {
      "showAggregation": false,
      "showAverage": true,
      "showFrequency": true,
      "showLast": true,
      "showLegend": false,
      "showPeak": false,
      "showTimespan": false,
      "showTitle": false,
      "showValley": false
    },
    "radial": {
      "drawGraphOutline": false,
      "scaled": false,
      "showAggregation": false,
      "showAverage": true,
      "showFrequency": true,
      "showLast": false,
      "showLegend": true,
      "showPeak": false,
      "showTimespan": true,
      "showTitle": false,
      "showValley": false
    },
    "stackedBar": {
      "drawGraphOutline": true,
      "prettyXAxis": true,
      "prettyYAxis": false,
      "scaled": true,
      "showAggregation": false,
      "showAverage": true,
      "showFrequency": false,
      "showLast": false,
      "showLegend": true,
      "showPeak": false,
      "showTimespan": false,
      "showTitle": true,
      "showValley": true
    },
    "stackedLine": {
      "drawGraphOutline": false,
      "prettyXAxis": false,
      "prettyYAxis": true,
      "scaleToMinimumValue": false,
      "scaled": false,
      "sendGraphCSV": true,
      "showAggregation": false,
      "showAverage": true,
      "showFrequency": true,
      "showLast": false,
      "showLegend": false,
      "showPeak": false,
      "showTimespan": false,
      "showTitle": false,
      "showValley": false
    },
    "table": {
      "columnSetting": {
        "exclude": [
          "string"
        ],
        "include": [
          "string",
          "string",
          "string"
        ]
      },
      "csvSetting": {
        "expandTimeseries": false,
        "formatTimestamp": false
      },
      "dataPresentationSetting": {
        "formatNumbers": true,
        "precision": 8
      },
      "tableSetting": {
        "blockVis": true,
        "hideHeaders": true,
        "wrapCells": true
      }
    }
  }
}