{
  "$id": "sevone_indicator_data",
  "type": "object",
  "$schema": "http://json-schema.org/draft-07/schema#",
  "properties": {
    "ph_request_type": {
      "type": "string",
      "description": "type of request (internal to adapter)",
      "default": "getIndicatorData",
      "enum": [
        "getIndicatorData"
      ],
      "external_name": "ph_request_type"
    },
    "focus": {
      "type": "integer",
      "description": "focus of the indicator data",
      "parse": false,
      "encode": false,
      "encrypt": {
        "type": "AES",
        "key": ""
      },
      "minimum": 0,
      "external_name": "focus"
    },
    "time": {
      "type": "integer",
      "description": "time of the indicator data",
      "parse": false,
      "encode": false,
      "encrypt": {
        "type": "AES",
        "key": ""
      },
      "minimum": 0,
      "external_name": "time"
    },
    "value": {
      "type": "integer",
      "description": "value of the indicator data",
      "parse": false,
      "encode": false,
      "encrypt": {
        "type": "AES",
        "key": ""
      },
      "minimum": 0,
      "external_name": "value"
    }
  },
  "definitions": {}
}