{  
   "totalElements":5,
   "content":[  
      {  
         "id":1,
         "name":"Argentina",
         "imageId":103,
         "imageMimeType":"image/png",
         "imageSize":403790,
         "imageName":"Argentina",
         "nodes":null,
         "connections":null
      },
      {  
         "id":3,
         "name":"Middle Map",
         "imageId":49,
         "imageMimeType":"image/png",
         "imageSize":94641,
         "imageName":"Austria",
         "nodes":null,
         "connections":null
      },
      {  
         "id":4,
         "name":"Last Map",
         "imageId":92,
         "imageMimeType":"image/png",
         "imageSize":232403,
         "imageName":"Bolivia",
         "nodes":null,
         "connections":null
      },
      {  
         "id":5,
         "name":"MPN USA Map",
         "imageId":111,
         "imageMimeType":"image/png",
         "imageSize":226976,
         "imageName":"United States of America",
         "nodes":null,
         "connections":null
      },
      {  
         "id":6,
         "name":"MPNv4_AS_Built_Branchburg",
         "imageId":237,
         "imageMimeType":"image/png",
         "imageSize":528651,
         "imageName":"MPNv4 AS Built - Branchburg",
         "nodes":null,
         "connections":null
      }
   ],
   "pageNumber":1,
   "pageSize":20,
   "totalPages":1
}
