{
  "allowAutomatic": true,
  "allowManual": false,
  "device": {
    "allowDelete": false,
    "alternateName": "string",
    "dateAdded": 8,
    "description": "string",
    "disableConcurrentPolling": false,
    "disablePolling": false,
    "disableThresholding": true,
    "id": 8,
    "ipAddress": "string",
    "isDeleted": true,
    "isNew": true,
    "lastDiscovery": 4,
    "manualIP": false,
    "name": "string",
    "numElements": 8,
    "objects": [
      {
        "alternateName": "string",
        "dateAdded": 10,
        "description": "string",
        "deviceId": 5,
        "enabled": {},
        "extendedInfo": {},
        "id": 2,
        "indicators": [
          {},
          {},
          {},
          {}
        ],
        "isDeleted": false,
        "isEnabled": true,
        "isVisible": false,
        "name": "string",
        "pluginId": 3,
        "pluginObjectTypeId": 10,
        "subtypeId": 2
      },
      {
        "alternateName": "string",
        "dateAdded": 10,
        "description": "string",
        "deviceId": 6,
        "enabled": {},
        "extendedInfo": {},
        "id": 2,
        "indicators": [
          {}
        ],
        "isDeleted": false,
        "isEnabled": true,
        "isVisible": false,
        "name": "string",
        "pluginId": 1,
        "pluginObjectTypeId": 10,
        "subtypeId": 4
      },
      {
        "alternateName": "string",
        "dateAdded": 7,
        "description": "string",
        "deviceId": 10,
        "enabled": {},
        "extendedInfo": {},
        "id": 1,
        "indicators": [
          {},
          {},
          {},
          {}
        ],
        "isDeleted": true,
        "isEnabled": false,
        "isVisible": false,
        "name": "string",
        "pluginId": 5,
        "pluginObjectTypeId": 10,
        "subtypeId": 6
      }
    ],
    "peerId": 1,
    "pluginInfo": {},
    "pluginManagerId": 7,
    "pollFrequency": 8,
    "timezone": "string",
    "workhoursGroupId": 8
  },
  "deviceId": 8,
  "isWorking": true,
  "queue": "high",
  "timeCompleted": 6,
  "timeQueued": 9,
  "timeStarted": 4,
  "timeUpdated": 7,
  "timesDiscovered": 2
}