{
  "group": {
    "id": 6,
    "indicatorTypes": {
      "ids": [
        7,
        7,
        10,
        9
      ],
      "objectTypeId": 2,
      "pluginId": 1
    },
    "type": "DeviceGroup"
  },
  "indicators": [
    {
      "deviceId": 1,
      "ids": [
        5,
        10,
        2,
        4,
        10,
        10,
        5,
        3
      ],
      "objectId": 10,
      "pluginId": 3
    },
    {
      "deviceId": 7,
      "ids": [
        8,
        5,
        9,
        5,
        5,
        7
      ],
      "objectId": 2,
      "pluginId": 10
    }
  ]
}