{
  "alertFlowFalcon": {
    "alertId": 6,
    "directionId": 9,
    "filterId": 3,
    "id": 1,
    "interfaceId": 1,
    "netflowDeviceId": 4,
    "viewId": 1
  },
  "clearTime": 7,
  "deviceId": 6,
  "endTime": 6,
  "id": 9,
  "ignoreComment": "string",
  "ignoreUid": 3,
  "ignoreUntil": 6,
  "message": "string",
  "number": 6,
  "objectId": 7,
  "origin": "trap",
  "pluginName": "string",
  "pollId": 7,
  "severity": 8,
  "startTime": 9,
  "thresholdId": 8
}