{
  "empty": false,
  "expression": "string",
  "filters": [
    {
      "id": "string",
      "name": "string",
      "operation": "string",
      "values": [
        "string",
        "string",
        "string",
        "string"
      ]
    },
    {
      "id": "string",
      "name": "string",
      "operation": "string",
      "values": [
        "string",
        "string"
      ]
    },
    {
      "id": "string",
      "name": "string",
      "operation": "string",
      "values": [
        "string",
        "string",
        "string",
        "string",
        "string"
      ]
    },
    {
      "id": "string",
      "name": "string",
      "operation": "string",
      "values": [
        "string",
        "string",
        "string",
        "string",
        "string",
        "string",
        "string",
        "string"
      ]
    },
    {
      "id": "string",
      "name": "string",
      "operation": "string",
      "values": [
        "string",
        "string",
        "string",
        "string",
        "string"
      ]
    },
    {
      "id": "string",
      "name": "string",
      "operation": "string",
      "values": [
        "string",
        "string",
        "string"
      ]
    },
    {
      "id": "string",
      "name": "string",
      "operation": "string",
      "values": [
        "string",
        "string",
        "string",
        "string",
        "string",
        "string",
        "string",
        "string"
      ]
    }
  ]
}