{
  "pie": {
    "showAggregation": false,
    "showAverage": true,
    "showFrequency": false,
    "showLast": true,
    "showLegend": true,
    "showPeak": false,
    "showTimespan": true,
    "showTitle": true,
    "showValley": false
  },
  "stackedLine": {
    "drawGraphOutline": true,
    "prettyXAxis": false,
    "prettyYAxis": true,
    "scaleToMinimumValue": true,
    "scaled": true,
    "sendGraphCSV": true,
    "showAggregation": true,
    "showAverage": false,
    "showFrequency": true,
    "showLast": false,
    "showLegend": true,
    "showPeak": true,
    "showTimespan": true,
    "showTitle": true,
    "showValley": false
  },
  "table": {
    "columnSetting": {
      "exclude": [
        "string",
        "string",
        "string",
        "string"
      ],
      "include": [
        "string"
      ]
    },
    "csvSetting": {
      "expandTimeseries": false,
      "formatTimestamp": true
    },
    "dataPresentationSetting": {
      "formatNumbers": true,
      "precision": 6
    },
    "tableSetting": {
      "blockVis": false,
      "hideHeaders": false,
      "wrapCells": false
    }
  }
}