{
  "aggregation": 6,
  "comparison": 3,
  "duration": 7,
  "id": 1,
  "indicatorTypeId": 4,
  "isTrigger": true,
  "message": "string",
  "policyId": 10,
  "sigmaDirection": 4,
  "type": 6,
  "unit": "string",
  "value": 9
}