{
  "mailAction": {
    "mails": [
      "string",
      "string",
      "string",
      "string",
      "string",
      "string"
    ],
    "repeated": false,
    "repeatedPeriod": 7,
    "roleIds": [
      8
    ],
    "userIds": [
      1,
      9,
      3,
      4,
      8,
      4,
      3,
      5,
      9,
      5
    ]
  },
  "trapAction": {
    "trapDestinations": [
      7,
      9,
      7,
      6,
      2
    ],
    "useCustomTraps": false,
    "useDefaultTraps": true,
    "useDeviceTraps": true
  }
}