{
  "name": "adapter-sevone",
  "webName": "Adapter for Integration to IBM SevOne",
  "supportLevel": "community",
  "vendor": "IBM",
  "product": "SevOne",
  "techAlliance": false,
  "osVersion": [],
  "apiVersions": [],
  "iapVersions": [
    "2021.1.x",
    "2021.2.x",
    "2022.1.x",
    "2023.1.x"
  ],
  "method": "REST",
  "type": "Adapter",
  "domains": [
    "Service Assurance"
  ],
  "tags": [
    "Monitoring & Troubleshooting"
  ],
  "useCases": [
    "Add Device to Monitoring",
    "Automated network data gathering for diagnostics",
    "Verify network connectivity"
  ],
  "deprecated": {
    "isDeprecated": false
  },
  "brokerSince": "",
  "authMethods": [
    {
      "type": "Token",
      "primary": true
    }
  ],
  "documentation": {
    "storeLink": "",
    "npmLink": "https://www.npmjs.com/package/@itentialopensource/adapter-sevone",
    "repoLink": "https://gitlab.com/itentialopensource/adapters/adapter-sevone",
    "docLink": "https://gitlab.com/itentialopensource/adapters/adapter-sevone/-/blob/master/README.md?ref_type=heads",
    "demoLinks": [],
    "trainingLinks": [
      {
        "title": "Itential Academy",
        "link": "https://www.itential.com/itential-academy/"
      }
    ],
    "faqLink": "https://docs.itential.com/opensource/docs/troubleshooting-an-adapter",
    "contributeLink": "https://gitlab.com/itentialopensource/adapters/contributing-guide",
    "issueLink": "https://itential.atlassian.net/servicedesk/customer/portals",
    "webLink": "https://www.itential.com/adapters/sevone/",
    "vendorLink": "https://www.ibm.com/us-en",
    "productLink": "https://www.ibm.com/products/sevone-network-performance-management",
    "apiLinks": [
      {
        "title": "SevOne API",
        "link": "https://developer.ibm.com/apis/catalog/sevonenpm--sevone-api/Introduction",
        "public": true
      },
      {
        "title": "RESTful API Quick Start Guide",
        "link": "https://xtelnms.xtel.net/manual/RESTful-API-Quick-Start-Guide.html",
        "public": true
      }
    ],
    "workshopLinks": [],
    "workshopHomePage": "https://www.itential.com/get-started/"
  },
  "assets": [],
  "relatedItems": {
    "adapters": [],
    "integrations": [],
    "ecosystemApplications": [],
    "workflowProjects": [],
    "transformationProjects": [],
    "exampleProjects": []
  }
}