{
  "name": "string",
  "resource": {
    "ids": [
      3,
      7,
      10,
      4,
      10,
      9
    ],
    "type": "Device"
  },
  "visualization": {
    "table": {
      "columnSetting": {
        "exclude": [
          "string",
          "string"
        ],
        "include": [
          "string",
          "string",
          "string",
          "string",
          "string",
          "string",
          "string"
        ]
      },
      "csvSetting": {
        "expandTimeseries": false,
        "formatTimestamp": false
      },
      "dataPresentationSetting": {
        "formatNumbers": true,
        "precision": 8
      },
      "tableSetting": {
        "blockVis": true,
        "hideHeaders": false,
        "wrapCells": true
      }
    }
  }
}