{
  "rawDataSetting": {
    "dataAggregationSetting": {
      "aggregationType": "total",
      "aggregationUnits": "sixhours",
      "aggregationValue": 7,
      "useAggregation": false
    },
    "rawDataSetting": {
      "fitTimeSpanTo": "second",
      "percentiles": 6,
      "projectionTime": 4,
      "reduceData": false,
      "standardDeviation": 8,
      "timeOverTimeOnly": false,
      "timeOverTimeType": "maximum",
      "timeOverTimeUnits": "hours",
      "timeOverTimeValue": 8,
      "trend": "none",
      "trendType": "exponential",
      "useBaseline": false,
      "usePercentiles": "string",
      "useTimeOverTime": false
    },
    "unitsSetting": {
      "percentage": false,
      "preferredUnits": "bytes"
    },
    "workHoursSetting": {
      "customWorkhours": [
        {
          "days": {},
          "startHour": {},
          "startMin": {},
          "endHour": {},
          "endMin": {}
        },
        {
          "days": {},
          "startHour": {},
          "startMin": {},
          "endHour": {},
          "endMin": {}
        },
        {
          "days": {},
          "startHour": {},
          "startMin": {},
          "endHour": {},
          "endMin": {}
        },
        {
          "days": {},
          "startHour": {},
          "startMin": {},
          "endHour": {},
          "endMin": {}
        }
      ],
      "type": "system",
      "workHoursGroupId": 10
    }
  },
  "sourceFields": {
    "fields": [
      "string",
      "string"
    ],
    "sort": [
      [
        "string",
        "string",
        "string",
        "string",
        "string",
        "string",
        "string"
      ]
    ]
  }
}