{  
   "data":[  
      {  
         "deviceId":1,
         "elementId":1,
         "pluginId":1,
         "reportId":1
      }
   ],
   "id":1,
   "name":"string",
   "type":"Device",
   "x":1,
   "y":1
}
