{
  "content": [
    {
      "id": 2,
      "imageMimeType": "string",
      "imageSize": 1,
      "name": "string"
    }
  ],
  "pageNumber": 1,
  "pageSize": 8,
  "totalElements": 2,
  "totalPages": 5
}