{  
   "id":1,
   "name":"Argentina",
   "imageId":103,
   "imageMimeType":"image/png",
   "imageSize":403790,
   "imageName":"Argentina",
   "nodes":[  
      {  
         "data":[  
            {  
               "deviceId":1,
               "elementId":1,
               "pluginId":1,
               "reportId":1
            }
         ],
         "id":1,
         "name":"string",
         "type":"Device",
         "x":1,
         "y":1
      }
   ],
   "connections":[  
      {  
         "data":[  
            {  
               "deviceId":1,
               "elementId":1,
               "pluginId":1,
               "reportId":1
            }
         ],
         "id":1,
         "nodeAId":1,
         "nodeBId":1,
         "type":"Device"
      }
   ]
}
