{
  "table": {
    "columnSetting": {
      "exclude": [
        "string"
      ],
      "include": [
        "string",
        "string",
        "string",
        "string"
      ]
    },
    "csvSetting": {
      "expandTimeseries": true,
      "formatTimestamp": true
    },
    "dataPresentationSetting": {
      "formatNumbers": true,
      "precision": 7
    },
    "tableSetting": {
      "blockVis": false,
      "hideHeaders": false,
      "wrapCells": false
    }
  }
}