{
  "acknowledgedBy":"string",
  "assignedTo":0,
  "clearMessage":"string",
  "closed":0,
  "closedKey":0,
  "comments":"dfsdfs",
  "deviceId":4321,
  "endTime":0,
  "id":1,
  "ignoreComment":"string",
  "ignoreUid":0,
  "ignoreUntil":0,
  "lastProcessed":0,
  "message":"rgsgsewrg fdgsdfg",
  "number":7,
  "objectId":0,
  "origin":"system",
  "pluginName":"string",
  "pollId":0,
  "severity":2,
  "startTime":5646535,
  "thresholdId":0
}
