{
  "$id": "schema.json",
  "type": "object",
  "schema": "http://json-schema.org/draft-07/schema#",
  "translate": true,
  "dynamicfields": true,
  "properties": {
    "ph_request_type": {
      "type": "string",
      "description": "type of request (internal to adapter)",
      "default": "getTask",
      "enum": [
        "getTask",
        "postTask",
        "getTaskX",
        "postTaskX",
        "deleteTaskX",
        "getTaskXScheduleY"
      ],
      "external_name": "ph_request_type"
    },
    "x": {
      "type": "string",
      "description": "",
      "parse": false,
      "encode": false,
      "encrypt": {
        "type": "AES",
        "key": ""
      },
      "external_name": "X"
    },
    "y": {
      "type": "string",
      "description": "",
      "parse": false,
      "encode": false,
      "encrypt": {
        "type": "AES",
        "key": ""
      },
      "external_name": "Y"
    }
  },
  "definitions": {}
}