{
  "$id": "schema.json",
  "type": "object",
  "schema": "http://json-schema.org/draft-07/schema#",
  "translate": true,
  "dynamicfields": true,
  "properties": {
    "ph_request_type": {
      "type": "string",
      "description": "type of request (internal to adapter)",
      "default": "getDevice",
      "enum": [
        "getDevice",
        "postDevice",
        "getDeviceX",
        "postDeviceX",
        "putDeviceX",
        "deleteDeviceX",
        "getDeviceXAlignedApp",
        "postDeviceXAlignedApp",
        "getDeviceXAlignedAppY",
        "postDeviceXAlignedAppY",
        "deleteDeviceXAlignedAppY",
        "getDeviceXConfigData",
        "getDeviceXConfigDataY",
        "getDeviceXConfigDataYData",
        "getDeviceXConfigDataYSnapshots",
        "getDeviceXDetail",
        "getDeviceXDeviceAppCredentials",
        "getDeviceXDeviceThresholds",
        "postDeviceXDeviceThresholds",
        "putDeviceXDeviceThresholds",
        "deleteDeviceXDeviceThresholds",
        "postDeviceXInterface",
        "getDeviceXInterface",
        "getDeviceXInterfaceY",
        "postDeviceXInterfaceY",
        "putDeviceXInterfaceY",
        "deleteDeviceXInterfaceY",
        "getDeviceXInterfaceYInterfaceDataData",
        "getDeviceXInterfaceYInterfaceDataNormalizedDaily",
        "getDeviceXInterfaceYInterfaceDataNormalizedHourly",
        "getDeviceXLog",
        "getDeviceXLogY",
        "postDeviceXNote",
        "getDeviceXNote",
        "getDeviceXNoteY",
        "postDeviceXNoteY",
        "putDeviceXNoteY",
        "deleteDeviceXNoteY",
        "getDeviceXNoteYMedia",
        "getDeviceXNoteYMediaZ",
        "putDeviceXNoteYMediaZ",
        "getDeviceXNoteYMediaZInfo",
        "getDeviceXPerformanceData",
        "getDeviceXPerformanceDataYData",
        "getDeviceXPerformanceDataYNormalizedDaily",
        "getDeviceXPerformanceDataYNormalizedHourly",
        "getDeviceXVitals",
        "getDeviceXVitalsAvailabilityData",
        "getDeviceXVitalsAvailabilityNormalizedDaily",
        "getDeviceXVitalsAvailabilityNormalizedHourly",
        "getDeviceXVitalsFsXData",
        "getDeviceXVitalsFsXNormalizedDaily",
        "getDeviceXVitalsLatencyData",
        "getDeviceXVitalsLatencyNormalizedDaily",
        "getDeviceXVitalsLatencyNormalizedHourly"
      ],
      "external_name": "ph_request_type"
    },
    "x": {
      "type": "string",
      "description": "",
      "parse": false,
      "encode": false,
      "encrypt": {
        "type": "AES",
        "key": ""
      },
      "external_name": "X"
    },
    "y": {
      "type": "string",
      "description": "",
      "parse": false,
      "encode": false,
      "encrypt": {
        "type": "AES",
        "key": ""
      },
      "external_name": "Y"
    },
    "z": {
      "type": "string",
      "description": "",
      "parse": false,
      "encode": false,
      "encrypt": {
        "type": "AES",
        "key": ""
      },
      "external_name": "Z"
    }
  },
  "definitions": {}
}