{
  "actions": [
    {
      "name": "getDataPerformanceRaw",
      "protocol": "REST",
      "method": "GET",
      "entitypath": "{base_path}/{version}/data_performance_raw?{query}",
      "requestSchema": "schema.json",
      "responseSchema": "schema.json",
      "timeout": 0,
      "sendEmpty": false,
      "sendGetBody": false,
      "requestDatatype": "JSON",
      "responseDatatype": "JSON",
      "headers": {},
      "responseObjects": [
        {
          "type": "default",
          "key": "",
          "mockFile": ""
        }
      ]
    },
    {
      "name": "getDataPerformanceRawDevice",
      "protocol": "REST",
      "method": "GET",
      "entitypath": "{base_path}/{version}/data_performance_raw/device?{query}",
      "requestSchema": "schema.json",
      "responseSchema": "schema.json",
      "timeout": 0,
      "sendEmpty": false,
      "sendGetBody": false,
      "requestDatatype": "JSON",
      "responseDatatype": "JSON",
      "headers": {},
      "responseObjects": [
        {
          "type": "default",
          "key": "",
          "mockFile": ""
        }
      ]
    },
    {
      "name": "getDataPerformanceRawDeviceAvail",
      "protocol": "REST",
      "method": "GET",
      "entitypath": "{base_path}/{version}/data_performance_raw/device/avail?{query}",
      "requestSchema": "schema.json",
      "responseSchema": "schema.json",
      "timeout": 0,
      "sendEmpty": false,
      "sendGetBody": false,
      "requestDatatype": "JSON",
      "responseDatatype": "JSON",
      "headers": {},
      "responseObjects": [
        {
          "type": "default",
          "key": "",
          "mockFile": ""
        }
      ]
    },
    {
      "name": "getDataPerformanceRawDeviceDynamicApp",
      "protocol": "REST",
      "method": "GET",
      "entitypath": "{base_path}/{version}/data_performance_raw/device/dynamic_app?{query}",
      "requestSchema": "schema.json",
      "responseSchema": "schema.json",
      "timeout": 0,
      "sendEmpty": false,
      "sendGetBody": false,
      "requestDatatype": "JSON",
      "responseDatatype": "JSON",
      "headers": {},
      "responseObjects": [
        {
          "type": "default",
          "key": "",
          "mockFile": ""
        }
      ]
    },
    {
      "name": "getDataPerformanceRawDeviceFilesystem",
      "protocol": "REST",
      "method": "GET",
      "entitypath": "{base_path}/{version}/data_performance_raw/device/filesystem?{query}",
      "requestSchema": "schema.json",
      "responseSchema": "schema.json",
      "timeout": 0,
      "sendEmpty": false,
      "sendGetBody": false,
      "requestDatatype": "JSON",
      "responseDatatype": "JSON",
      "headers": {},
      "responseObjects": [
        {
          "type": "default",
          "key": "",
          "mockFile": ""
        }
      ]
    },
    {
      "name": "getDataPerformanceRawDeviceMonitorCv",
      "protocol": "REST",
      "method": "GET",
      "entitypath": "{base_path}/{version}/data_performance_raw/device/monitor_cv?{query}",
      "requestSchema": "schema.json",
      "responseSchema": "schema.json",
      "timeout": 0,
      "sendEmpty": false,
      "sendGetBody": false,
      "requestDatatype": "JSON",
      "responseDatatype": "JSON",
      "headers": {},
      "responseObjects": [
        {
          "type": "default",
          "key": "",
          "mockFile": ""
        }
      ]
    },
    {
      "name": "getDataPerformanceRawDeviceMonitorDns",
      "protocol": "REST",
      "method": "GET",
      "entitypath": "{base_path}/{version}/data_performance_raw/device/monitor_dns?{query}",
      "requestSchema": "schema.json",
      "responseSchema": "schema.json",
      "timeout": 0,
      "sendEmpty": false,
      "sendGetBody": false,
      "requestDatatype": "JSON",
      "responseDatatype": "JSON",
      "headers": {},
      "responseObjects": [
        {
          "type": "default",
          "key": "",
          "mockFile": ""
        }
      ]
    },
    {
      "name": "getDataPerformanceRawDeviceMonitorEmail",
      "protocol": "REST",
      "method": "GET",
      "entitypath": "{base_path}/{version}/data_performance_raw/device/monitor_email?{query}",
      "requestSchema": "schema.json",
      "responseSchema": "schema.json",
      "timeout": 0,
      "sendEmpty": false,
      "sendGetBody": false,
      "requestDatatype": "JSON",
      "responseDatatype": "JSON",
      "headers": {},
      "responseObjects": [
        {
          "type": "default",
          "key": "",
          "mockFile": ""
        }
      ]
    },
    {
      "name": "getDataPerformanceRawDeviceMonitorPort",
      "protocol": "REST",
      "method": "GET",
      "entitypath": "{base_path}/{version}/data_performance_raw/device/monitor_port?{query}",
      "requestSchema": "schema.json",
      "responseSchema": "schema.json",
      "timeout": 0,
      "sendEmpty": false,
      "sendGetBody": false,
      "requestDatatype": "JSON",
      "responseDatatype": "JSON",
      "headers": {},
      "responseObjects": [
        {
          "type": "default",
          "key": "",
          "mockFile": ""
        }
      ]
    },
    {
      "name": "getDataPerformanceRawDeviceMonitorProcess",
      "protocol": "REST",
      "method": "GET",
      "entitypath": "{base_path}/{version}/data_performance_raw/device/monitor_process?{query}",
      "requestSchema": "schema.json",
      "responseSchema": "schema.json",
      "timeout": 0,
      "sendEmpty": false,
      "sendGetBody": false,
      "requestDatatype": "JSON",
      "responseDatatype": "JSON",
      "headers": {},
      "responseObjects": [
        {
          "type": "default",
          "key": "",
          "mockFile": ""
        }
      ]
    },
    {
      "name": "getDataPerformanceRawDeviceMonitorService",
      "protocol": "REST",
      "method": "GET",
      "entitypath": "{base_path}/{version}/data_performance_raw/device/monitor_service?{query}",
      "requestSchema": "schema.json",
      "responseSchema": "schema.json",
      "timeout": 0,
      "sendEmpty": false,
      "sendGetBody": false,
      "requestDatatype": "JSON",
      "responseDatatype": "JSON",
      "headers": {},
      "responseObjects": [
        {
          "type": "default",
          "key": "",
          "mockFile": ""
        }
      ]
    },
    {
      "name": "getDataPerformanceRawDeviceMonitorTv",
      "protocol": "REST",
      "method": "GET",
      "entitypath": "{base_path}/{version}/data_performance_raw/device/monitor_tv?{query}",
      "requestSchema": "schema.json",
      "responseSchema": "schema.json",
      "timeout": 0,
      "sendEmpty": false,
      "sendGetBody": false,
      "requestDatatype": "JSON",
      "responseDatatype": "JSON",
      "headers": {},
      "responseObjects": [
        {
          "type": "default",
          "key": "",
          "mockFile": ""
        }
      ]
    },
    {
      "name": "getDataPerformanceRawInterface",
      "protocol": "REST",
      "method": "GET",
      "entitypath": "{base_path}/{version}/data_performance_raw/interface?{query}",
      "requestSchema": "schema.json",
      "responseSchema": "schema.json",
      "timeout": 0,
      "sendEmpty": false,
      "sendGetBody": false,
      "requestDatatype": "JSON",
      "responseDatatype": "JSON",
      "headers": {},
      "responseObjects": [
        {
          "type": "default",
          "key": "",
          "mockFile": ""
        }
      ]
    },
    {
      "name": "getDataPerformanceRawCbqos",
      "protocol": "REST",
      "method": "GET",
      "entitypath": "{base_path}/{version}/data_performance_raw/cbqos?{query}",
      "requestSchema": "schema.json",
      "responseSchema": "schema.json",
      "timeout": 0,
      "sendEmpty": false,
      "sendGetBody": false,
      "requestDatatype": "JSON",
      "responseDatatype": "JSON",
      "headers": {},
      "responseObjects": [
        {
          "type": "default",
          "key": "",
          "mockFile": ""
        }
      ]
    }
  ]
}