{
  "name": "adapter-sciencelogic_sl1",
  "webName": "Adapter for Integration to ScienceLogic SL1",
  "supportLevel": "community",
  "vendor": "ScienceLogic",
  "product": "SL1",
  "techAlliance": false,
  "osVersion": [],
  "apiVersions": [],
  "iapVersions": [
    "2021.1.x",
    "2021.2.x",
    "2022.1.x",
    "2023.1.x"
  ],
  "method": "REST",
  "type": "Adapter",
  "domains": [
    "Service Assurance"
  ],
  "tags": [
    "Monitoring & Troubleshooting"
  ],
  "useCases": [
    "Add Device to Monitoring",
    "Automated network data gathering for diagnostics",
    "Verify network connectivity"
  ],
  "deprecated": {
    "isDeprecated": false
  },
  "brokerSince": "",
  "authMethods": [
    {
      "type": "Basic Auth",
      "primary": true
    },
    {
      "type": "API Key",
      "primary": false
    },
    {
      "type": "OAuth",
      "primary": false
    }
  ],
  "documentation": {
    "storeLink": "",
    "npmLink": "https://www.npmjs.com/package/@itentialopensource/adapter-sciencelogic_sl1",
    "repoLink": "https://gitlab.com/itentialopensource/adapters/adapter-sciencelogic_sl1",
    "docLink": "https://gitlab.com/itentialopensource/adapters/adapter-sciencelogic_sl1/-/blob/master/README.md?ref_type=heads",
    "demoLinks": [],
    "trainingLinks": [
      {
        "title": "Itential Academy",
        "link": "https://www.itential.com/itential-academy/"
      }
    ],
    "faqLink": "https://docs.itential.com/opensource/docs/troubleshooting-an-adapter",
    "contributeLink": "https://gitlab.com/itentialopensource/adapters/contributing-guide",
    "issueLink": "https://itential.atlassian.net/servicedesk/customer/portals",
    "webLink": "https://www.itential.com/adapters/sciencelogic-sl1/",
    "vendorLink": "https://sciencelogic.com/",
    "productLink": "https://sciencelogic.com/platform/overview",
    "apiLinks": [
      {
        "title": "ScienceLogic REST API",
        "link": "https://docs.sciencelogic.com/latest/Content/Web_Content_Dev_and_Integration/ScienceLogic_API/api_intro.htm",
        "public": true
      },
      {
        "title": "ScienceLogic REST API Authentication",
        "link": "https://docs.sciencelogic.com/11-2-0/Content/Web_Content_Dev_and_Integration/REST_API_Cookbook/rest_cookbook_gs.htm",
        "public": true
      }
    ],
    "workshopLinks": [],
    "workshopHomePage": "https://www.itential.com/get-started/"
  },
  "assets": [],
  "relatedItems": {
    "adapters": [],
    "integrations": [],
    "ecosystemApplications": [],
    "workflowProjects": [],
    "transformationProjects": [],
    "exampleProjects": []
  }
}