{
  "$id": "schema.json",
  "type": "object",
  "schema": "http://json-schema.org/draft-07/schema#",
  "translate": true,
  "dynamicfields": true,
  "properties": {
    "ph_request_type": {
      "type": "string",
      "description": "type of request (internal to adapter)",
      "default": "getOrganization",
      "enum": [
        "getOrganization",
        "postOrganization",
        "getOrganizationX",
        "postOrganizationX",
        "putOrganizationX",
        "deleteOrganizationX",
        "getOrganizationXLog",
        "getOrganizationXLogY",
        "getOrganizationXNote",
        "postOrganizationXNote",
        "getOrganizationXNoteY",
        "postOrganizationXNoteY",
        "putOrganizationXNoteY",
        "deleteOrganizationXNoteY",
        "getOrganizationXNoteYMedia",
        "getOrganizationXNoteYMediaZ",
        "putOrganizationXNoteYMediaZ",
        "getOrganizationXNoteYMediaZInfo"
      ],
      "external_name": "ph_request_type"
    },
    "x": {
      "type": "string",
      "description": "",
      "parse": false,
      "encode": false,
      "encrypt": {
        "type": "AES",
        "key": ""
      },
      "external_name": "X"
    },
    "y": {
      "type": "string",
      "description": "",
      "parse": false,
      "encode": false,
      "encrypt": {
        "type": "AES",
        "key": ""
      },
      "external_name": "Y"
    },
    "z": {
      "type": "string",
      "description": "",
      "parse": false,
      "encode": false,
      "encrypt": {
        "type": "AES",
        "key": ""
      },
      "external_name": "Z"
    }
  },
  "definitions": {}
}