{
  "status": "AUTHENTICATED",
  "user_id": "string",
  "id_token": "eyJh",
  "token": {
    "user_id": "string",
    "user_name": "admin",
    "iat": "string",
    "exp": "string",
    "unique_identifier": "string",
    "identity_provider_type": "Local"
  },
  "scopes": [
    {
      "id": "string",
      "name": "default",
      "display_name": "default",
      "type": "string"
    },
    {
      "id": "string",
      "name": "string",
      "display_name": "string",
      "type": "Tenant",
      "parent_id": "string",
      "parent_name": "default",
      "parent_type": "string"
    }
  ],
  "identity_provider_type": "Local"
}