{
  "$id": "schema.json",
  "type": "object",
  "schema": "http://json-schema.org/draft-07/schema#",
  "translate": true,
  "dynamicfields": true,
  "properties": {
    "ph_request_type": {
      "type": "string",
      "description": "type of request (internal to adapter)",
      "default": "listTags",
      "enum": [
        "listTags",
        "createTag",
        "deleteTag",
        "getTag",
        "updateTag"
      ],
      "external_name": "ph_request_type"
    },
    "tagId": {
      "type": "number",
      "description": "ID of the Tag instance",
      "parse": false,
      "encode": false,
      "encrypt": {
        "type": "AES",
        "key": ""
      },
      "external_name": "tag_id"
    }
  },
  "definitions": {}
}