{
  "$id": "schema.json",
  "type": "object",
  "schema": "http://json-schema.org/draft-07/schema#",
  "translate": true,
  "dynamicfields": true,
  "properties": {
    "ph_request_type": {
      "type": "string",
      "description": "type of request (internal to adapter)",
      "default": "updateMonitorTemplate",
      "enum": [
        "updateMonitorTemplate"
      ],
      "external_name": "ph_request_type"
    },
    "templateId": {
      "type": "number",
      "description": "Id of the Monitor template",
      "parse": false,
      "encode": false,
      "encrypt": {
        "type": "AES",
        "key": ""
      },
      "external_name": "template_id"
    }
  },
  "definitions": {}
}