{
  "$id": "schema.json",
  "type": "object",
  "schema": "http://json-schema.org/draft-07/schema#",
  "translate": true,
  "dynamicfields": true,
  "properties": {
    "ph_request_type": {
      "type": "string",
      "description": "type of request (internal to adapter)",
      "default": "listSnmpManagers",
      "enum": [
        "listSnmpManagers",
        "createSnmpManager",
        "deleteSnmpManager",
        "getSnmpManager",
        "updateSnmpManager"
      ],
      "external_name": "ph_request_type"
    },
    "snmpManagerId": {
      "type": "number",
      "description": "ID of the SNMP manager",
      "parse": false,
      "encode": false,
      "encrypt": {
        "type": "AES",
        "key": ""
      },
      "external_name": "snmp_manager_id"
    }
  },
  "definitions": {}
}