{
  "$id": "schema.json",
  "type": "object",
  "schema": "http://json-schema.org/draft-07/schema#",
  "translate": true,
  "dynamicfields": true,
  "properties": {
    "ph_request_type": {
      "type": "string",
      "description": "type of request (internal to adapter)",
      "default": "listNetworkDevices",
      "enum": [
        "listNetworkDevices",
        "createNetworkDevice",
        "deleteNetworkDevice",
        "getNetworkDevice",
        "updateNetworkDevicePatch",
        "updateNetworkDevice"
      ],
      "external_name": "ph_request_type"
    },
    "tagName": {
      "type": "string",
      "description": "Filter by tag name e.g. &#39;key:value&#39;",
      "parse": false,
      "encode": false,
      "encrypt": {
        "type": "AES",
        "key": ""
      },
      "external_name": "tag_name"
    },
    "networkDeviceId": {
      "type": "number",
      "description": "ID of the network device",
      "parse": false,
      "encode": false,
      "encrypt": {
        "type": "AES",
        "key": ""
      },
      "external_name": "network_device_id"
    }
  },
  "definitions": {}
}