{
  "cpu": 10,
  "description": "string",
  "gps_lat": 10,
  "gps_long": 3,
  "interface_config": {},
  "interface_states": {},
  "load_avg": [
    8
  ],
  "management_interface": "string",
  "memory": 4,
  "name": "string",
  "ntp_config": {
    "enable_ipv6": true,
    "interface_name": "string",
    "options": "string",
    "server": "string"
  },
  "online": true,
  "type": "lite",
  "update_error": "string",
  "updating": true,
  "uptime": 10,
  "version": "string"
}