{
  "auth_password": "string",
  "community": "string",
  "engine_id": "string",
  "ip": "string",
  "name": "string",
  "priv_password": "string",
  "security": "auth_priv",
  "user_name": "string",
  "version": "3"
}