{
  "cleared": "string",
  "config": {
    "action": "string",
    "email": 1,
    "interval": 3600,
    "limit_per_monitoring": 9,
    "limit_per_test_interface": 10,
    "no_data_severity": 4,
    "no_data_timeout": 2,
    "snmp": 6,
    "template": 4,
    "thr_es_critical": 2,
    "thr_es_critical_clear": 2,
    "thr_es_major": 10,
    "thr_es_major_clear": 5,
    "thr_es_minor": 5,
    "thr_es_minor_clear": 8,
    "thr_es_warning": 1,
    "thr_es_warning_clear": 7,
    "window_size": 9
  },
  "created": "string",
  "interface_name": "string",
  "max_es": 3,
  "max_severity": 5,
  "max_summary": "string",
  "severity": 7,
  "summary": "string",
  "suppressed": true,
  "task": 8,
  "test_agent": 9,
  "total_es": 8
}