{
  "$id": "schema.json",
  "type": "object",
  "schema": "http://json-schema.org/draft-07/schema#",
  "translate": true,
  "dynamicfields": true,
  "properties": {
    "ph_request_type": {
      "type": "string",
      "description": "type of request (internal to adapter)",
      "default": "listAlarms",
      "enum": [
        "listAlarms",
        "deleteAlarm",
        "getAlarm",
        "updateAlarm"
      ],
      "external_name": "ph_request_type"
    },
    "createdTimespanStart": {
      "type": "string",
      "description": "ISO-8601 date format (yyyy-mm-ddThh:MM:ss.sZ) e.g. 2017-01-02T03:04:56.0Z. This has to be provided in UTC.",
      "parse": false,
      "encode": false,
      "encrypt": {
        "type": "AES",
        "key": ""
      },
      "external_name": "created_timespan_start"
    },
    "createdTimespanEnd": {
      "type": "string",
      "description": "ISO-8601 date format (yyyy-mm-ddThh:MM:ss.sZ) e.g. 2017-01-02T03:04:56.0Z. This has to be provided in UTC.",
      "parse": false,
      "encode": false,
      "encrypt": {
        "type": "AES",
        "key": ""
      },
      "external_name": "created_timespan_end"
    },
    "clearedTimespanStart": {
      "type": "string",
      "description": "ISO-8601 date format (yyyy-mm-ddThh:MM:ss.sZ) e.g. 2017-01-02T03:04:56.0Z. This has to be provided in UTC.",
      "parse": false,
      "encode": false,
      "encrypt": {
        "type": "AES",
        "key": ""
      },
      "external_name": "cleared_timespan_start"
    },
    "clearedTimespanEnd": {
      "type": "string",
      "description": "ISO-8601 date format (yyyy-mm-ddThh:MM:ss.sZ) e.g. 2017-01-02T03:04:56.0Z. This has to be provided in UTC.",
      "parse": false,
      "encode": false,
      "encrypt": {
        "type": "AES",
        "key": ""
      },
      "external_name": "cleared_timespan_end"
    },
    "interfaceName": {
      "type": "string",
      "description": "Returns alarms with this value in interface_name field.",
      "parse": false,
      "encode": false,
      "encrypt": {
        "type": "AES",
        "key": ""
      },
      "external_name": "interface_name"
    },
    "testAgent": {
      "type": "number",
      "description": "Id of test agent for which alarms should be filtered out.",
      "parse": false,
      "encode": false,
      "encrypt": {
        "type": "AES",
        "key": ""
      },
      "external_name": "test_agent"
    },
    "alarmId": {
      "type": "number",
      "description": "Alarm id",
      "parse": false,
      "encode": false,
      "encrypt": {
        "type": "AES",
        "key": ""
      },
      "external_name": "alarm_id"
    }
  },
  "definitions": {}
}