{
  "action": "string",
  "email": 7,
  "interval": 3600,
  "limit_per_monitoring": 2,
  "limit_per_test_interface": 4,
  "name": "string",
  "no_data_severity": 1,
  "no_data_timeout": 3,
  "snmp": 8,
  "thr_es_critical": 8,
  "thr_es_critical_clear": 9,
  "thr_es_major": 5,
  "thr_es_major_clear": 4,
  "thr_es_minor": 3,
  "thr_es_minor_clear": 6,
  "thr_es_warning": 6,
  "thr_es_warning_clear": 9,
  "window_size": 3
}