{
  "alarm_configs": [
    {
      "action": "string",
      "email": 7,
      "interval": 3600,
      "limit_per_monitoring": 9,
      "limit_per_test_interface": 2,
      "no_data_severity": 4,
      "no_data_timeout": 5,
      "snmp": 10,
      "template": 6,
      "thr_es_critical": 5,
      "thr_es_critical_clear": 9,
      "thr_es_major": 1,
      "thr_es_major_clear": 4,
      "thr_es_minor": 1,
      "thr_es_minor_clear": 1,
      "thr_es_warning": 1,
      "thr_es_warning_clear": 10,
      "window_size": 4
    },
    {
      "action": "string",
      "email": 6,
      "interval": 3600,
      "limit_per_monitoring": 8,
      "limit_per_test_interface": 6,
      "no_data_severity": 3,
      "no_data_timeout": 4,
      "snmp": 4,
      "template": 9,
      "thr_es_critical": 1,
      "thr_es_critical_clear": 6,
      "thr_es_major": 8,
      "thr_es_major_clear": 7,
      "thr_es_minor": 5,
      "thr_es_minor_clear": 3,
      "thr_es_warning": 7,
      "thr_es_warning_clear": 8,
      "window_size": 2
    },
    {
      "action": "string",
      "email": 6,
      "interval": 3600,
      "limit_per_monitoring": 9,
      "limit_per_test_interface": 5,
      "no_data_severity": 4,
      "no_data_timeout": 5,
      "snmp": 1,
      "template": 7,
      "thr_es_critical": 4,
      "thr_es_critical_clear": 10,
      "thr_es_major": 8,
      "thr_es_major_clear": 9,
      "thr_es_minor": 4,
      "thr_es_minor_clear": 9,
      "thr_es_warning": 2,
      "thr_es_warning_clear": 6,
      "window_size": 3
    },
    {
      "action": "string",
      "email": 10,
      "interval": 3600,
      "limit_per_monitoring": 8,
      "limit_per_test_interface": 9,
      "no_data_severity": 1,
      "no_data_timeout": 9,
      "snmp": 6,
      "template": 7,
      "thr_es_critical": 7,
      "thr_es_critical_clear": 8,
      "thr_es_major": 7,
      "thr_es_major_clear": 1,
      "thr_es_minor": 4,
      "thr_es_minor_clear": 2,
      "thr_es_warning": 9,
      "thr_es_warning_clear": 4,
      "window_size": 3
    }
  ],
  "description": "string",
  "gui_url": "string",
  "id": 10,
  "name": "string",
  "tasks": [
    {
      "config": {},
      "last_3_logs": {
        "logrecords": [
          {
            "level": "string",
            "message": "string"
          },
          {
            "level": "string",
            "message": "string"
          },
          {
            "level": "string",
            "message": "string"
          },
          {
            "level": "string",
            "message": "string"
          },
          {
            "level": "string",
            "message": "string"
          },
          {
            "level": "string",
            "message": "string"
          },
          {
            "level": "string",
            "message": "string"
          },
          {
            "level": "string",
            "message": "string"
          },
          {
            "level": "string",
            "message": "string"
          },
          {
            "level": "string",
            "message": "string"
          }
        ],
        "name": "string"
      },
      "name": "string",
      "other": [
        {},
        {},
        {},
        {},
        {},
        {},
        {},
        {},
        {},
        {}
      ],
      "streams": {},
      "task_type": "string"
    },
    {
      "config": {},
      "last_3_logs": {
        "logrecords": [
          {
            "level": "string",
            "message": "string"
          },
          {
            "level": "string",
            "message": "string"
          },
          {
            "level": "string",
            "message": "string"
          },
          {
            "level": "string",
            "message": "string"
          },
          {
            "level": "string",
            "message": "string"
          },
          {
            "level": "string",
            "message": "string"
          },
          {
            "level": "string",
            "message": "string"
          },
          {
            "level": "string",
            "message": "string"
          }
        ],
        "name": "string"
      },
      "name": "string",
      "other": [
        {},
        {},
        {},
        {}
      ],
      "streams": {},
      "task_type": "string"
    },
    {
      "config": {},
      "last_3_logs": {
        "logrecords": [
          {
            "level": "string",
            "message": "string"
          },
          {
            "level": "string",
            "message": "string"
          },
          {
            "level": "string",
            "message": "string"
          },
          {
            "level": "string",
            "message": "string"
          },
          {
            "level": "string",
            "message": "string"
          },
          {
            "level": "string",
            "message": "string"
          }
        ],
        "name": "string"
      },
      "name": "string",
      "other": [
        {},
        {},
        {},
        {},
        {},
        {},
        {}
      ],
      "streams": {},
      "task_type": "string"
    }
  ],
  "template_id": 8
}