{
  "$id": "schema.json",
  "type": "object",
  "schema": "http://json-schema.org/draft-07/schema#",
  "translate": true,
  "dynamicfields": true,
  "properties": {
    "ph_request_type": {
      "type": "string",
      "description": "type of request (internal to adapter)",
      "default": "listAlarmTemplates",
      "enum": [
        "listAlarmTemplates",
        "createAlarmTemplates",
        "deleteAlarmTemplate",
        "getAlarmTemplate",
        "updateAlarmTemplate"
      ],
      "external_name": "ph_request_type"
    },
    "alarmTemplateId": {
      "type": "number",
      "description": "Alarm Template id",
      "parse": false,
      "encode": false,
      "encrypt": {
        "type": "AES",
        "key": ""
      },
      "external_name": "alarm_template_id"
    }
  },
  "definitions": {}
}