{
  "id": 9,
  "name": "string",
  "type_id": "string",
  "version": "string",
  "config": {
    "category": "string",
    "description": "string",
    "display_name": "string",
    "type_id": "string",
    "version": "string",
    "config": {
      "monitor": {
        "name": "string",
        "class": "string",
        "port": "string",
        "authentication_type": "string",
        "basic_auth_static": {
          "username": "string",
          "password": "string"
        },
        "use_ssl": false,
        "accept_all_json": true,
        "lists_contain_multiple_events": true,
        "num_threads": 1,
        "rest_response_mode": "string",
        "rpc_response_timeout": 5
      },
      "constants": {
        "severity": {
          "0": 7,
          "1": 8,
          "2": 8,
          "3": 9,
          "4": 1,
          "5": 10,
          "CLEAR": 1,
          "INDETERMINATE": 7,
          "WARNING": 3,
          "MINOR": 10,
          "MAJOR": 9,
          "CRITICAL": 3,
          "moog_lookup_default": 3
        }
      },
      "conversions": {
        "sevConverter": {
          "input": "string",
          "output": "string",
          "lookup": "string"
        },
        "stringToInt": {
          "input": "string",
          "output": "string"
        }
      },
      "filter": {
        "presend": "string",
        "modules": [
          {},
          {},
          {},
          {},
          {},
          {}
        ],
        "dependencies": {
          "lambot": [
            {},
            {},
            {},
            {},
            {},
            {},
            {}
          ],
          "contrib": [
            {},
            {},
            {},
            {},
            {},
            {},
            {},
            {},
            {}
          ]
        }
      },
      "mapping": {
        "lambotOverridden": [
          {}
        ],
        "catchAll": "string",
        "rules": [
          {
            "name": "string",
            "rule": "string",
            "conversion": "string"
          },
          {
            "name": "string",
            "rule": "string",
            "conversion": "string"
          },
          {
            "name": "string",
            "rule": "string",
            "conversion": "string"
          },
          {
            "name": "string",
            "rule": "string",
            "conversion": "string"
          },
          {
            "name": "string",
            "rule": "string",
            "conversion": "string"
          },
          {
            "name": "string",
            "rule": "string",
            "conversion": "string"
          },
          {
            "name": "string",
            "rule": "string",
            "conversion": "string"
          },
          {
            "name": "string",
            "rule": "string",
            "conversion": "string"
          },
          {
            "name": "string",
            "rule": "string",
            "conversion": "string"
          },
          {
            "name": "string",
            "rule": "string",
            "conversion": "string"
          }
        ]
      }
    },
    "ha_profile": "string"
  },
  "inputs": [
    {
      "key": "string",
      "value": "string"
    },
    {
      "key": "string",
      "value": "string"
    },
    {
      "key": "string",
      "value": "string"
    },
    {
      "key": "string",
      "value": "string"
    },
    {
      "key": "string",
      "value": "string"
    },
    {
      "key": "string",
      "value": "string"
    },
    {
      "key": "string",
      "value": "string"
    },
    {
      "key": "string",
      "value": "string"
    },
    {
      "key": "string",
      "value": "string"
    }
  ],
  "readonly": [
    {
      "name": "string",
      "description": "string",
      "value": "string"
    },
    {
      "name": "string",
      "description": "string",
      "value": "string"
    },
    {
      "name": "string",
      "description": "string",
      "value": "string"
    }
  ]
}