{
  "system_summary": {
    "total_events": 4,
    "open_sitns": 8,
    "avg_events_per_sitn": 8,
    "open_sitns_up": 9,
    "open_sitns_down": 10,
    "avg_alerts_per_sitn": 4,
    "open_sigs_unassigned": 2,
    "timestamp": 7
  }
}