{
  "name": "adapter-moogsoft",
  "webName": "Adapter for Integration to Moogsoft",
  "supportLevel": "community",
  "vendor": "Moogsoft",
  "product": "Moogsoft",
  "techAlliance": false,
  "osVersion": [],
  "apiVersions": [],
  "iapVersions": [
    "2021.1.x",
    "2021.2.x",
    "2022.1.x",
    "2023.1.x"
  ],
  "method": "REST",
  "type": "Adapter",
  "domains": [
    "AIOps",
    "Service Assurance"
  ],
  "tags": [
    "Monitoring & Troubleshooting"
  ],
  "useCases": [
    "Add Device to Monitoring",
    "Automated network data gathering for diagnostics",
    "Verify network connectivity"
  ],
  "deprecated": {
    "isDeprecated": false
  },
  "brokerSince": "",
  "authMethods": [
    {
      "type": "Basic Auth",
      "primary": true
    },
    {
      "type": "Token",
      "primary": false
    }
  ],
  "documentation": {
    "storeLink": "",
    "npmLink": "https://www.npmjs.com/package/@itentialopensource/adapter-moogsoft",
    "repoLink": "https://gitlab.com/itentialopensource/adapters/adapter-moogsoft",
    "docLink": "https://gitlab.com/itentialopensource/adapters/adapter-moogsoft/-/blob/master/README.md?ref_type=heads",
    "demoLinks": [],
    "trainingLinks": [
      {
        "title": "Itential Academy",
        "link": "https://www.itential.com/itential-academy/"
      }
    ],
    "faqLink": "https://docs.itential.com/opensource/docs/troubleshooting-an-adapter",
    "contributeLink": "https://gitlab.com/itentialopensource/adapters/contributing-guide",
    "issueLink": "https://itential.atlassian.net/servicedesk/customer/portals",
    "webLink": "https://www.itential.com/adapters/moogsoft/",
    "vendorLink": "https://www.moogsoft.com/",
    "productLink": "https://www.moogsoft.com/",
    "apiLinks": [
      {
        "title": "Moogsoft Graze API",
        "link": "https://docs.moogsoft.com/Enterprise.8.0.0/en/graze-api-endpoint-reference.html"
      }
    ],
    "workshopLinks": [],
    "workshopHomePage": "https://www.itential.com/get-started/"
  },
  "assets": [],
  "relatedItems": {
    "adapters": [],
    "integrations": [],
    "ecosystemApplications": [],
    "workflowProjects": [],
    "transformationProjects": [],
    "exampleProjects": []
  }
}