{
  "sitn_id": 2,
  "resolving_entries": [
    {
      "entry_text": "string",
      "user_id": 1,
      "thread_name": "string",
      "time": 8,
      "entry_id": 5
    },
    {
      "entry_text": "string",
      "user_id": 3,
      "thread_name": "string",
      "time": 9,
      "entry_id": 3
    },
    {
      "entry_text": "string",
      "user_id": 6,
      "thread_name": "string",
      "time": 3,
      "entry_id": 2
    },
    {
      "entry_text": "string",
      "user_id": 10,
      "thread_name": "string",
      "time": 6,
      "entry_id": 2
    },
    {
      "entry_text": "string",
      "user_id": 10,
      "thread_name": "string",
      "time": 6,
      "entry_id": 6
    },
    {
      "entry_text": "string",
      "user_id": 7,
      "thread_name": "string",
      "time": 6,
      "entry_id": 8
    },
    {
      "entry_text": "string",
      "user_id": 6,
      "thread_name": "string",
      "time": 5,
      "entry_id": 9
    },
    {
      "entry_text": "string",
      "user_id": 5,
      "thread_name": "string",
      "time": 9,
      "entry_id": 7
    },
    {
      "entry_text": "string",
      "user_id": 10,
      "thread_name": "string",
      "time": 2,
      "entry_id": 5
    },
    {
      "entry_text": "string",
      "user_id": 7,
      "thread_name": "string",
      "time": 2,
      "entry_id": 1
    }
  ]
}