{
  "actions": [
    {
      "name": "createWorkflow",
      "protocol": "REST",
      "method": "POST",
      "entitypath": "{base_path}/{version}/createWorkflow?{query}",
      "requestSchema": "schema.json",
      "responseSchema": "schema.json",
      "timeout": 0,
      "sendEmpty": false,
      "sendGetBody": false,
      "requestDatatype": "JSON",
      "responseDatatype": "JSON",
      "headers": {},
      "responseObjects": [
        {
          "type": "default",
          "key": "",
          "mockFile": "mockdatafiles/createWorkflow-default.json"
        }
      ]
    },
    {
      "name": "deleteWorkflow",
      "protocol": "REST",
      "method": "POST",
      "entitypath": "{base_path}/{version}/deleteWorkflow?{query}",
      "requestSchema": "schema.json",
      "responseSchema": "schema.json",
      "timeout": 0,
      "sendEmpty": false,
      "sendGetBody": false,
      "requestDatatype": "JSON",
      "responseDatatype": "JSON",
      "headers": {},
      "responseObjects": [
        {
          "type": "default",
          "key": "",
          "mockFile": ""
        }
      ]
    },
    {
      "name": "getWorkflowEngineMoolets",
      "protocol": "REST",
      "method": "GET",
      "entitypath": "{base_path}/{version}/getWorkflowEngineMoolets?{query}",
      "requestSchema": "schema.json",
      "responseSchema": "schema.json",
      "timeout": 0,
      "sendEmpty": false,
      "sendGetBody": false,
      "requestDatatype": "JSON",
      "responseDatatype": "JSON",
      "headers": {},
      "responseObjects": [
        {
          "type": "default",
          "key": "",
          "mockFile": "mockdatafiles/getWorkflowEngineMoolets-default.json"
        }
      ]
    },
    {
      "name": "getWorkflows",
      "protocol": "REST",
      "method": "GET",
      "entitypath": "{base_path}/{version}/getWorkflows?{query}",
      "requestSchema": "schema.json",
      "responseSchema": "schema.json",
      "timeout": 0,
      "sendEmpty": false,
      "sendGetBody": false,
      "requestDatatype": "JSON",
      "responseDatatype": "JSON",
      "headers": {},
      "responseObjects": [
        {
          "type": "default",
          "key": "",
          "mockFile": "mockdatafiles/getWorkflows-default.json"
        }
      ]
    },
    {
      "name": "reorderWorkflows",
      "protocol": "REST",
      "method": "POST",
      "entitypath": "{base_path}/{version}/reorderWorkflows?{query}",
      "requestSchema": "schema.json",
      "responseSchema": "schema.json",
      "timeout": 0,
      "sendEmpty": false,
      "sendGetBody": false,
      "requestDatatype": "JSON",
      "responseDatatype": "JSON",
      "headers": {},
      "responseObjects": [
        {
          "type": "default",
          "key": "",
          "mockFile": ""
        }
      ]
    },
    {
      "name": "updateWorkflow",
      "protocol": "REST",
      "method": "POST",
      "entitypath": "{base_path}/{version}/updateWorkflow?{query}",
      "requestSchema": "schema.json",
      "responseSchema": "schema.json",
      "timeout": 0,
      "sendEmpty": false,
      "sendGetBody": false,
      "requestDatatype": "JSON",
      "responseDatatype": "JSON",
      "headers": {},
      "responseObjects": [
        {
          "type": "default",
          "key": "",
          "mockFile": ""
        }
      ]
    }
  ]
}