{
  "data": [
    {
      "id": "11895626141189566750",
      "localDuplex": "full",
      "localHostname": "L64R8",
      "localIntName": "ether4",
      "localMedia": "no_example",
      "localSn": "+hWeedDBWfK",
      "remoteDuplex": "no_example",
      "remoteHostname": "L64R3",
      "remoteIntName": "simple-1729",
      "remoteMedia": "no_example",
      "remoteSn": "zmf+rPukVJB",
      "siteKey": "1170559087",
      "siteName": "L64",
      "status": 4
    },
    {
      "id": "11895626141189566750",
      "localDuplex": "full",
      "localHostname": "L64R8",
      "localIntName": "ether4",
      "localMedia": "no_example",
      "localSn": "+hWeedDBWfK",
      "remoteDuplex": "no_example",
      "remoteHostname": "L64R3",
      "remoteIntName": "simple-1729",
      "remoteMedia": "no_example",
      "remoteSn": "zmf+rPukVJB",
      "siteKey": "1170559087",
      "siteName": "L64",
      "status": 8
    },
    {
      "id": "11895626141189566750",
      "localDuplex": "full",
      "localHostname": "L64R8",
      "localIntName": "ether4",
      "localMedia": "no_example",
      "localSn": "+hWeedDBWfK",
      "remoteDuplex": "no_example",
      "remoteHostname": "L64R3",
      "remoteIntName": "simple-1729",
      "remoteMedia": "no_example",
      "remoteSn": "zmf+rPukVJB",
      "siteKey": "1170559087",
      "siteName": "L64",
      "status": 3
    },
    {
      "id": "11895626141189566750",
      "localDuplex": "full",
      "localHostname": "L64R8",
      "localIntName": "ether4",
      "localMedia": "no_example",
      "localSn": "+hWeedDBWfK",
      "remoteDuplex": "no_example",
      "remoteHostname": "L64R3",
      "remoteIntName": "simple-1729",
      "remoteMedia": "no_example",
      "remoteSn": "zmf+rPukVJB",
      "siteKey": "1170559087",
      "siteName": "L64",
      "status": 3
    },
    {
      "id": "11895626141189566750",
      "localDuplex": "full",
      "localHostname": "L64R8",
      "localIntName": "ether4",
      "localMedia": "no_example",
      "localSn": "+hWeedDBWfK",
      "remoteDuplex": "no_example",
      "remoteHostname": "L64R3",
      "remoteIntName": "simple-1729",
      "remoteMedia": "no_example",
      "remoteSn": "zmf+rPukVJB",
      "siteKey": "1170559087",
      "siteName": "L64",
      "status": 1
    }
  ],
  "_meta": {
    "limit": 100,
    "start": 7,
    "count": 1,
    "size": 1,
    "snapshot": "41c65f99-8acd-425f-9b3b-496947884f6d"
  }
}