{
  "data": [
    {
      "id": "11895528751189552988",
      "dstHostname": "L1R16",
      "dstSiteKey": "1170558973",
      "dstSiteName": "L1DC",
      "dstSn": "c1fe86417440",
      "dstVrf": "client10",
      "prefix": "10.241.90.14/32",
      "rt": "target:64580:18",
      "srcHostname": "L1R14",
      "srcSiteKey": "1170558973",
      "srcSiteName": "L1DC",
      "srcSn": "VM5B363326A5",
      "srcVrf": "client10"
    },
    {
      "id": "11895528751189552988",
      "dstHostname": "L1R16",
      "dstSiteKey": "1170558973",
      "dstSiteName": "L1DC",
      "dstSn": "c1fe86417440",
      "dstVrf": "client10",
      "prefix": "10.241.90.14/32",
      "rt": "target:64580:18",
      "srcHostname": "L1R14",
      "srcSiteKey": "1170558973",
      "srcSiteName": "L1DC",
      "srcSn": "VM5B363326A5",
      "srcVrf": "client10"
    },
    {
      "id": "11895528751189552988",
      "dstHostname": "L1R16",
      "dstSiteKey": "1170558973",
      "dstSiteName": "L1DC",
      "dstSn": "c1fe86417440",
      "dstVrf": "client10",
      "prefix": "10.241.90.14/32",
      "rt": "target:64580:18",
      "srcHostname": "L1R14",
      "srcSiteKey": "1170558973",
      "srcSiteName": "L1DC",
      "srcSn": "VM5B363326A5",
      "srcVrf": "client10"
    },
    {
      "id": "11895528751189552988",
      "dstHostname": "L1R16",
      "dstSiteKey": "1170558973",
      "dstSiteName": "L1DC",
      "dstSn": "c1fe86417440",
      "dstVrf": "client10",
      "prefix": "10.241.90.14/32",
      "rt": "target:64580:18",
      "srcHostname": "L1R14",
      "srcSiteKey": "1170558973",
      "srcSiteName": "L1DC",
      "srcSn": "VM5B363326A5",
      "srcVrf": "client10"
    },
    {
      "id": "11895528751189552988",
      "dstHostname": "L1R16",
      "dstSiteKey": "1170558973",
      "dstSiteName": "L1DC",
      "dstSn": "c1fe86417440",
      "dstVrf": "client10",
      "prefix": "10.241.90.14/32",
      "rt": "target:64580:18",
      "srcHostname": "L1R14",
      "srcSiteKey": "1170558973",
      "srcSiteName": "L1DC",
      "srcSn": "VM5B363326A5",
      "srcVrf": "client10"
    },
    {
      "id": "11895528751189552988",
      "dstHostname": "L1R16",
      "dstSiteKey": "1170558973",
      "dstSiteName": "L1DC",
      "dstSn": "c1fe86417440",
      "dstVrf": "client10",
      "prefix": "10.241.90.14/32",
      "rt": "target:64580:18",
      "srcHostname": "L1R14",
      "srcSiteKey": "1170558973",
      "srcSiteName": "L1DC",
      "srcSn": "VM5B363326A5",
      "srcVrf": "client10"
    }
  ],
  "_meta": {
    "limit": 100,
    "start": 6,
    "count": 1,
    "size": 1,
    "snapshot": "41c65f99-8acd-425f-9b3b-496947884f6d"
  }
}