{
  "data": [
    {
      "id": "1190561605",
      "bdr": "10.241.1.17",
      "currStateTime": 5356800,
      "devType": "router",
      "dr": "10.241.1.109",
      "hostname": "L1R9",
      "intName": "Et0/0",
      "localAddress": "10.241.1.9",
      "localArea": "0.0.0.0",
      "localCost": 10,
      "neiAddress": "10.241.1.1",
      "neiArea": "0.0.0.0",
      "neiCost": 10,
      "neiDevType": "router",
      "neiHostname": "L1R1",
      "neiId": "10.241.255.1",
      "neiIntName": "Et0/2",
      "neiSn": "10.241.255.1",
      "neiSiteKey": "1068454874",
      "neiSiteName": "L1",
      "priority": 1,
      "siteKey": "1068454874",
      "siteName": "L1",
      "sn": "10.241.255.9",
      "source": "vDevice/1190555634",
      "state": "2WAY",
      "subnet": "10.241.1.0/24",
      "target": "vDevice/1190608756",
      "vrf": "no_example"
    },
    {
      "id": "1190561605",
      "bdr": "10.241.1.17",
      "currStateTime": 5356800,
      "devType": "router",
      "dr": "10.241.1.109",
      "hostname": "L1R9",
      "intName": "Et0/0",
      "localAddress": "10.241.1.9",
      "localArea": "0.0.0.0",
      "localCost": 10,
      "neiAddress": "10.241.1.1",
      "neiArea": "0.0.0.0",
      "neiCost": 10,
      "neiDevType": "router",
      "neiHostname": "L1R1",
      "neiId": "10.241.255.1",
      "neiIntName": "Et0/2",
      "neiSn": "10.241.255.1",
      "neiSiteKey": "1068454874",
      "neiSiteName": "L1",
      "priority": 1,
      "siteKey": "1068454874",
      "siteName": "L1",
      "sn": "10.241.255.9",
      "source": "vDevice/1190555634",
      "state": "2WAY",
      "subnet": "10.241.1.0/24",
      "target": "vDevice/1190608756",
      "vrf": "no_example"
    },
    {
      "id": "1190561605",
      "bdr": "10.241.1.17",
      "currStateTime": 5356800,
      "devType": "router",
      "dr": "10.241.1.109",
      "hostname": "L1R9",
      "intName": "Et0/0",
      "localAddress": "10.241.1.9",
      "localArea": "0.0.0.0",
      "localCost": 10,
      "neiAddress": "10.241.1.1",
      "neiArea": "0.0.0.0",
      "neiCost": 10,
      "neiDevType": "router",
      "neiHostname": "L1R1",
      "neiId": "10.241.255.1",
      "neiIntName": "Et0/2",
      "neiSn": "10.241.255.1",
      "neiSiteKey": "1068454874",
      "neiSiteName": "L1",
      "priority": 1,
      "siteKey": "1068454874",
      "siteName": "L1",
      "sn": "10.241.255.9",
      "source": "vDevice/1190555634",
      "state": "2WAY",
      "subnet": "10.241.1.0/24",
      "target": "vDevice/1190608756",
      "vrf": "no_example"
    },
    {
      "id": "1190561605",
      "bdr": "10.241.1.17",
      "currStateTime": 5356800,
      "devType": "router",
      "dr": "10.241.1.109",
      "hostname": "L1R9",
      "intName": "Et0/0",
      "localAddress": "10.241.1.9",
      "localArea": "0.0.0.0",
      "localCost": 10,
      "neiAddress": "10.241.1.1",
      "neiArea": "0.0.0.0",
      "neiCost": 10,
      "neiDevType": "router",
      "neiHostname": "L1R1",
      "neiId": "10.241.255.1",
      "neiIntName": "Et0/2",
      "neiSn": "10.241.255.1",
      "neiSiteKey": "1068454874",
      "neiSiteName": "L1",
      "priority": 1,
      "siteKey": "1068454874",
      "siteName": "L1",
      "sn": "10.241.255.9",
      "source": "vDevice/1190555634",
      "state": "2WAY",
      "subnet": "10.241.1.0/24",
      "target": "vDevice/1190608756",
      "vrf": "no_example"
    },
    {
      "id": "1190561605",
      "bdr": "10.241.1.17",
      "currStateTime": 5356800,
      "devType": "router",
      "dr": "10.241.1.109",
      "hostname": "L1R9",
      "intName": "Et0/0",
      "localAddress": "10.241.1.9",
      "localArea": "0.0.0.0",
      "localCost": 10,
      "neiAddress": "10.241.1.1",
      "neiArea": "0.0.0.0",
      "neiCost": 10,
      "neiDevType": "router",
      "neiHostname": "L1R1",
      "neiId": "10.241.255.1",
      "neiIntName": "Et0/2",
      "neiSn": "10.241.255.1",
      "neiSiteKey": "1068454874",
      "neiSiteName": "L1",
      "priority": 1,
      "siteKey": "1068454874",
      "siteName": "L1",
      "sn": "10.241.255.9",
      "source": "vDevice/1190555634",
      "state": "2WAY",
      "subnet": "10.241.1.0/24",
      "target": "vDevice/1190608756",
      "vrf": "no_example"
    },
    {
      "id": "1190561605",
      "bdr": "10.241.1.17",
      "currStateTime": 5356800,
      "devType": "router",
      "dr": "10.241.1.109",
      "hostname": "L1R9",
      "intName": "Et0/0",
      "localAddress": "10.241.1.9",
      "localArea": "0.0.0.0",
      "localCost": 10,
      "neiAddress": "10.241.1.1",
      "neiArea": "0.0.0.0",
      "neiCost": 10,
      "neiDevType": "router",
      "neiHostname": "L1R1",
      "neiId": "10.241.255.1",
      "neiIntName": "Et0/2",
      "neiSn": "10.241.255.1",
      "neiSiteKey": "1068454874",
      "neiSiteName": "L1",
      "priority": 1,
      "siteKey": "1068454874",
      "siteName": "L1",
      "sn": "10.241.255.9",
      "source": "vDevice/1190555634",
      "state": "2WAY",
      "subnet": "10.241.1.0/24",
      "target": "vDevice/1190608756",
      "vrf": "no_example"
    },
    {
      "id": "1190561605",
      "bdr": "10.241.1.17",
      "currStateTime": 5356800,
      "devType": "router",
      "dr": "10.241.1.109",
      "hostname": "L1R9",
      "intName": "Et0/0",
      "localAddress": "10.241.1.9",
      "localArea": "0.0.0.0",
      "localCost": 10,
      "neiAddress": "10.241.1.1",
      "neiArea": "0.0.0.0",
      "neiCost": 10,
      "neiDevType": "router",
      "neiHostname": "L1R1",
      "neiId": "10.241.255.1",
      "neiIntName": "Et0/2",
      "neiSn": "10.241.255.1",
      "neiSiteKey": "1068454874",
      "neiSiteName": "L1",
      "priority": 1,
      "siteKey": "1068454874",
      "siteName": "L1",
      "sn": "10.241.255.9",
      "source": "vDevice/1190555634",
      "state": "2WAY",
      "subnet": "10.241.1.0/24",
      "target": "vDevice/1190608756",
      "vrf": "no_example"
    },
    {
      "id": "1190561605",
      "bdr": "10.241.1.17",
      "currStateTime": 5356800,
      "devType": "router",
      "dr": "10.241.1.109",
      "hostname": "L1R9",
      "intName": "Et0/0",
      "localAddress": "10.241.1.9",
      "localArea": "0.0.0.0",
      "localCost": 10,
      "neiAddress": "10.241.1.1",
      "neiArea": "0.0.0.0",
      "neiCost": 10,
      "neiDevType": "router",
      "neiHostname": "L1R1",
      "neiId": "10.241.255.1",
      "neiIntName": "Et0/2",
      "neiSn": "10.241.255.1",
      "neiSiteKey": "1068454874",
      "neiSiteName": "L1",
      "priority": 1,
      "siteKey": "1068454874",
      "siteName": "L1",
      "sn": "10.241.255.9",
      "source": "vDevice/1190555634",
      "state": "2WAY",
      "subnet": "10.241.1.0/24",
      "target": "vDevice/1190608756",
      "vrf": "no_example"
    },
    {
      "id": "1190561605",
      "bdr": "10.241.1.17",
      "currStateTime": 5356800,
      "devType": "router",
      "dr": "10.241.1.109",
      "hostname": "L1R9",
      "intName": "Et0/0",
      "localAddress": "10.241.1.9",
      "localArea": "0.0.0.0",
      "localCost": 10,
      "neiAddress": "10.241.1.1",
      "neiArea": "0.0.0.0",
      "neiCost": 10,
      "neiDevType": "router",
      "neiHostname": "L1R1",
      "neiId": "10.241.255.1",
      "neiIntName": "Et0/2",
      "neiSn": "10.241.255.1",
      "neiSiteKey": "1068454874",
      "neiSiteName": "L1",
      "priority": 1,
      "siteKey": "1068454874",
      "siteName": "L1",
      "sn": "10.241.255.9",
      "source": "vDevice/1190555634",
      "state": "2WAY",
      "subnet": "10.241.1.0/24",
      "target": "vDevice/1190608756",
      "vrf": "no_example"
    }
  ],
  "_meta": {
    "limit": 100,
    "start": 2,
    "count": 1,
    "size": 1,
    "snapshot": "41c65f99-8acd-425f-9b3b-496947884f6d"
  }
}