{
  "allowTelnet": true,
  "backup": {
    "cron": "0 23 * * *",
    "enabled": false,
    "server": "backup.server.io",
    "type": "ftp",
    "username": "username",
    "password": "password"
  },
  "checkSavedConfig": true,
  "cliRetryLimit": {
    "authFail": 2,
    "default": 3,
    "tacacs": {
      "delay": 1000,
      "retry": 1
    }
  },
  "cliSessionsLimit": {
    "enabled": false,
    "limit": 5
  },
  "credentials": [
    {
      "excludeNetworks": [
        "1.1.1.1/32",
        "8.8.8.8/32"
      ],
      "network": [
        "192.168.0.0/16",
        "10.0.0.0/8"
      ],
      "expirationDate": {
        "enabled": true,
        "value": {}
      },
      "id": "9a5340e5-ef75-4962-a694-fb7a683f8e2a",
      "priority": 1,
      "password": "password",
      "syslog": true
    },
    {
      "excludeNetworks": [],
      "network": [],
      "expirationDate": {
        "enabled": false
      },
      "id": "sdf340e5-ef75-4962-a694-fb7a6asd8e2a",
      "priority": 2,
      "syslog": true
    }
  ],
  "privileges": [
    {
      "excludeNetworks": [],
      "expirationDate": {
        "enabled": false
      },
      "id": "3233fd2a-3036-4dd5-9845-e984e9238c00",
      "includeNetworks": [
        "0.0.0.0/0"
      ],
      "notes": "Main Enable password",
      "password": "829ec229e38314",
      "priority": 1,
      "username": ""
    }
  ],
  "customerName": "Test Customer",
  "fullBgpLimit": {
    "enabled": true,
    "threshold": 10000
  },
  "limitDiscoveryTasks": {
    "alreadyDiscovered": false,
    "sourceOfTasks": [
      "xdp",
      "arp",
      "routes",
      "trace"
    ]
  },
  "maintenance": {
    "cron": "0 0 * * *",
    "enabled": true
  },
  "networks": {
    "exclude": [
      "8.8.8.8/32"
    ],
    "include": [
      "0.0.0.0/0"
    ],
    "properties": {
      "exclude": {
        "type": "array",
        "items": {
          "type": "string",
          "format": "ipv4"
        }
      },
      "include": {
        "type": "array",
        "items": {
          "type": "string",
          "format": "ipv4"
        }
      }
    }
  },
  "resolveNames": {
    "discoveryDevices": true
  },
  "scanner": {
    "enabled": false,
    "shortestMask": 20
  },
  "seedList": [
    "192.168.110.3",
    "10.47.255.101"
  ],
  "siteSeparation": [
    {
      "id": "90b7dd11-1ab2-42c9-8665-0b137afe50a0",
      "note": "L1DC",
      "regex": "L1(?:R1[4-8]|R7|FW56|SW[3-4])",
      "siteName": "L1DC",
      "transformation": "uppercase",
      "type": "regex"
    },
    {
      "id": "8680156c-bfc6-4a76-92f9-d0f8f5a7c0e5",
      "note": "MAIN REGEX Rule",
      "regex": "^(\\w\\d{1,3}|HWLAB|HUA)",
      "transformation": "uppercase",
      "type": "regex"
    }
  ],
  "siteTypeCalc": "rules",
  "snapshots": {
    "cron": "0 * * * *",
    "enabled": false,
    "maxLoaded": 3,
    "maxLocked": 1
  },
  "snmp": {
    "communityString": "community04",
    "enabled": false,
    "hostIp": "192.168.10.10",
    "locality": "Prague, DC",
    "systemContact": "Mr. Johnson",
    "username": "snmpUser",
    "version": "v2c"
  },
  "syslog": {
    "cron": "0 0 * * *",
    "time": 60,
    "trigger": "syslogtrigger"
  },
  "timeouts": {
    "login": 60,
    "session": 60
  },
  "traceroute": {
    "protocol": "icmp",
    "scope": [
      "10.0.0.0/8",
      "100.64.0.0/10",
      "169.254.0.0/16",
      "172.16.0.0/12",
      "192.168.0.0/16"
    ]
  }
}