{
  "data": [
    {
      "id": "119062065511906087561190610657",
      "active": "local",
      "count": 2,
      "group": 1,
      "hostname": "L1R1",
      "intName": "Et0/0",
      "priority": 110,
      "preempt": "disabled",
      "protocol": "hsrp",
      "siteKey": "1068454874",
      "siteName": "L1",
      "sn": "10.241.255.1",
      "standby": "10.0.41.102",
      "state": "active",
      "virtualIp": "10.0.41.100",
      "vrf": "no_example",
      "version": 2
    },
    {
      "id": "119062065511906087561190610657",
      "active": "local",
      "count": 2,
      "group": 1,
      "hostname": "L1R1",
      "intName": "Et0/0",
      "priority": 110,
      "preempt": "disabled",
      "protocol": "hsrp",
      "siteKey": "1068454874",
      "siteName": "L1",
      "sn": "10.241.255.1",
      "standby": "10.0.41.102",
      "state": "active",
      "virtualIp": "10.0.41.100",
      "vrf": "no_example",
      "version": 2
    }
  ],
  "_meta": {
    "limit": 100,
    "start": 4,
    "count": 1,
    "size": 1,
    "snapshot": "41c65f99-8acd-425f-9b3b-496947884f6d"
  }
}