[
  {
    "id": 1118883189,
    "downloadFile": "/home/autoboss/files/snapshotDownload-1118879496.tar",
    "finishedAt": 1605192121070,
    "isDone": true,
    "name": "snapshotDownload",
    "scheduledAt": 1605191436414,
    "snapshot": "string",
    "startedAt": 1605171771147,
    "status": "done",
    "username": "admin"
  },
  {
    "id": 1118883189,
    "downloadFile": "/home/autoboss/files/snapshotDownload-1118879496.tar",
    "finishedAt": 1605192121070,
    "isDone": true,
    "name": "snapshotDownload",
    "scheduledAt": 1605191436414,
    "snapshot": "string",
    "startedAt": 1605171771147,
    "status": "done",
    "username": "admin"
  },
  {
    "id": 1118883189,
    "downloadFile": "/home/autoboss/files/snapshotDownload-1118879496.tar",
    "finishedAt": 1605192121070,
    "isDone": true,
    "name": "snapshotDownload",
    "scheduledAt": 1605191436414,
    "snapshot": "string",
    "startedAt": 1605171771147,
    "status": "done",
    "username": "admin"
  },
  {
    "id": 1118883189,
    "downloadFile": "/home/autoboss/files/snapshotDownload-1118879496.tar",
    "finishedAt": 1605192121070,
    "isDone": true,
    "name": "snapshotDownload",
    "scheduledAt": 1605191436414,
    "snapshot": "string",
    "startedAt": 1605171771147,
    "status": "done",
    "username": "admin"
  }
]