{
  "data": [
    {
      "id": "1189551866",
      "hostname": "L64R8",
      "inBytesRate": "no_example",
      "inDropsPktsPct": 5,
      "inDropsRate": 4,
      "inImpactDrops": 4,
      "siteKey": "1170559087",
      "siteName": "L64",
      "sn": "+hWeedDBWfK"
    },
    {
      "id": "1189551866",
      "hostname": "L64R8",
      "inBytesRate": "no_example",
      "inDropsPktsPct": 8,
      "inDropsRate": 1,
      "inImpactDrops": 1,
      "siteKey": "1170559087",
      "siteName": "L64",
      "sn": "+hWeedDBWfK"
    },
    {
      "id": "1189551866",
      "hostname": "L64R8",
      "inBytesRate": "no_example",
      "inDropsPktsPct": 10,
      "inDropsRate": 3,
      "inImpactDrops": 4,
      "siteKey": "1170559087",
      "siteName": "L64",
      "sn": "+hWeedDBWfK"
    },
    {
      "id": "1189551866",
      "hostname": "L64R8",
      "inBytesRate": "no_example",
      "inDropsPktsPct": 9,
      "inDropsRate": 3,
      "inImpactDrops": 3,
      "siteKey": "1170559087",
      "siteName": "L64",
      "sn": "+hWeedDBWfK"
    },
    {
      "id": "1189551866",
      "hostname": "L64R8",
      "inBytesRate": "no_example",
      "inDropsPktsPct": 8,
      "inDropsRate": 6,
      "inImpactDrops": 2,
      "siteKey": "1170559087",
      "siteName": "L64",
      "sn": "+hWeedDBWfK"
    },
    {
      "id": "1189551866",
      "hostname": "L64R8",
      "inBytesRate": "no_example",
      "inDropsPktsPct": 5,
      "inDropsRate": 10,
      "inImpactDrops": 1,
      "siteKey": "1170559087",
      "siteName": "L64",
      "sn": "+hWeedDBWfK"
    },
    {
      "id": "1189551866",
      "hostname": "L64R8",
      "inBytesRate": "no_example",
      "inDropsPktsPct": 6,
      "inDropsRate": 7,
      "inImpactDrops": 6,
      "siteKey": "1170559087",
      "siteName": "L64",
      "sn": "+hWeedDBWfK"
    },
    {
      "id": "1189551866",
      "hostname": "L64R8",
      "inBytesRate": "no_example",
      "inDropsPktsPct": 2,
      "inDropsRate": 3,
      "inImpactDrops": 9,
      "siteKey": "1170559087",
      "siteName": "L64",
      "sn": "+hWeedDBWfK"
    }
  ],
  "_meta": {
    "limit": 100,
    "start": 5,
    "count": 1,
    "size": 1,
    "snapshot": "41c65f99-8acd-425f-9b3b-496947884f6d"
  }
}