{
  "data": [
    {
      "id": "1189634857",
      "avgPkt": 10,
      "group": "(*, 224.0.0.0)",
      "groupNet": "224.0.0.0/4",
      "hostname": "L77R5-SPINE1",
      "inIntName": "Null",
      "inPkts": 2,
      "inPktsRate": 1,
      "otherErr": 10,
      "otherErrRate": 2,
      "outPkts": 5,
      "outPktsRate": 7,
      "rpfErr": 7,
      "rpfErrRate": 8,
      "rpfNeiIp": "0.0.0.0",
      "siteKey": "1068455057",
      "siteName": "L77",
      "sn": "10.77.255.5",
      "sourceNet": "0.0.0.0/0",
      "vrf": "default"
    },
    {
      "id": "1189634857",
      "avgPkt": 2,
      "group": "(*, 224.0.0.0)",
      "groupNet": "224.0.0.0/4",
      "hostname": "L77R5-SPINE1",
      "inIntName": "Null",
      "inPkts": 8,
      "inPktsRate": 9,
      "otherErr": 2,
      "otherErrRate": 2,
      "outPkts": 4,
      "outPktsRate": 2,
      "rpfErr": 2,
      "rpfErrRate": 5,
      "rpfNeiIp": "0.0.0.0",
      "siteKey": "1068455057",
      "siteName": "L77",
      "sn": "10.77.255.5",
      "sourceNet": "0.0.0.0/0",
      "vrf": "default"
    },
    {
      "id": "1189634857",
      "avgPkt": 4,
      "group": "(*, 224.0.0.0)",
      "groupNet": "224.0.0.0/4",
      "hostname": "L77R5-SPINE1",
      "inIntName": "Null",
      "inPkts": 4,
      "inPktsRate": 1,
      "otherErr": 6,
      "otherErrRate": 10,
      "outPkts": 2,
      "outPktsRate": 7,
      "rpfErr": 4,
      "rpfErrRate": 4,
      "rpfNeiIp": "0.0.0.0",
      "siteKey": "1068455057",
      "siteName": "L77",
      "sn": "10.77.255.5",
      "sourceNet": "0.0.0.0/0",
      "vrf": "default"
    },
    {
      "id": "1189634857",
      "avgPkt": 6,
      "group": "(*, 224.0.0.0)",
      "groupNet": "224.0.0.0/4",
      "hostname": "L77R5-SPINE1",
      "inIntName": "Null",
      "inPkts": 6,
      "inPktsRate": 3,
      "otherErr": 8,
      "otherErrRate": 3,
      "outPkts": 2,
      "outPktsRate": 5,
      "rpfErr": 3,
      "rpfErrRate": 4,
      "rpfNeiIp": "0.0.0.0",
      "siteKey": "1068455057",
      "siteName": "L77",
      "sn": "10.77.255.5",
      "sourceNet": "0.0.0.0/0",
      "vrf": "default"
    },
    {
      "id": "1189634857",
      "avgPkt": 10,
      "group": "(*, 224.0.0.0)",
      "groupNet": "224.0.0.0/4",
      "hostname": "L77R5-SPINE1",
      "inIntName": "Null",
      "inPkts": 1,
      "inPktsRate": 4,
      "otherErr": 7,
      "otherErrRate": 6,
      "outPkts": 6,
      "outPktsRate": 8,
      "rpfErr": 8,
      "rpfErrRate": 10,
      "rpfNeiIp": "0.0.0.0",
      "siteKey": "1068455057",
      "siteName": "L77",
      "sn": "10.77.255.5",
      "sourceNet": "0.0.0.0/0",
      "vrf": "default"
    },
    {
      "id": "1189634857",
      "avgPkt": 6,
      "group": "(*, 224.0.0.0)",
      "groupNet": "224.0.0.0/4",
      "hostname": "L77R5-SPINE1",
      "inIntName": "Null",
      "inPkts": 9,
      "inPktsRate": 5,
      "otherErr": 10,
      "otherErrRate": 10,
      "outPkts": 10,
      "outPktsRate": 1,
      "rpfErr": 1,
      "rpfErrRate": 8,
      "rpfNeiIp": "0.0.0.0",
      "siteKey": "1068455057",
      "siteName": "L77",
      "sn": "10.77.255.5",
      "sourceNet": "0.0.0.0/0",
      "vrf": "default"
    }
  ],
  "_meta": {
    "limit": 100,
    "start": 2,
    "count": 1,
    "size": 1,
    "snapshot": "41c65f99-8acd-425f-9b3b-496947884f6d"
  }
}