{
  "data": [
    {
      "id": "3e6abe90-ed16-40cd-9963-3830d11c9871",
      "connectionCount": 3694,
      "deviceCount": 612,
      "interfaceActiveCount": 5502,
      "interfaceCount": 7494,
      "interfaceEdgeCount": 512,
      "isLastSnapshot": "no_example",
      "managedIpCount": 1,
      "partNumbersCount": 823,
      "status": "done",
      "tsChange": 1606612484722,
      "tsEnd": 1606231778379,
      "tsStart": 1606231091992,
      "userCount": 1180
    },
    {
      "id": "3e6abe90-ed16-40cd-9963-3830d11c9871",
      "connectionCount": 3694,
      "deviceCount": 612,
      "interfaceActiveCount": 5502,
      "interfaceCount": 7494,
      "interfaceEdgeCount": 512,
      "isLastSnapshot": "no_example",
      "managedIpCount": 1,
      "partNumbersCount": 823,
      "status": "done",
      "tsChange": 1606612484722,
      "tsEnd": 1606231778379,
      "tsStart": 1606231091992,
      "userCount": 1180
    },
    {
      "id": "3e6abe90-ed16-40cd-9963-3830d11c9871",
      "connectionCount": 3694,
      "deviceCount": 612,
      "interfaceActiveCount": 5502,
      "interfaceCount": 7494,
      "interfaceEdgeCount": 512,
      "isLastSnapshot": "no_example",
      "managedIpCount": 3,
      "partNumbersCount": 823,
      "status": "done",
      "tsChange": 1606612484722,
      "tsEnd": 1606231778379,
      "tsStart": 1606231091992,
      "userCount": 1180
    }
  ],
  "_meta": {
    "limit": 100,
    "start": 5,
    "count": 1,
    "size": 1,
    "snapshot": "41c65f99-8acd-425f-9b3b-496947884f6d"
  }
}