{
  "data": [
    {
      "id": "1189554694",
      "ac": [
        [
          "ge-0/0/3.44"
        ],
        [
          "ge-0/0/3.44"
        ],
        [
          "ge-0/0/3.44"
        ],
        [
          "ge-0/0/3.44"
        ],
        [
          "ge-0/0/3.44"
        ],
        [
          "ge-0/0/3.44"
        ],
        [
          "ge-0/0/3.44"
        ],
        [
          "ge-0/0/3.44"
        ]
      ],
      "hostname": "L67JR7",
      "localLabel": 299936,
      "name": "vlan_44",
      "neiHostname": "L67JR8",
      "neiSiteKey": "1170559021",
      "neiSiteName": "L67",
      "neiSn": "VM5E36ED4A63",
      "neiIp": "10.67.255.108",
      "receiveLsp": "JR8-TO-JR7",
      "remoteLabel": 299952,
      "siteKey": "1170559021",
      "siteName": "L67",
      "sn": "VM5E3462CF6F",
      "state": "up",
      "stateOrig": "no_example",
      "timeLastUp": "Jul 27 13:32:35",
      "transmitLsp": "JR7-TO-JR8",
      "upTrans": 1
    },
    {
      "id": "1189554694",
      "ac": [
        [
          "ge-0/0/3.44"
        ],
        [
          "ge-0/0/3.44"
        ],
        [
          "ge-0/0/3.44"
        ],
        [
          "ge-0/0/3.44"
        ],
        [
          "ge-0/0/3.44"
        ],
        [
          "ge-0/0/3.44"
        ],
        [
          "ge-0/0/3.44"
        ],
        [
          "ge-0/0/3.44"
        ],
        [
          "ge-0/0/3.44"
        ],
        [
          "ge-0/0/3.44"
        ]
      ],
      "hostname": "L67JR7",
      "localLabel": 299936,
      "name": "vlan_44",
      "neiHostname": "L67JR8",
      "neiSiteKey": "1170559021",
      "neiSiteName": "L67",
      "neiSn": "VM5E36ED4A63",
      "neiIp": "10.67.255.108",
      "receiveLsp": "JR8-TO-JR7",
      "remoteLabel": 299952,
      "siteKey": "1170559021",
      "siteName": "L67",
      "sn": "VM5E3462CF6F",
      "state": "up",
      "stateOrig": "no_example",
      "timeLastUp": "Jul 27 13:32:35",
      "transmitLsp": "JR7-TO-JR8",
      "upTrans": 1
    },
    {
      "id": "1189554694",
      "ac": [
        [
          "ge-0/0/3.44"
        ]
      ],
      "hostname": "L67JR7",
      "localLabel": 299936,
      "name": "vlan_44",
      "neiHostname": "L67JR8",
      "neiSiteKey": "1170559021",
      "neiSiteName": "L67",
      "neiSn": "VM5E36ED4A63",
      "neiIp": "10.67.255.108",
      "receiveLsp": "JR8-TO-JR7",
      "remoteLabel": 299952,
      "siteKey": "1170559021",
      "siteName": "L67",
      "sn": "VM5E3462CF6F",
      "state": "up",
      "stateOrig": "no_example",
      "timeLastUp": "Jul 27 13:32:35",
      "transmitLsp": "JR7-TO-JR8",
      "upTrans": 1
    },
    {
      "id": "1189554694",
      "ac": [
        [
          "ge-0/0/3.44"
        ],
        [
          "ge-0/0/3.44"
        ],
        [
          "ge-0/0/3.44"
        ],
        [
          "ge-0/0/3.44"
        ],
        [
          "ge-0/0/3.44"
        ],
        [
          "ge-0/0/3.44"
        ]
      ],
      "hostname": "L67JR7",
      "localLabel": 299936,
      "name": "vlan_44",
      "neiHostname": "L67JR8",
      "neiSiteKey": "1170559021",
      "neiSiteName": "L67",
      "neiSn": "VM5E36ED4A63",
      "neiIp": "10.67.255.108",
      "receiveLsp": "JR8-TO-JR7",
      "remoteLabel": 299952,
      "siteKey": "1170559021",
      "siteName": "L67",
      "sn": "VM5E3462CF6F",
      "state": "up",
      "stateOrig": "no_example",
      "timeLastUp": "Jul 27 13:32:35",
      "transmitLsp": "JR7-TO-JR8",
      "upTrans": 1
    },
    {
      "id": "1189554694",
      "ac": [
        [
          "ge-0/0/3.44"
        ],
        [
          "ge-0/0/3.44"
        ],
        [
          "ge-0/0/3.44"
        ],
        [
          "ge-0/0/3.44"
        ],
        [
          "ge-0/0/3.44"
        ]
      ],
      "hostname": "L67JR7",
      "localLabel": 299936,
      "name": "vlan_44",
      "neiHostname": "L67JR8",
      "neiSiteKey": "1170559021",
      "neiSiteName": "L67",
      "neiSn": "VM5E36ED4A63",
      "neiIp": "10.67.255.108",
      "receiveLsp": "JR8-TO-JR7",
      "remoteLabel": 299952,
      "siteKey": "1170559021",
      "siteName": "L67",
      "sn": "VM5E3462CF6F",
      "state": "up",
      "stateOrig": "no_example",
      "timeLastUp": "Jul 27 13:32:35",
      "transmitLsp": "JR7-TO-JR8",
      "upTrans": 1
    },
    {
      "id": "1189554694",
      "ac": [
        [
          "ge-0/0/3.44"
        ],
        [
          "ge-0/0/3.44"
        ],
        [
          "ge-0/0/3.44"
        ],
        [
          "ge-0/0/3.44"
        ],
        [
          "ge-0/0/3.44"
        ],
        [
          "ge-0/0/3.44"
        ],
        [
          "ge-0/0/3.44"
        ],
        [
          "ge-0/0/3.44"
        ]
      ],
      "hostname": "L67JR7",
      "localLabel": 299936,
      "name": "vlan_44",
      "neiHostname": "L67JR8",
      "neiSiteKey": "1170559021",
      "neiSiteName": "L67",
      "neiSn": "VM5E36ED4A63",
      "neiIp": "10.67.255.108",
      "receiveLsp": "JR8-TO-JR7",
      "remoteLabel": 299952,
      "siteKey": "1170559021",
      "siteName": "L67",
      "sn": "VM5E3462CF6F",
      "state": "up",
      "stateOrig": "no_example",
      "timeLastUp": "Jul 27 13:32:35",
      "transmitLsp": "JR7-TO-JR8",
      "upTrans": 1
    },
    {
      "id": "1189554694",
      "ac": [
        [
          "ge-0/0/3.44"
        ]
      ],
      "hostname": "L67JR7",
      "localLabel": 299936,
      "name": "vlan_44",
      "neiHostname": "L67JR8",
      "neiSiteKey": "1170559021",
      "neiSiteName": "L67",
      "neiSn": "VM5E36ED4A63",
      "neiIp": "10.67.255.108",
      "receiveLsp": "JR8-TO-JR7",
      "remoteLabel": 299952,
      "siteKey": "1170559021",
      "siteName": "L67",
      "sn": "VM5E3462CF6F",
      "state": "up",
      "stateOrig": "no_example",
      "timeLastUp": "Jul 27 13:32:35",
      "transmitLsp": "JR7-TO-JR8",
      "upTrans": 1
    },
    {
      "id": "1189554694",
      "ac": [
        [
          "ge-0/0/3.44"
        ],
        [
          "ge-0/0/3.44"
        ],
        [
          "ge-0/0/3.44"
        ],
        [
          "ge-0/0/3.44"
        ],
        [
          "ge-0/0/3.44"
        ],
        [
          "ge-0/0/3.44"
        ],
        [
          "ge-0/0/3.44"
        ],
        [
          "ge-0/0/3.44"
        ],
        [
          "ge-0/0/3.44"
        ],
        [
          "ge-0/0/3.44"
        ]
      ],
      "hostname": "L67JR7",
      "localLabel": 299936,
      "name": "vlan_44",
      "neiHostname": "L67JR8",
      "neiSiteKey": "1170559021",
      "neiSiteName": "L67",
      "neiSn": "VM5E36ED4A63",
      "neiIp": "10.67.255.108",
      "receiveLsp": "JR8-TO-JR7",
      "remoteLabel": 299952,
      "siteKey": "1170559021",
      "siteName": "L67",
      "sn": "VM5E3462CF6F",
      "state": "up",
      "stateOrig": "no_example",
      "timeLastUp": "Jul 27 13:32:35",
      "transmitLsp": "JR7-TO-JR8",
      "upTrans": 1
    }
  ],
  "_meta": {
    "limit": 100,
    "start": 2,
    "count": 1,
    "size": 1,
    "snapshot": "41c65f99-8acd-425f-9b3b-496947884f6d"
  }
}