{
  "actions": [
    {
      "name": "postTablesInterfacesDropsInbound",
      "protocol": "REST",
      "method": "POST",
      "entitypath": "{base_path}/{version}/tables/interfaces/drops/inbound?{query}",
      "requestSchema": "schema.json",
      "responseSchema": "schema.json",
      "timeout": 0,
      "sendEmpty": false,
      "requestDatatype": "JSON",
      "responseDatatype": "JSON",
      "headers": {},
      "responseObjects": [
        {
          "type": "default",
          "key": "",
          "mockFile": "mockdatafiles/postTablesInterfacesDropsInbound-default.json"
        }
      ]
    },
    {
      "name": "postTablesInterfacesDropsBidirectionalDevice",
      "protocol": "REST",
      "method": "POST",
      "entitypath": "{base_path}/{version}/tables/interfaces/drops/bidirectional-device?{query}",
      "requestSchema": "schema.json",
      "responseSchema": "schema.json",
      "timeout": 0,
      "sendEmpty": false,
      "requestDatatype": "JSON",
      "responseDatatype": "JSON",
      "headers": {},
      "responseObjects": [
        {
          "type": "default",
          "key": "",
          "mockFile": "mockdatafiles/postTablesInterfacesDropsBidirectionalDevice-default.json"
        }
      ]
    },
    {
      "name": "postTablesInterfacesDropsInboundDevice",
      "protocol": "REST",
      "method": "POST",
      "entitypath": "{base_path}/{version}/tables/interfaces/drops/inbound-device?{query}",
      "requestSchema": "schema.json",
      "responseSchema": "schema.json",
      "timeout": 0,
      "sendEmpty": false,
      "requestDatatype": "JSON",
      "responseDatatype": "JSON",
      "headers": {},
      "responseObjects": [
        {
          "type": "default",
          "key": "",
          "mockFile": "mockdatafiles/postTablesInterfacesDropsInboundDevice-default.json"
        }
      ]
    },
    {
      "name": "postTablesInterfacesDropsOutboundDevice",
      "protocol": "REST",
      "method": "POST",
      "entitypath": "{base_path}/{version}/tables/interfaces/drops/outbound-device?{query}",
      "requestSchema": "schema.json",
      "responseSchema": "schema.json",
      "timeout": 0,
      "sendEmpty": false,
      "requestDatatype": "JSON",
      "responseDatatype": "JSON",
      "headers": {},
      "responseObjects": [
        {
          "type": "default",
          "key": "",
          "mockFile": "mockdatafiles/postTablesInterfacesDropsOutboundDevice-default.json"
        }
      ]
    },
    {
      "name": "postTablesInterfacesDropsBidirectional",
      "protocol": "REST",
      "method": "POST",
      "entitypath": "{base_path}/{version}/tables/interfaces/drops/bidirectional?{query}",
      "requestSchema": "schema.json",
      "responseSchema": "schema.json",
      "timeout": 0,
      "sendEmpty": false,
      "requestDatatype": "JSON",
      "responseDatatype": "JSON",
      "headers": {},
      "responseObjects": [
        {
          "type": "default",
          "key": "",
          "mockFile": "mockdatafiles/postTablesInterfacesDropsBidirectional-default.json"
        }
      ]
    },
    {
      "name": "postTablesInterfacesDropsOutbound",
      "protocol": "REST",
      "method": "POST",
      "entitypath": "{base_path}/{version}/tables/interfaces/drops/outbound?{query}",
      "requestSchema": "schema.json",
      "responseSchema": "schema.json",
      "timeout": 0,
      "sendEmpty": false,
      "requestDatatype": "JSON",
      "responseDatatype": "JSON",
      "headers": {},
      "responseObjects": [
        {
          "type": "default",
          "key": "",
          "mockFile": "mockdatafiles/postTablesInterfacesDropsOutbound-default.json"
        }
      ]
    },
    {
      "name": "postTablesInterfacesLoad",
      "protocol": "REST",
      "method": "POST",
      "entitypath": "{base_path}/{version}/tables/interfaces/load?{query}",
      "requestSchema": "schema.json",
      "responseSchema": "schema.json",
      "timeout": 0,
      "sendEmpty": false,
      "requestDatatype": "JSON",
      "responseDatatype": "JSON",
      "headers": {},
      "responseObjects": [
        {
          "type": "default",
          "key": "",
          "mockFile": "mockdatafiles/postTablesInterfacesLoad-default.json"
        }
      ]
    },
    {
      "name": "postTablesInterfacesErrorsDisabled",
      "protocol": "REST",
      "method": "POST",
      "entitypath": "{base_path}/{version}/tables/interfaces/errors/disabled?{query}",
      "requestSchema": "schema.json",
      "responseSchema": "schema.json",
      "timeout": 0,
      "sendEmpty": false,
      "requestDatatype": "JSON",
      "responseDatatype": "JSON",
      "headers": {},
      "responseObjects": [
        {
          "type": "default",
          "key": "",
          "mockFile": "mockdatafiles/postTablesInterfacesErrorsDisabled-default.json"
        }
      ]
    },
    {
      "name": "postTablesInterfacesErrorsInbound",
      "protocol": "REST",
      "method": "POST",
      "entitypath": "{base_path}/{version}/tables/interfaces/errors/inbound?{query}",
      "requestSchema": "schema.json",
      "responseSchema": "schema.json",
      "timeout": 0,
      "sendEmpty": false,
      "requestDatatype": "JSON",
      "responseDatatype": "JSON",
      "headers": {},
      "responseObjects": [
        {
          "type": "default",
          "key": "",
          "mockFile": "mockdatafiles/postTablesInterfacesErrorsInbound-default.json"
        }
      ]
    },
    {
      "name": "postTablesInterfacesErrorsBidirectionalDevice",
      "protocol": "REST",
      "method": "POST",
      "entitypath": "{base_path}/{version}/tables/interfaces/errors/bidirectional-device?{query}",
      "requestSchema": "schema.json",
      "responseSchema": "schema.json",
      "timeout": 0,
      "sendEmpty": false,
      "requestDatatype": "JSON",
      "responseDatatype": "JSON",
      "headers": {},
      "responseObjects": [
        {
          "type": "default",
          "key": "",
          "mockFile": "mockdatafiles/postTablesInterfacesErrorsBidirectionalDevice-default.json"
        }
      ]
    },
    {
      "name": "postTablesInterfacesErrorsInboundDevice",
      "protocol": "REST",
      "method": "POST",
      "entitypath": "{base_path}/{version}/tables/interfaces/errors/inbound-device?{query}",
      "requestSchema": "schema.json",
      "responseSchema": "schema.json",
      "timeout": 0,
      "sendEmpty": false,
      "requestDatatype": "JSON",
      "responseDatatype": "JSON",
      "headers": {},
      "responseObjects": [
        {
          "type": "default",
          "key": "",
          "mockFile": "mockdatafiles/postTablesInterfacesErrorsInboundDevice-default.json"
        }
      ]
    },
    {
      "name": "postTablesInterfacesErrorsOutboundDevice",
      "protocol": "REST",
      "method": "POST",
      "entitypath": "{base_path}/{version}/tables/interfaces/errors/outbound-device?{query}",
      "requestSchema": "schema.json",
      "responseSchema": "schema.json",
      "timeout": 0,
      "sendEmpty": false,
      "requestDatatype": "JSON",
      "responseDatatype": "JSON",
      "headers": {},
      "responseObjects": [
        {
          "type": "default",
          "key": "",
          "mockFile": "mockdatafiles/postTablesInterfacesErrorsOutboundDevice-default.json"
        }
      ]
    },
    {
      "name": "postTablesInterfacesErrorsBidirectional",
      "protocol": "REST",
      "method": "POST",
      "entitypath": "{base_path}/{version}/tables/interfaces/errors/bidirectional?{query}",
      "requestSchema": "schema.json",
      "responseSchema": "schema.json",
      "timeout": 0,
      "sendEmpty": false,
      "requestDatatype": "JSON",
      "responseDatatype": "JSON",
      "headers": {},
      "responseObjects": [
        {
          "type": "default",
          "key": "",
          "mockFile": "mockdatafiles/postTablesInterfacesErrorsBidirectional-default.json"
        }
      ]
    },
    {
      "name": "postTablesInterfacesErrorsOutbound",
      "protocol": "REST",
      "method": "POST",
      "entitypath": "{base_path}/{version}/tables/interfaces/errors/outbound?{query}",
      "requestSchema": "schema.json",
      "responseSchema": "schema.json",
      "timeout": 0,
      "sendEmpty": false,
      "requestDatatype": "JSON",
      "responseDatatype": "JSON",
      "headers": {},
      "responseObjects": [
        {
          "type": "default",
          "key": "",
          "mockFile": "mockdatafiles/postTablesInterfacesErrorsOutbound-default.json"
        }
      ]
    },
    {
      "name": "postTablesInterfacesSwitchports",
      "protocol": "REST",
      "method": "POST",
      "entitypath": "{base_path}/{version}/tables/interfaces/switchports?{query}",
      "requestSchema": "schema.json",
      "responseSchema": "schema.json",
      "timeout": 0,
      "sendEmpty": false,
      "requestDatatype": "JSON",
      "responseDatatype": "JSON",
      "headers": {},
      "responseObjects": [
        {
          "type": "default",
          "key": "",
          "mockFile": "mockdatafiles/postTablesInterfacesSwitchports-default.json"
        }
      ]
    },
    {
      "name": "postTablesInterfacesTransferRatesInbound",
      "protocol": "REST",
      "method": "POST",
      "entitypath": "{base_path}/{version}/tables/interfaces/transfer-rates/inbound?{query}",
      "requestSchema": "schema.json",
      "responseSchema": "schema.json",
      "timeout": 0,
      "sendEmpty": false,
      "requestDatatype": "JSON",
      "responseDatatype": "JSON",
      "headers": {},
      "responseObjects": [
        {
          "type": "default",
          "key": "",
          "mockFile": "mockdatafiles/postTablesInterfacesTransferRatesInbound-default.json"
        }
      ]
    },
    {
      "name": "postTablesInterfacesTransferRatesBidirectionalDevice",
      "protocol": "REST",
      "method": "POST",
      "entitypath": "{base_path}/{version}/tables/interfaces/transfer-rates/bidirectional-device?{query}",
      "requestSchema": "schema.json",
      "responseSchema": "schema.json",
      "timeout": 0,
      "sendEmpty": false,
      "requestDatatype": "JSON",
      "responseDatatype": "JSON",
      "headers": {},
      "responseObjects": [
        {
          "type": "default",
          "key": "",
          "mockFile": "mockdatafiles/postTablesInterfacesTransferRatesBidirectionalDevice-default.json"
        }
      ]
    },
    {
      "name": "postTablesInterfacesTransferRatesInboundDevice",
      "protocol": "REST",
      "method": "POST",
      "entitypath": "{base_path}/{version}/tables/interfaces/transfer-rates/inbound-device?{query}",
      "requestSchema": "schema.json",
      "responseSchema": "schema.json",
      "timeout": 0,
      "sendEmpty": false,
      "requestDatatype": "JSON",
      "responseDatatype": "JSON",
      "headers": {},
      "responseObjects": [
        {
          "type": "default",
          "key": "",
          "mockFile": "mockdatafiles/postTablesInterfacesTransferRatesInboundDevice-default.json"
        }
      ]
    },
    {
      "name": "postTablesInterfacesTransferRatesOutboundDevice",
      "protocol": "REST",
      "method": "POST",
      "entitypath": "{base_path}/{version}/tables/interfaces/transfer-rates/outbound-device?{query}",
      "requestSchema": "schema.json",
      "responseSchema": "schema.json",
      "timeout": 0,
      "sendEmpty": false,
      "requestDatatype": "JSON",
      "responseDatatype": "JSON",
      "headers": {},
      "responseObjects": [
        {
          "type": "default",
          "key": "",
          "mockFile": "mockdatafiles/postTablesInterfacesTransferRatesOutboundDevice-default.json"
        }
      ]
    },
    {
      "name": "postTablesInterfacesTransferRatesBidirectional",
      "protocol": "REST",
      "method": "POST",
      "entitypath": "{base_path}/{version}/tables/interfaces/transfer-rates/bidirectional?{query}",
      "requestSchema": "schema.json",
      "responseSchema": "schema.json",
      "timeout": 0,
      "sendEmpty": false,
      "requestDatatype": "JSON",
      "responseDatatype": "JSON",
      "headers": {},
      "responseObjects": [
        {
          "type": "default",
          "key": "",
          "mockFile": "mockdatafiles/postTablesInterfacesTransferRatesBidirectional-default.json"
        }
      ]
    },
    {
      "name": "postTablesInterfacesTransferRatesOutbound",
      "protocol": "REST",
      "method": "POST",
      "entitypath": "{base_path}/{version}/tables/interfaces/transfer-rates/outbound?{query}",
      "requestSchema": "schema.json",
      "responseSchema": "schema.json",
      "timeout": 0,
      "sendEmpty": false,
      "requestDatatype": "JSON",
      "responseDatatype": "JSON",
      "headers": {},
      "responseObjects": [
        {
          "type": "default",
          "key": "",
          "mockFile": "mockdatafiles/postTablesInterfacesTransferRatesOutbound-default.json"
        }
      ]
    },
    {
      "name": "postTablesInterfacesPortChannelBalanceInbound",
      "protocol": "REST",
      "method": "POST",
      "entitypath": "{base_path}/{version}/tables/interfaces/port-channel/balance/inbound?{query}",
      "requestSchema": "schema.json",
      "responseSchema": "schema.json",
      "timeout": 0,
      "sendEmpty": false,
      "requestDatatype": "JSON",
      "responseDatatype": "JSON",
      "headers": {},
      "responseObjects": [
        {
          "type": "default",
          "key": "",
          "mockFile": "mockdatafiles/postTablesInterfacesPortChannelBalanceInbound-default.json"
        }
      ]
    },
    {
      "name": "postTablesInterfacesPortChannelBalanceOutbound",
      "protocol": "REST",
      "method": "POST",
      "entitypath": "{base_path}/{version}/tables/interfaces/port-channel/balance/outbound?{query}",
      "requestSchema": "schema.json",
      "responseSchema": "schema.json",
      "timeout": 0,
      "sendEmpty": false,
      "requestDatatype": "JSON",
      "responseDatatype": "JSON",
      "headers": {},
      "responseObjects": [
        {
          "type": "default",
          "key": "",
          "mockFile": "mockdatafiles/postTablesInterfacesPortChannelBalanceOutbound-default.json"
        }
      ]
    },
    {
      "name": "postTablesInterfacesPortChannelMemberStatus",
      "protocol": "REST",
      "method": "POST",
      "entitypath": "{base_path}/{version}/tables/interfaces/port-channel/member-status?{query}",
      "requestSchema": "schema.json",
      "responseSchema": "schema.json",
      "timeout": 0,
      "sendEmpty": false,
      "requestDatatype": "JSON",
      "responseDatatype": "JSON",
      "headers": {},
      "responseObjects": [
        {
          "type": "default",
          "key": "",
          "mockFile": "mockdatafiles/postTablesInterfacesPortChannelMemberStatus-default.json"
        }
      ]
    },
    {
      "name": "postTablesInterfacesMtu",
      "protocol": "REST",
      "method": "POST",
      "entitypath": "{base_path}/{version}/tables/interfaces/mtu?{query}",
      "requestSchema": "schema.json",
      "responseSchema": "schema.json",
      "timeout": 0,
      "sendEmpty": false,
      "requestDatatype": "JSON",
      "responseDatatype": "JSON",
      "headers": {},
      "responseObjects": [
        {
          "type": "default",
          "key": "",
          "mockFile": "mockdatafiles/postTablesInterfacesMtu-default.json"
        }
      ]
    },
    {
      "name": "postTablesInterfacesDuplex",
      "protocol": "REST",
      "method": "POST",
      "entitypath": "{base_path}/{version}/tables/interfaces/duplex?{query}",
      "requestSchema": "schema.json",
      "responseSchema": "schema.json",
      "timeout": 0,
      "sendEmpty": false,
      "requestDatatype": "JSON",
      "responseDatatype": "JSON",
      "headers": {},
      "responseObjects": [
        {
          "type": "default",
          "key": "",
          "mockFile": "mockdatafiles/postTablesInterfacesDuplex-default.json"
        }
      ]
    },
    {
      "name": "postTablesInterfacesInconsistenciesSummary",
      "protocol": "REST",
      "method": "POST",
      "entitypath": "{base_path}/{version}/tables/interfaces/inconsistencies/summary?{query}",
      "requestSchema": "schema.json",
      "responseSchema": "schema.json",
      "timeout": 0,
      "sendEmpty": false,
      "requestDatatype": "JSON",
      "responseDatatype": "JSON",
      "headers": {},
      "responseObjects": [
        {
          "type": "default",
          "key": "",
          "mockFile": "mockdatafiles/postTablesInterfacesInconsistenciesSummary-default.json"
        }
      ]
    },
    {
      "name": "postTablesInterfacesInconsistenciesDetails",
      "protocol": "REST",
      "method": "POST",
      "entitypath": "{base_path}/{version}/tables/interfaces/inconsistencies/details?{query}",
      "requestSchema": "schema.json",
      "responseSchema": "schema.json",
      "timeout": 0,
      "sendEmpty": false,
      "requestDatatype": "JSON",
      "responseDatatype": "JSON",
      "headers": {},
      "responseObjects": [
        {
          "type": "default",
          "key": "",
          "mockFile": "mockdatafiles/postTablesInterfacesInconsistenciesDetails-default.json"
        }
      ]
    },
    {
      "name": "postTablesInterfacesConnectivityMatrixUnmanagedNeighborsDetail",
      "protocol": "REST",
      "method": "POST",
      "entitypath": "{base_path}/{version}/tables/interfaces/connectivity-matrix/unmanaged-neighbors/detail?{query}",
      "requestSchema": "schema.json",
      "responseSchema": "schema.json",
      "timeout": 0,
      "sendEmpty": false,
      "requestDatatype": "JSON",
      "responseDatatype": "JSON",
      "headers": {},
      "responseObjects": [
        {
          "type": "default",
          "key": "",
          "mockFile": "mockdatafiles/postTablesInterfacesConnectivityMatrixUnmanagedNeighborsDetail-default.json"
        }
      ]
    },
    {
      "name": "postTablesInterfacesConnectivityMatrixUnmanagedNeighborsSummary",
      "protocol": "REST",
      "method": "POST",
      "entitypath": "{base_path}/{version}/tables/interfaces/connectivity-matrix/unmanaged-neighbors/summary?{query}",
      "requestSchema": "schema.json",
      "responseSchema": "schema.json",
      "timeout": 0,
      "sendEmpty": false,
      "requestDatatype": "JSON",
      "responseDatatype": "JSON",
      "headers": {},
      "responseObjects": [
        {
          "type": "default",
          "key": "",
          "mockFile": "mockdatafiles/postTablesInterfacesConnectivityMatrixUnmanagedNeighborsSummary-default.json"
        }
      ]
    },
    {
      "name": "postTablesInterfacesStormControlUnicast",
      "protocol": "REST",
      "method": "POST",
      "entitypath": "{base_path}/{version}/tables/interfaces/storm-control/unicast?{query}",
      "requestSchema": "schema.json",
      "responseSchema": "schema.json",
      "timeout": 0,
      "sendEmpty": false,
      "requestDatatype": "JSON",
      "responseDatatype": "JSON",
      "headers": {},
      "responseObjects": [
        {
          "type": "default",
          "key": "",
          "mockFile": "mockdatafiles/postTablesInterfacesStormControlUnicast-default.json"
        }
      ]
    },
    {
      "name": "postTablesInterfacesStormControlMulticast",
      "protocol": "REST",
      "method": "POST",
      "entitypath": "{base_path}/{version}/tables/interfaces/storm-control/multicast?{query}",
      "requestSchema": "schema.json",
      "responseSchema": "schema.json",
      "timeout": 0,
      "sendEmpty": false,
      "requestDatatype": "JSON",
      "responseDatatype": "JSON",
      "headers": {},
      "responseObjects": [
        {
          "type": "default",
          "key": "",
          "mockFile": "mockdatafiles/postTablesInterfacesStormControlMulticast-default.json"
        }
      ]
    },
    {
      "name": "postTablesInterfacesStormControlBroadcast",
      "protocol": "REST",
      "method": "POST",
      "entitypath": "{base_path}/{version}/tables/interfaces/storm-control/broadcast?{query}",
      "requestSchema": "schema.json",
      "responseSchema": "schema.json",
      "timeout": 0,
      "sendEmpty": false,
      "requestDatatype": "JSON",
      "responseDatatype": "JSON",
      "headers": {},
      "responseObjects": [
        {
          "type": "default",
          "key": "",
          "mockFile": "mockdatafiles/postTablesInterfacesStormControlBroadcast-default.json"
        }
      ]
    }
  ]
}