{
  "data": [
    {
      "id": "1189580324",
      "currStateTime": 7,
      "devType": "l3switch",
      "hostname": "L1EOS2",
      "intName": "Vl100",
      "localAddress": "10.241.1.22",
      "localAddressV6": "no_example",
      "localAreas": [
        [
          "49.0241.0010"
        ],
        [
          "49.0241.0010"
        ],
        [
          "49.0241.0010"
        ],
        [
          "49.0241.0010"
        ],
        [
          "49.0241.0010"
        ],
        [
          "49.0241.0010"
        ],
        [
          "49.0241.0010"
        ],
        [
          "49.0241.0010"
        ]
      ],
      "localId": "0241.0255.0022",
      "localIsType": "L2",
      "neiAddress": "10.241.1.23",
      "neiAddressV6": "no_example",
      "neiAreas": [
        [
          49.0004
        ],
        [
          49.0004
        ],
        [
          49.0004
        ],
        [
          49.0004
        ],
        [
          49.0004
        ],
        [
          49.0004
        ],
        [
          49.0004
        ],
        [
          49.0004
        ],
        [
          49.0004
        ]
      ],
      "neiDevType": "l3switch",
      "neiHostname": "L1EOS3",
      "neiId": "0241.0255.0023",
      "neiIntName": "Vl100",
      "neiIsType": "L2",
      "neiSiteKey": "1068454874",
      "neiSiteName": "L1",
      "neiSn": "FAB81C00003",
      "neiSnpa": "0000.007b.4d1f",
      "neiSystemName": "no_example",
      "siteKey": "1068454874",
      "siteName": "L1",
      "sn": "FAB81C00002",
      "source": "vDevice/1189569256",
      "state": "up",
      "subnet": "10.241.1.0/24",
      "target": "vDevice/1189569151",
      "vrf": "default"
    },
    {
      "id": "1189580324",
      "currStateTime": 10,
      "devType": "l3switch",
      "hostname": "L1EOS2",
      "intName": "Vl100",
      "localAddress": "10.241.1.22",
      "localAddressV6": "no_example",
      "localAreas": [
        [
          "49.0241.0010"
        ],
        [
          "49.0241.0010"
        ],
        [
          "49.0241.0010"
        ],
        [
          "49.0241.0010"
        ],
        [
          "49.0241.0010"
        ],
        [
          "49.0241.0010"
        ],
        [
          "49.0241.0010"
        ],
        [
          "49.0241.0010"
        ]
      ],
      "localId": "0241.0255.0022",
      "localIsType": "L2",
      "neiAddress": "10.241.1.23",
      "neiAddressV6": "no_example",
      "neiAreas": [
        [
          49.0004
        ],
        [
          49.0004
        ],
        [
          49.0004
        ],
        [
          49.0004
        ],
        [
          49.0004
        ],
        [
          49.0004
        ],
        [
          49.0004
        ],
        [
          49.0004
        ]
      ],
      "neiDevType": "l3switch",
      "neiHostname": "L1EOS3",
      "neiId": "0241.0255.0023",
      "neiIntName": "Vl100",
      "neiIsType": "L2",
      "neiSiteKey": "1068454874",
      "neiSiteName": "L1",
      "neiSn": "FAB81C00003",
      "neiSnpa": "0000.007b.4d1f",
      "neiSystemName": "no_example",
      "siteKey": "1068454874",
      "siteName": "L1",
      "sn": "FAB81C00002",
      "source": "vDevice/1189569256",
      "state": "up",
      "subnet": "10.241.1.0/24",
      "target": "vDevice/1189569151",
      "vrf": "default"
    },
    {
      "id": "1189580324",
      "currStateTime": 7,
      "devType": "l3switch",
      "hostname": "L1EOS2",
      "intName": "Vl100",
      "localAddress": "10.241.1.22",
      "localAddressV6": "no_example",
      "localAreas": [
        [
          "49.0241.0010"
        ]
      ],
      "localId": "0241.0255.0022",
      "localIsType": "L2",
      "neiAddress": "10.241.1.23",
      "neiAddressV6": "no_example",
      "neiAreas": [
        [
          49.0004
        ],
        [
          49.0004
        ],
        [
          49.0004
        ],
        [
          49.0004
        ],
        [
          49.0004
        ],
        [
          49.0004
        ]
      ],
      "neiDevType": "l3switch",
      "neiHostname": "L1EOS3",
      "neiId": "0241.0255.0023",
      "neiIntName": "Vl100",
      "neiIsType": "L2",
      "neiSiteKey": "1068454874",
      "neiSiteName": "L1",
      "neiSn": "FAB81C00003",
      "neiSnpa": "0000.007b.4d1f",
      "neiSystemName": "no_example",
      "siteKey": "1068454874",
      "siteName": "L1",
      "sn": "FAB81C00002",
      "source": "vDevice/1189569256",
      "state": "up",
      "subnet": "10.241.1.0/24",
      "target": "vDevice/1189569151",
      "vrf": "default"
    },
    {
      "id": "1189580324",
      "currStateTime": 9,
      "devType": "l3switch",
      "hostname": "L1EOS2",
      "intName": "Vl100",
      "localAddress": "10.241.1.22",
      "localAddressV6": "no_example",
      "localAreas": [
        [
          "49.0241.0010"
        ],
        [
          "49.0241.0010"
        ],
        [
          "49.0241.0010"
        ],
        [
          "49.0241.0010"
        ],
        [
          "49.0241.0010"
        ]
      ],
      "localId": "0241.0255.0022",
      "localIsType": "L2",
      "neiAddress": "10.241.1.23",
      "neiAddressV6": "no_example",
      "neiAreas": [
        [
          49.0004
        ],
        [
          49.0004
        ],
        [
          49.0004
        ],
        [
          49.0004
        ],
        [
          49.0004
        ],
        [
          49.0004
        ],
        [
          49.0004
        ],
        [
          49.0004
        ],
        [
          49.0004
        ],
        [
          49.0004
        ]
      ],
      "neiDevType": "l3switch",
      "neiHostname": "L1EOS3",
      "neiId": "0241.0255.0023",
      "neiIntName": "Vl100",
      "neiIsType": "L2",
      "neiSiteKey": "1068454874",
      "neiSiteName": "L1",
      "neiSn": "FAB81C00003",
      "neiSnpa": "0000.007b.4d1f",
      "neiSystemName": "no_example",
      "siteKey": "1068454874",
      "siteName": "L1",
      "sn": "FAB81C00002",
      "source": "vDevice/1189569256",
      "state": "up",
      "subnet": "10.241.1.0/24",
      "target": "vDevice/1189569151",
      "vrf": "default"
    }
  ],
  "_meta": {
    "limit": 100,
    "start": 3,
    "count": 1,
    "size": 1,
    "snapshot": "41c65f99-8acd-425f-9b3b-496947884f6d"
  }
}