{
  "data": [
    {
      "excludeNetworks": [
        "10.15.15.0/24",
        "10.15.15.0/24",
        "10.15.15.0/24",
        "10.15.15.0/24",
        "10.15.15.0/24",
        "10.15.15.0/24",
        "10.15.15.0/24",
        "10.15.15.0/24",
        "10.15.15.0/24",
        "10.15.15.0/24"
      ],
      "expirationDate": {
        "enabled": false,
        "value": "2025-10-23 23:59:59"
      },
      "id": "string",
      "includeNetworks": [
        "0.0.0.0/0",
        "0.0.0.0/0",
        "0.0.0.0/0",
        "0.0.0.0/0",
        "0.0.0.0/0",
        "0.0.0.0/0",
        "0.0.0.0/0"
      ],
      "notes": "Main Enable password",
      "password": "8093dc23e2",
      "username": "someUserName",
      "priority": 5
    },
    {
      "excludeNetworks": [
        "10.15.15.0/24"
      ],
      "expirationDate": {
        "enabled": true,
        "value": "2025-10-23 23:59:59"
      },
      "id": "string",
      "includeNetworks": [
        "0.0.0.0/0",
        "0.0.0.0/0",
        "0.0.0.0/0",
        "0.0.0.0/0",
        "0.0.0.0/0"
      ],
      "notes": "Main Enable password",
      "password": "8093dc23e2",
      "username": "someUserName",
      "priority": 7
    },
    {
      "excludeNetworks": [
        "10.15.15.0/24",
        "10.15.15.0/24",
        "10.15.15.0/24",
        "10.15.15.0/24",
        "10.15.15.0/24",
        "10.15.15.0/24"
      ],
      "expirationDate": {
        "enabled": true,
        "value": "2025-10-23 23:59:59"
      },
      "id": "string",
      "includeNetworks": [
        "0.0.0.0/0",
        "0.0.0.0/0",
        "0.0.0.0/0"
      ],
      "notes": "Main Enable password",
      "password": "8093dc23e2",
      "username": "someUserName",
      "priority": 8
    },
    {
      "excludeNetworks": [
        "10.15.15.0/24",
        "10.15.15.0/24",
        "10.15.15.0/24",
        "10.15.15.0/24",
        "10.15.15.0/24",
        "10.15.15.0/24",
        "10.15.15.0/24",
        "10.15.15.0/24",
        "10.15.15.0/24",
        "10.15.15.0/24"
      ],
      "expirationDate": {
        "enabled": false,
        "value": "2025-10-23 23:59:59"
      },
      "id": "string",
      "includeNetworks": [
        "0.0.0.0/0",
        "0.0.0.0/0",
        "0.0.0.0/0",
        "0.0.0.0/0",
        "0.0.0.0/0",
        "0.0.0.0/0",
        "0.0.0.0/0"
      ],
      "notes": "Main Enable password",
      "password": "8093dc23e2",
      "username": "someUserName",
      "priority": 9
    },
    {
      "excludeNetworks": [
        "10.15.15.0/24"
      ],
      "expirationDate": {
        "enabled": true,
        "value": "2025-10-23 23:59:59"
      },
      "id": "string",
      "includeNetworks": [
        "0.0.0.0/0",
        "0.0.0.0/0",
        "0.0.0.0/0",
        "0.0.0.0/0",
        "0.0.0.0/0",
        "0.0.0.0/0"
      ],
      "notes": "Main Enable password",
      "password": "8093dc23e2",
      "username": "someUserName",
      "priority": 8
    },
    {
      "excludeNetworks": [
        "10.15.15.0/24",
        "10.15.15.0/24",
        "10.15.15.0/24",
        "10.15.15.0/24",
        "10.15.15.0/24",
        "10.15.15.0/24",
        "10.15.15.0/24",
        "10.15.15.0/24",
        "10.15.15.0/24",
        "10.15.15.0/24"
      ],
      "expirationDate": {
        "enabled": false,
        "value": "2025-10-23 23:59:59"
      },
      "id": "string",
      "includeNetworks": [
        "0.0.0.0/0",
        "0.0.0.0/0",
        "0.0.0.0/0",
        "0.0.0.0/0",
        "0.0.0.0/0",
        "0.0.0.0/0",
        "0.0.0.0/0",
        "0.0.0.0/0",
        "0.0.0.0/0",
        "0.0.0.0/0"
      ],
      "notes": "Main Enable password",
      "password": "8093dc23e2",
      "username": "someUserName",
      "priority": 7
    }
  ],
  "_meta": {
    "limit": 100,
    "size": 1,
    "start": 6,
    "totalCount": 1
  }
}