{
  "data": [
    {
      "id": "1190566044",
      "configReg": "no_example",
      "hostname": "L1R19",
      "image": "bootflash:///titanium-d1.7.3.0.D1.1.bin",
      "loginIp": "10.241.255.30",
      "loginType": "ssh",
      "processor": "QEMU Virtual version 1.0",
      "reload": "no_example",
      "siteName": "L1",
      "siteKey": "1068454874",
      "sn": "10.241.255.30_1",
      "uptime": 9005970,
      "version": "7.3(0)D1(1)"
    },
    {
      "id": "1190566044",
      "configReg": "no_example",
      "hostname": "L1R19",
      "image": "bootflash:///titanium-d1.7.3.0.D1.1.bin",
      "loginIp": "10.241.255.30",
      "loginType": "ssh",
      "processor": "QEMU Virtual version 1.0",
      "reload": "no_example",
      "siteName": "L1",
      "siteKey": "1068454874",
      "sn": "10.241.255.30_1",
      "uptime": 9005970,
      "version": "7.3(0)D1(1)"
    },
    {
      "id": "1190566044",
      "configReg": "no_example",
      "hostname": "L1R19",
      "image": "bootflash:///titanium-d1.7.3.0.D1.1.bin",
      "loginIp": "10.241.255.30",
      "loginType": "ssh",
      "processor": "QEMU Virtual version 1.0",
      "reload": "no_example",
      "siteName": "L1",
      "siteKey": "1068454874",
      "sn": "10.241.255.30_1",
      "uptime": 9005970,
      "version": "7.3(0)D1(1)"
    }
  ],
  "_meta": {
    "limit": 100,
    "start": 6,
    "count": 1,
    "size": 1,
    "snapshot": "41c65f99-8acd-425f-9b3b-496947884f6d"
  }
}