{
  "data": [
    {
      "id": "1189552422",
      "hostname": "HWLAB-SGE300",
      "siteKey": "1170559111",
      "siteName": "HWLAB",
      "sn": "PSZ21111F8D",
      "vlanCount": 3
    }
  ],
  "_meta": {
    "limit": 100,
    "start": 5,
    "count": 1,
    "size": 1,
    "snapshot": "41c65f99-8acd-425f-9b3b-496947884f6d"
  }
}