{
  "data": [
    {
      "id": "1189651590xdp",
      "bgpNeiAsn": "no_example",
      "bgpNeiCount": 4,
      "bgpReceivedPfx": 3,
      "capabilities": [
        [
          "no_example"
        ],
        [
          "no_example"
        ],
        [
          "no_example"
        ],
        [
          "no_example"
        ],
        [
          "no_example"
        ],
        [
          "no_example"
        ],
        [
          "no_example"
        ],
        [
          "no_example"
        ],
        [
          "no_example"
        ],
        [
          "no_example"
        ]
      ],
      "cefNeiCount": 6,
      "cefPrfx": 2,
      "eigrpNeiCount": 5,
      "hostname": "L77R4-CORE2",
      "ip": "no_example",
      "isisNeiCount": 5,
      "ldpNeiCount": 3,
      "neighbor": "Switch",
      "ospfNeiCount": 8,
      "ospfv3NeiCount": 8,
      "ripNeiCount": 6,
      "siteKey": "1068455057",
      "siteName": "L77",
      "sn": "10.77.255.4",
      "xdpNeiCount": 7
    },
    {
      "id": "1189651590xdp",
      "bgpNeiAsn": "no_example",
      "bgpNeiCount": 4,
      "bgpReceivedPfx": 10,
      "capabilities": [
        [
          "no_example"
        ]
      ],
      "cefNeiCount": 5,
      "cefPrfx": 3,
      "eigrpNeiCount": 7,
      "hostname": "L77R4-CORE2",
      "ip": "no_example",
      "isisNeiCount": 10,
      "ldpNeiCount": 2,
      "neighbor": "Switch",
      "ospfNeiCount": 3,
      "ospfv3NeiCount": 7,
      "ripNeiCount": 7,
      "siteKey": "1068455057",
      "siteName": "L77",
      "sn": "10.77.255.4",
      "xdpNeiCount": 7
    },
    {
      "id": "1189651590xdp",
      "bgpNeiAsn": "no_example",
      "bgpNeiCount": 4,
      "bgpReceivedPfx": 2,
      "capabilities": [
        [
          "no_example"
        ],
        [
          "no_example"
        ],
        [
          "no_example"
        ],
        [
          "no_example"
        ],
        [
          "no_example"
        ],
        [
          "no_example"
        ],
        [
          "no_example"
        ]
      ],
      "cefNeiCount": 5,
      "cefPrfx": 9,
      "eigrpNeiCount": 5,
      "hostname": "L77R4-CORE2",
      "ip": "no_example",
      "isisNeiCount": 4,
      "ldpNeiCount": 8,
      "neighbor": "Switch",
      "ospfNeiCount": 5,
      "ospfv3NeiCount": 6,
      "ripNeiCount": 1,
      "siteKey": "1068455057",
      "siteName": "L77",
      "sn": "10.77.255.4",
      "xdpNeiCount": 7
    },
    {
      "id": "1189651590xdp",
      "bgpNeiAsn": "no_example",
      "bgpNeiCount": 1,
      "bgpReceivedPfx": 8,
      "capabilities": [
        [
          "no_example"
        ],
        [
          "no_example"
        ]
      ],
      "cefNeiCount": 2,
      "cefPrfx": 1,
      "eigrpNeiCount": 2,
      "hostname": "L77R4-CORE2",
      "ip": "no_example",
      "isisNeiCount": 1,
      "ldpNeiCount": 1,
      "neighbor": "Switch",
      "ospfNeiCount": 8,
      "ospfv3NeiCount": 6,
      "ripNeiCount": 8,
      "siteKey": "1068455057",
      "siteName": "L77",
      "sn": "10.77.255.4",
      "xdpNeiCount": 7
    },
    {
      "id": "1189651590xdp",
      "bgpNeiAsn": "no_example",
      "bgpNeiCount": 8,
      "bgpReceivedPfx": 5,
      "capabilities": [
        [
          "no_example"
        ],
        [
          "no_example"
        ],
        [
          "no_example"
        ],
        [
          "no_example"
        ],
        [
          "no_example"
        ],
        [
          "no_example"
        ],
        [
          "no_example"
        ],
        [
          "no_example"
        ],
        [
          "no_example"
        ]
      ],
      "cefNeiCount": 3,
      "cefPrfx": 10,
      "eigrpNeiCount": 3,
      "hostname": "L77R4-CORE2",
      "ip": "no_example",
      "isisNeiCount": 6,
      "ldpNeiCount": 8,
      "neighbor": "Switch",
      "ospfNeiCount": 2,
      "ospfv3NeiCount": 2,
      "ripNeiCount": 2,
      "siteKey": "1068455057",
      "siteName": "L77",
      "sn": "10.77.255.4",
      "xdpNeiCount": 7
    },
    {
      "id": "1189651590xdp",
      "bgpNeiAsn": "no_example",
      "bgpNeiCount": 1,
      "bgpReceivedPfx": 7,
      "capabilities": [
        [
          "no_example"
        ],
        [
          "no_example"
        ],
        [
          "no_example"
        ],
        [
          "no_example"
        ],
        [
          "no_example"
        ],
        [
          "no_example"
        ],
        [
          "no_example"
        ],
        [
          "no_example"
        ]
      ],
      "cefNeiCount": 3,
      "cefPrfx": 8,
      "eigrpNeiCount": 6,
      "hostname": "L77R4-CORE2",
      "ip": "no_example",
      "isisNeiCount": 10,
      "ldpNeiCount": 1,
      "neighbor": "Switch",
      "ospfNeiCount": 9,
      "ospfv3NeiCount": 10,
      "ripNeiCount": 1,
      "siteKey": "1068455057",
      "siteName": "L77",
      "sn": "10.77.255.4",
      "xdpNeiCount": 7
    },
    {
      "id": "1189651590xdp",
      "bgpNeiAsn": "no_example",
      "bgpNeiCount": 1,
      "bgpReceivedPfx": 7,
      "capabilities": [
        [
          "no_example"
        ],
        [
          "no_example"
        ],
        [
          "no_example"
        ]
      ],
      "cefNeiCount": 5,
      "cefPrfx": 9,
      "eigrpNeiCount": 4,
      "hostname": "L77R4-CORE2",
      "ip": "no_example",
      "isisNeiCount": 8,
      "ldpNeiCount": 4,
      "neighbor": "Switch",
      "ospfNeiCount": 10,
      "ospfv3NeiCount": 1,
      "ripNeiCount": 10,
      "siteKey": "1068455057",
      "siteName": "L77",
      "sn": "10.77.255.4",
      "xdpNeiCount": 7
    },
    {
      "id": "1189651590xdp",
      "bgpNeiAsn": "no_example",
      "bgpNeiCount": 10,
      "bgpReceivedPfx": 5,
      "capabilities": [
        [
          "no_example"
        ],
        [
          "no_example"
        ],
        [
          "no_example"
        ],
        [
          "no_example"
        ],
        [
          "no_example"
        ],
        [
          "no_example"
        ]
      ],
      "cefNeiCount": 1,
      "cefPrfx": 8,
      "eigrpNeiCount": 9,
      "hostname": "L77R4-CORE2",
      "ip": "no_example",
      "isisNeiCount": 2,
      "ldpNeiCount": 1,
      "neighbor": "Switch",
      "ospfNeiCount": 4,
      "ospfv3NeiCount": 2,
      "ripNeiCount": 10,
      "siteKey": "1068455057",
      "siteName": "L77",
      "sn": "10.77.255.4",
      "xdpNeiCount": 7
    },
    {
      "id": "1189651590xdp",
      "bgpNeiAsn": "no_example",
      "bgpNeiCount": 1,
      "bgpReceivedPfx": 10,
      "capabilities": [
        [
          "no_example"
        ],
        [
          "no_example"
        ],
        [
          "no_example"
        ],
        [
          "no_example"
        ],
        [
          "no_example"
        ],
        [
          "no_example"
        ],
        [
          "no_example"
        ],
        [
          "no_example"
        ],
        [
          "no_example"
        ]
      ],
      "cefNeiCount": 9,
      "cefPrfx": 3,
      "eigrpNeiCount": 1,
      "hostname": "L77R4-CORE2",
      "ip": "no_example",
      "isisNeiCount": 2,
      "ldpNeiCount": 1,
      "neighbor": "Switch",
      "ospfNeiCount": 4,
      "ospfv3NeiCount": 10,
      "ripNeiCount": 5,
      "siteKey": "1068455057",
      "siteName": "L77",
      "sn": "10.77.255.4",
      "xdpNeiCount": 7
    }
  ],
  "_meta": {
    "limit": 100,
    "start": 10,
    "count": 1,
    "size": 1,
    "snapshot": "41c65f99-8acd-425f-9b3b-496947884f6d"
  }
}