{
  "data": [
    {
      "id": "1190604568_0",
      "area": "0.0.0.0",
      "cost": 1,
      "hostname": "L1R11",
      "intName": "Fa2/0.10",
      "neiCount": 7,
      "networkType": "BROADCAST",
      "priority": 1,
      "processId": "1",
      "routerId": "10.241.255.11",
      "siteKey": "1068454874",
      "siteName": "L1",
      "sn": "10.241.255.11",
      "state": "DR",
      "timerDead": 40,
      "timerHello": 10,
      "timerRetransmit": 5,
      "timerWait": 40
    },
    {
      "id": "1190604568_0",
      "area": "0.0.0.0",
      "cost": 1,
      "hostname": "L1R11",
      "intName": "Fa2/0.10",
      "neiCount": 10,
      "networkType": "BROADCAST",
      "priority": 1,
      "processId": "1",
      "routerId": "10.241.255.11",
      "siteKey": "1068454874",
      "siteName": "L1",
      "sn": "10.241.255.11",
      "state": "DR",
      "timerDead": 40,
      "timerHello": 10,
      "timerRetransmit": 5,
      "timerWait": 40
    },
    {
      "id": "1190604568_0",
      "area": "0.0.0.0",
      "cost": 1,
      "hostname": "L1R11",
      "intName": "Fa2/0.10",
      "neiCount": 3,
      "networkType": "BROADCAST",
      "priority": 1,
      "processId": "1",
      "routerId": "10.241.255.11",
      "siteKey": "1068454874",
      "siteName": "L1",
      "sn": "10.241.255.11",
      "state": "DR",
      "timerDead": 40,
      "timerHello": 10,
      "timerRetransmit": 5,
      "timerWait": 40
    },
    {
      "id": "1190604568_0",
      "area": "0.0.0.0",
      "cost": 1,
      "hostname": "L1R11",
      "intName": "Fa2/0.10",
      "neiCount": 10,
      "networkType": "BROADCAST",
      "priority": 1,
      "processId": "1",
      "routerId": "10.241.255.11",
      "siteKey": "1068454874",
      "siteName": "L1",
      "sn": "10.241.255.11",
      "state": "DR",
      "timerDead": 40,
      "timerHello": 10,
      "timerRetransmit": 5,
      "timerWait": 40
    },
    {
      "id": "1190604568_0",
      "area": "0.0.0.0",
      "cost": 1,
      "hostname": "L1R11",
      "intName": "Fa2/0.10",
      "neiCount": 1,
      "networkType": "BROADCAST",
      "priority": 1,
      "processId": "1",
      "routerId": "10.241.255.11",
      "siteKey": "1068454874",
      "siteName": "L1",
      "sn": "10.241.255.11",
      "state": "DR",
      "timerDead": 40,
      "timerHello": 10,
      "timerRetransmit": 5,
      "timerWait": 40
    },
    {
      "id": "1190604568_0",
      "area": "0.0.0.0",
      "cost": 1,
      "hostname": "L1R11",
      "intName": "Fa2/0.10",
      "neiCount": 1,
      "networkType": "BROADCAST",
      "priority": 1,
      "processId": "1",
      "routerId": "10.241.255.11",
      "siteKey": "1068454874",
      "siteName": "L1",
      "sn": "10.241.255.11",
      "state": "DR",
      "timerDead": 40,
      "timerHello": 10,
      "timerRetransmit": 5,
      "timerWait": 40
    }
  ],
  "_meta": {
    "limit": 100,
    "start": 8,
    "count": 1,
    "size": 1,
    "snapshot": "41c65f99-8acd-425f-9b3b-496947884f6d"
  }
}