{
  "name": "adapter-ipfabric",
  "webName": "Adapter for Integration to IP Fabric Platform",
  "supportLevel": "community",
  "vendor": "IP Fabric",
  "product": "IP Fabric Platform",
  "techAlliance": true,
  "osVersion": [],
  "apiVersions": [],
  "iapVersions": [
    "2021.1.x",
    "2021.2.x",
    "2022.1.x",
    "2023.1.x"
  ],
  "method": "REST",
  "type": "Adapter",
  "domains": [
    "Service Assurance"
  ],
  "tags": [
    "Monitoring & Troubleshooting"
  ],
  "useCases": [
    "Add Device to Monitoring",
    "Automated network data gathering for diagnostics",
    "Verify network connectivity"
  ],
  "deprecated": {
    "isDeprecated": false
  },
  "brokerSince": "",
  "authMethods": [
    {
      "type": "API Key",
      "primary": true
    }
  ],
  "documentation": {
    "storeLink": "",
    "npmLink": "https://www.npmjs.com/package/@itentialopensource/adapter-ipfabric",
    "repoLink": "https://gitlab.com/itentialopensource/adapters/adapter-ipfabric",
    "docLink": "https://gitlab.com/itentialopensource/adapters/adapter-ipfabric/-/blob/master/README.md?ref_type=heads",
    "demoLinks": [],
    "trainingLinks": [
      {
        "title": "Itential Academy",
        "link": "https://www.itential.com/itential-academy/"
      }
    ],
    "faqLink": "https://docs.itential.com/opensource/docs/troubleshooting-an-adapter",
    "contributeLink": "https://gitlab.com/itentialopensource/adapters/contributing-guide",
    "issueLink": "https://itential.atlassian.net/servicedesk/customer/portals",
    "webLink": "https://www.itential.com/adapters/ip-fabric/",
    "vendorLink": "https://ipfabric.io/",
    "productLink": "https://ipfabric.io/",
    "apiLinks": [
      {
        "title": "IP Fabric API",
        "link": "https://www.postman.com/ipfabric/workspace/ip-fabric-public-workspace/overview",
        "public": true
      }
    ],
    "workshopLinks": [],
    "workshopHomePage": "https://www.itential.com/get-started/"
  },
  "assets": [],
  "relatedItems": {
    "adapters": [],
    "integrations": [],
    "ecosystemApplications": [],
    "workflowProjects": [
      {
        "name": "Ip Fabric Snapshot Inventory Comparison",
        "webName": "Ip Fabric Snapshot Inventory Comparison",
        "overview": "The IP Fabric Snapshot Inventory Comparison Pre-Built allows you to compare two network snapshots leveraging the [IP Fabric Automated Network Assurance Platform](https://ipfabric.io/product/). The Pre-Built has two stubbed tasks that enable the user to define if they would like to take the results of the comparison. For example, if there are new devices in the most recent snapshot, the user may decide to build a childJob that adds the device(s) to their inventory system such as SolarWinds, BlueCat, PRTG, Zabbix, Netbox, etc. If there are fewer devices in the most recent snapshot, the user may decide to build a childJob that removes the device(s) from their inventory system. Below is the workflow:",
        "isDependency": false,
        "versions": [
          "0.0.11"
        ],
        "repoLink": "https://gitlab.com/itentialopensource/pre-built-automations/ip-fabric-snapshot-inventory-comparison",
        "docLink": "",
        "webLink": "https://www.itential.com/automations/ip-fabric-snapshot-inventory-comparison/"
      },
      {
        "name": "Ip Fabric Service Path Analysis",
        "webName": "Ip Fabric Service Path Analysis",
        "overview": "The IP Fabric Service Path Analysis Pre-Built can be used to run a simulation of a requested service on the last snapshot within [IP Fabric Automated Network Assurance Platform](https://ipfabric.io/product/). The Pre-Built consists of a task that takes the last snapshot and runs the simulation for the service request and then identifies the impacted/affected existing firewall rules/switches/routers.### Operations Manager and JSON-FormThis workflow has an [Operations Manager item](./bundles/automations/IP%20Fabric%20Service%20Path%20Analysis.json) that calls a workflow. The Ops Manager item uses a JSON-Form to specify common fields populated when analyzing a requested service within IP Fabric. The workflow the Ops Manager item calls queries data from the formData job variable.",
        "isDependency": false,
        "versions": [
          "0.0.11"
        ],
        "repoLink": "https://gitlab.com/itentialopensource/pre-built-automations/ip-fabric-service-path-analysis",
        "docLink": "",
        "webLink": "https://www.itential.com/automations/ip-fabric-service-path-analysis/"
      },
      {
        "name": "Ip Fabric Create Network Snapshot",
        "webName": "Ip Fabric Create Network Snapshot",
        "overview": "The IP Fabric Create Network Snapshot Pre-Built will create a snapshot of the network using the [IP Fabric Automated Network Assurance Platform](https://ipfabric.io/product/). The Pre-Built consists of a task that takes a snapshot.Below is the workflow:",
        "isDependency": false,
        "versions": [
          "0.0.10"
        ],
        "repoLink": "https://gitlab.com/itentialopensource/pre-built-automations/ip-fabric-create-network-snapshot",
        "docLink": "",
        "webLink": "https://www.itential.com/automations/ip-fabric-create-network-snapshot/"
      },
      {
        "name": "Ip Fabric Compare Network Routes From Snapshots",
        "webName": "Ip Fabric Compare Network Routes From Snapshots",
        "overview": "The IP Fabric Compare Network Routes from Snapshots Pre-Built can be used to compare the last and penultimate (previous) snapshots taken by the [IP Fabric Automated Network Assurance Platform](https://ipfabric.io/product/). The Pre-Built consists of two API tasks and a comparision view task which will render the delta.This Pre-Built can be scheduled in Operations Manager and the delta could be reviewed in IAP or exported to any other system of record.Below is the workflow:",
        "isDependency": false,
        "versions": [
          "0.0.9"
        ],
        "repoLink": "https://gitlab.com/itentialopensource/pre-built-automations/ip-fabric-compare-network-routes-from-snapshots",
        "docLink": "",
        "webLink": "https://www.itential.com/automations/ip-fabric-compare-network-routes-from-snapshots/"
      }
    ],
    "transformationProjects": [],
    "exampleProjects": []
  }
}