{
  "data": [
    {
      "id": "118955242211895660251189562875",
      "hostname": "HWLAB-SGE300",
      "intName": "Po1",
      "siteKey": "1170559111",
      "siteName": "HWLAB",
      "sn": "PSZ21111F8D",
      "vlanId": 4090
    },
    {
      "id": "118955242211895660251189562875",
      "hostname": "HWLAB-SGE300",
      "intName": "Po1",
      "siteKey": "1170559111",
      "siteName": "HWLAB",
      "sn": "PSZ21111F8D",
      "vlanId": 4090
    },
    {
      "id": "118955242211895660251189562875",
      "hostname": "HWLAB-SGE300",
      "intName": "Po1",
      "siteKey": "1170559111",
      "siteName": "HWLAB",
      "sn": "PSZ21111F8D",
      "vlanId": 4090
    },
    {
      "id": "118955242211895660251189562875",
      "hostname": "HWLAB-SGE300",
      "intName": "Po1",
      "siteKey": "1170559111",
      "siteName": "HWLAB",
      "sn": "PSZ21111F8D",
      "vlanId": 4090
    },
    {
      "id": "118955242211895660251189562875",
      "hostname": "HWLAB-SGE300",
      "intName": "Po1",
      "siteKey": "1170559111",
      "siteName": "HWLAB",
      "sn": "PSZ21111F8D",
      "vlanId": 4090
    }
  ],
  "_meta": {
    "limit": 100,
    "start": 1,
    "count": 1,
    "size": 1,
    "snapshot": "41c65f99-8acd-425f-9b3b-496947884f6d"
  }
}