{
  "data": [
    {
      "id": 1760991229782726,
      "dnsHostnameMatch": 10,
      "dnsName": "30.161.0.200",
      "dnsReverseMatch": "no_example",
      "hostname": "L1FW56",
      "intName": "fab0.0",
      "ip": "30.161.0.200",
      "mac": "4c96.1411.0b30",
      "net": "30.161.0.0/24",
      "siteKey": "1170558973",
      "siteName": "L1DC",
      "sn": "458d4209b53d",
      "type": "preferred-primary",
      "vlanId": "no_example",
      "vrf": "master"
    },
    {
      "id": 1760991229782726,
      "dnsHostnameMatch": 5,
      "dnsName": "30.161.0.200",
      "dnsReverseMatch": "no_example",
      "hostname": "L1FW56",
      "intName": "fab0.0",
      "ip": "30.161.0.200",
      "mac": "4c96.1411.0b30",
      "net": "30.161.0.0/24",
      "siteKey": "1170558973",
      "siteName": "L1DC",
      "sn": "458d4209b53d",
      "type": "preferred-primary",
      "vlanId": "no_example",
      "vrf": "master"
    },
    {
      "id": 1760991229782726,
      "dnsHostnameMatch": 5,
      "dnsName": "30.161.0.200",
      "dnsReverseMatch": "no_example",
      "hostname": "L1FW56",
      "intName": "fab0.0",
      "ip": "30.161.0.200",
      "mac": "4c96.1411.0b30",
      "net": "30.161.0.0/24",
      "siteKey": "1170558973",
      "siteName": "L1DC",
      "sn": "458d4209b53d",
      "type": "preferred-primary",
      "vlanId": "no_example",
      "vrf": "master"
    },
    {
      "id": 1760991229782726,
      "dnsHostnameMatch": 2,
      "dnsName": "30.161.0.200",
      "dnsReverseMatch": "no_example",
      "hostname": "L1FW56",
      "intName": "fab0.0",
      "ip": "30.161.0.200",
      "mac": "4c96.1411.0b30",
      "net": "30.161.0.0/24",
      "siteKey": "1170558973",
      "siteName": "L1DC",
      "sn": "458d4209b53d",
      "type": "preferred-primary",
      "vlanId": "no_example",
      "vrf": "master"
    },
    {
      "id": 1760991229782726,
      "dnsHostnameMatch": 3,
      "dnsName": "30.161.0.200",
      "dnsReverseMatch": "no_example",
      "hostname": "L1FW56",
      "intName": "fab0.0",
      "ip": "30.161.0.200",
      "mac": "4c96.1411.0b30",
      "net": "30.161.0.0/24",
      "siteKey": "1170558973",
      "siteName": "L1DC",
      "sn": "458d4209b53d",
      "type": "preferred-primary",
      "vlanId": "no_example",
      "vrf": "master"
    },
    {
      "id": 1760991229782726,
      "dnsHostnameMatch": 1,
      "dnsName": "30.161.0.200",
      "dnsReverseMatch": "no_example",
      "hostname": "L1FW56",
      "intName": "fab0.0",
      "ip": "30.161.0.200",
      "mac": "4c96.1411.0b30",
      "net": "30.161.0.0/24",
      "siteKey": "1170558973",
      "siteName": "L1DC",
      "sn": "458d4209b53d",
      "type": "preferred-primary",
      "vlanId": "no_example",
      "vrf": "master"
    },
    {
      "id": 1760991229782726,
      "dnsHostnameMatch": 8,
      "dnsName": "30.161.0.200",
      "dnsReverseMatch": "no_example",
      "hostname": "L1FW56",
      "intName": "fab0.0",
      "ip": "30.161.0.200",
      "mac": "4c96.1411.0b30",
      "net": "30.161.0.0/24",
      "siteKey": "1170558973",
      "siteName": "L1DC",
      "sn": "458d4209b53d",
      "type": "preferred-primary",
      "vlanId": "no_example",
      "vrf": "master"
    }
  ],
  "_meta": {
    "limit": 100,
    "start": 6,
    "count": 1,
    "size": 1,
    "snapshot": "41c65f99-8acd-425f-9b3b-496947884f6d"
  }
}