{
  "l2Vpns": [
    {
      "connections": [
        {
          "device": "string",
          "vlan": 100,
          "port": "string"
        }
      ],
      "name": "string"
    },
    {
      "connections": [
        {
          "device": "string",
          "vlan": 100,
          "port": "string"
        },
        {
          "device": "string",
          "vlan": 100,
          "port": "string"
        }
      ],
      "name": "string"
    },
    {
      "connections": [
        {
          "device": "string",
          "vlan": 100,
          "port": "string"
        },
        {
          "device": "string",
          "vlan": 100,
          "port": "string"
        },
        {
          "device": "string",
          "vlan": 100,
          "port": "string"
        }
      ],
      "name": "string"
    },
    {
      "connections": [
        {
          "device": "string",
          "vlan": 100,
          "port": "string"
        }
      ],
      "name": "string"
    },
    {
      "connections": [
        {
          "device": "string",
          "vlan": 100,
          "port": "string"
        },
        {
          "device": "string",
          "vlan": 100,
          "port": "string"
        }
      ],
      "name": "string"
    },
    {
      "connections": [
        {
          "device": "string",
          "vlan": 100,
          "port": "string"
        },
        {
          "device": "string",
          "vlan": 100,
          "port": "string"
        },
        {
          "device": "string",
          "vlan": 100,
          "port": "string"
        },
        {
          "device": "string",
          "vlan": 100,
          "port": "string"
        },
        {
          "device": "string",
          "vlan": 100,
          "port": "string"
        },
        {
          "device": "string",
          "vlan": 100,
          "port": "string"
        }
      ],
      "name": "string"
    },
    {
      "connections": [
        {
          "device": "string",
          "vlan": 100,
          "port": "string"
        },
        {
          "device": "string",
          "vlan": 100,
          "port": "string"
        },
        {
          "device": "string",
          "vlan": 100,
          "port": "string"
        },
        {
          "device": "string",
          "vlan": 100,
          "port": "string"
        },
        {
          "device": "string",
          "vlan": 100,
          "port": "string"
        },
        {
          "device": "string",
          "vlan": 100,
          "port": "string"
        },
        {
          "device": "string",
          "vlan": 100,
          "port": "string"
        }
      ],
      "name": "string"
    },
    {
      "connections": [
        {
          "device": "string",
          "vlan": 100,
          "port": "string"
        }
      ],
      "name": "string"
    },
    {
      "connections": [
        {
          "device": "string",
          "vlan": 100,
          "port": "string"
        },
        {
          "device": "string",
          "vlan": 100,
          "port": "string"
        },
        {
          "device": "string",
          "vlan": 100,
          "port": "string"
        },
        {
          "device": "string",
          "vlan": 100,
          "port": "string"
        }
      ],
      "name": "string"
    },
    {
      "connections": [
        {
          "device": "string",
          "vlan": 100,
          "port": "string"
        },
        {
          "device": "string",
          "vlan": 100,
          "port": "string"
        },
        {
          "device": "string",
          "vlan": 100,
          "port": "string"
        },
        {
          "device": "string",
          "vlan": 100,
          "port": "string"
        },
        {
          "device": "string",
          "vlan": 100,
          "port": "string"
        }
      ],
      "name": "string"
    }
  ]
}