{
  "wanCircuits": [
    {
      "name": "wan-circuit-01",
      "connection1": {
        "device": "string",
        "port": "string",
        "vlan": 100
      },
      "connection2": {
        "device": "string",
        "port": "string",
        "vlan": 100
      }
    },
    {
      "name": "wan-circuit-01",
      "connection1": {
        "device": "string",
        "port": "string",
        "vlan": 100
      },
      "connection2": {
        "device": "string",
        "port": "string",
        "vlan": 100
      }
    },
    {
      "name": "wan-circuit-01",
      "connection1": {
        "device": "string",
        "port": "string",
        "vlan": 100
      },
      "connection2": {
        "device": "string",
        "port": "string",
        "vlan": 100
      }
    },
    {
      "name": "wan-circuit-01",
      "connection1": {
        "device": "string",
        "port": "string",
        "vlan": 100
      },
      "connection2": {
        "device": "string",
        "port": "string",
        "vlan": 100
      }
    },
    {
      "name": "wan-circuit-01",
      "connection1": {
        "device": "string",
        "port": "string",
        "vlan": 100
      },
      "connection2": {
        "device": "string",
        "port": "string",
        "vlan": 100
      }
    },
    {
      "name": "wan-circuit-01",
      "connection1": {
        "device": "string",
        "port": "string",
        "vlan": 100
      },
      "connection2": {
        "device": "string",
        "port": "string",
        "vlan": 100
      }
    },
    {
      "name": "wan-circuit-01",
      "connection1": {
        "device": "string",
        "port": "string",
        "vlan": 100
      },
      "connection2": {
        "device": "string",
        "port": "string",
        "vlan": 100
      }
    },
    {
      "name": "wan-circuit-01",
      "connection1": {
        "device": "string",
        "port": "string",
        "vlan": 100
      },
      "connection2": {
        "device": "string",
        "port": "string",
        "vlan": 100
      }
    }
  ]
}