{
  "id": "8c4a168e-c6ca-4978-bcc9-c0ec7f64a163",
  "type": "LOGIN",
  "name": "admin (sjc)",
  "username": "admin",
  "password": "my-s3cr3t-p4s$w0rd",
  "content": "MIIPIQIBAzCCDtoGCSqGSIb3DQEHAa..."
}