{
  "name": "nyc-dc01-fw02",
  "displayName": "nyc-dc01-fw02",
  "sourceName": "nyc-dc01-fw02",
  "type": "FIREWALL",
  "manufacturer": "F5",
  "model": "BIG-IP Virtual Edition",
  "platform": "f5",
  "osVersion": "11.6.1",
  "managementIps": [
    "10.10.10.10"
  ],
  "collectionError": "AUTHENTICATION_FAILED",
  "processingError": "LICENSE_EXHAUSTED"
}