{
  "name": "inet",
  "connections": [
    {
      "gatewayPort": {
        "device": "string",
        "port": "string"
      },
      "peerIps": [
        "1.1.1.1"
      ],
      "subnetAutoDiscovery": "BGP_ROUTES",
      "subnets": [
        "123.223.47.0/24"
      ],
      "uplinkPort": {
        "device": "string",
        "port": "string"
      },
      "vlan": 100
    },
    {
      "gatewayPort": {
        "device": "string",
        "port": "string"
      },
      "peerIps": [
        "1.1.1.1"
      ],
      "subnetAutoDiscovery": "NONE",
      "subnets": [
        "123.223.47.0/24"
      ],
      "uplinkPort": {
        "device": "string",
        "port": "string"
      },
      "vlan": 100
    },
    {
      "gatewayPort": {
        "device": "string",
        "port": "string"
      },
      "peerIps": [
        "1.1.1.1"
      ],
      "subnetAutoDiscovery": "BGP_ROUTES",
      "subnets": [
        "123.223.47.0/24"
      ],
      "uplinkPort": {
        "device": "string",
        "port": "string"
      },
      "vlan": 100
    },
    {
      "gatewayPort": {
        "device": "string",
        "port": "string"
      },
      "peerIps": [
        "1.1.1.1"
      ],
      "subnetAutoDiscovery": "NONE",
      "subnets": [
        "123.223.47.0/24"
      ],
      "uplinkPort": {
        "device": "string",
        "port": "string"
      },
      "vlan": 100
    }
  ]
}