{
  "connections": [
    {
      "device": "string",
      "port": "string",
      "providerEdgeIp": "1.1.1.1",
      "vlan": 100,
      "vrf": "string"
    },
    {
      "device": "string",
      "port": "string",
      "providerEdgeIp": "1.1.1.1",
      "vlan": 100,
      "vrf": "string"
    },
    {
      "device": "string",
      "port": "string",
      "providerEdgeIp": "1.1.1.1",
      "vlan": 100,
      "vrf": "string"
    },
    {
      "device": "string",
      "port": "string",
      "providerEdgeIp": "1.1.1.1",
      "vlan": 100,
      "vrf": "string"
    },
    {
      "device": "string",
      "port": "string",
      "providerEdgeIp": "1.1.1.1",
      "vlan": 100,
      "vrf": "string"
    },
    {
      "device": "string",
      "port": "string",
      "providerEdgeIp": "1.1.1.1",
      "vlan": 100,
      "vrf": "string"
    }
  ],
  "name": "string"
}