{
  "srcIpLocationType": "HOST",
  "dstIpLocationType": "INTERFACE_ATTACHED_SUBNET",
  "info": {
    "paths": [
      {
        "forwardingOutcome": "BLACKHOLE",
        "securityOutcome": "PERMITTED",
        "hops": [
          {
            "behaviors": [
              "NAT",
              "ACL_DENY",
              "ACL_PERMIT",
              "L2",
              "NAT",
              "ACL_PERMIT",
              "PBR",
              "ACL_PERMIT",
              "ACL_PERMIT"
            ],
            "deviceName": "string",
            "deviceType": "AZURE_FIREWALL",
            "egressInterface": "string",
            "ingressInterface": "string",
            "networkFunctions": {}
          },
          {
            "behaviors": [
              "L3",
              "ACL_PERMIT",
              "L3",
              "L3",
              "ACL_PERMIT",
              "L3",
              "PBR",
              "NAT",
              "ACL_DENY"
            ],
            "deviceName": "string",
            "deviceType": "AWS_NAT_GW",
            "egressInterface": "string",
            "ingressInterface": "string",
            "networkFunctions": {}
          },
          {
            "behaviors": [
              "L3"
            ],
            "deviceName": "string",
            "deviceType": "HYPERVISOR",
            "egressInterface": "string",
            "ingressInterface": "string",
            "networkFunctions": {}
          },
          {
            "behaviors": [
              "L3",
              "L3",
              "ACL_PERMIT",
              "ACL_PERMIT",
              "ACL_PERMIT",
              "PBR",
              "NAT",
              "L3",
              "L2"
            ],
            "deviceName": "string",
            "deviceType": "AZURE_FIREWALL",
            "egressInterface": "string",
            "ingressInterface": "string",
            "networkFunctions": {}
          },
          {
            "behaviors": [
              "NAT",
              "PBR",
              "NAT",
              "L2",
              "L3",
              "PBR",
              "ACL_PERMIT",
              "PBR",
              "PBR"
            ],
            "deviceName": "string",
            "deviceType": "ROUTER",
            "egressInterface": "string",
            "ingressInterface": "string",
            "networkFunctions": {}
          },
          {
            "behaviors": [
              "L2",
              "L2",
              "ACL_DENY",
              "ACL_PERMIT",
              "PBR",
              "L2",
              "L3",
              "L3",
              "ACL_DENY"
            ],
            "deviceName": "string",
            "deviceType": "GCP_SUBNET",
            "egressInterface": "string",
            "ingressInterface": "string",
            "networkFunctions": {}
          },
          {
            "behaviors": [
              "ACL_DENY",
              "L2",
              "PBR",
              "NAT",
              "ACL_PERMIT",
              "NAT",
              "ACL_PERMIT",
              "PBR",
              "PBR",
              "L3"
            ],
            "deviceName": "string",
            "deviceType": "ROUTER",
            "egressInterface": "string",
            "ingressInterface": "string",
            "networkFunctions": {}
          },
          {
            "behaviors": [
              "L2",
              "L3",
              "PBR",
              "L3",
              "PBR",
              "PBR",
              "ACL_PERMIT",
              "PBR",
              "ACL_PERMIT",
              "NAT"
            ],
            "deviceName": "string",
            "deviceType": "GCP_CLOUD",
            "egressInterface": "string",
            "ingressInterface": "string",
            "networkFunctions": {}
          },
          {
            "behaviors": [
              "ACL_DENY",
              "L3",
              "L2",
              "L2",
              "L2",
              "NAT",
              "NAT",
              "ACL_PERMIT"
            ],
            "deviceName": "string",
            "deviceType": "GCP_SUBNET",
            "egressInterface": "string",
            "ingressInterface": "string",
            "networkFunctions": {}
          },
          {
            "behaviors": [
              "ACL_PERMIT",
              "ACL_PERMIT",
              "ACL_PERMIT"
            ],
            "deviceName": "string",
            "deviceType": "AWS_TRANSIT_GW",
            "egressInterface": "string",
            "ingressInterface": "string",
            "networkFunctions": {}
          }
        ]
      },
      {
        "forwardingOutcome": "INADMISSIBLE",
        "securityOutcome": "DENIED",
        "hops": [
          {
            "behaviors": [
              "NAT",
              "ACL_PERMIT",
              "L2"
            ],
            "deviceName": "string",
            "deviceType": "GCP_CLOUD",
            "egressInterface": "string",
            "ingressInterface": "string",
            "networkFunctions": {}
          },
          {
            "behaviors": [
              "L2",
              "L3",
              "L3",
              "NAT",
              "ACL_DENY"
            ],
            "deviceName": "string",
            "deviceType": "AZURE_VNET",
            "egressInterface": "string",
            "ingressInterface": "string",
            "networkFunctions": {}
          },
          {
            "behaviors": [
              "L3",
              "ACL_DENY",
              "ACL_PERMIT",
              "NAT",
              "ACL_PERMIT",
              "ACL_DENY",
              "L3",
              "PBR"
            ],
            "deviceName": "string",
            "deviceType": "AZURE_SUBNET",
            "egressInterface": "string",
            "ingressInterface": "string",
            "networkFunctions": {}
          },
          {
            "behaviors": [
              "ACL_PERMIT",
              "L3",
              "L2",
              "L2",
              "L2",
              "PBR"
            ],
            "deviceName": "string",
            "deviceType": "CONTROLLER",
            "egressInterface": "string",
            "ingressInterface": "string",
            "networkFunctions": {}
          },
          {
            "behaviors": [
              "NAT",
              "L2"
            ],
            "deviceName": "string",
            "deviceType": "AZURE_CLOUD",
            "egressInterface": "string",
            "ingressInterface": "string",
            "networkFunctions": {}
          }
        ]
      },
      {
        "forwardingOutcome": "BLACKHOLE",
        "securityOutcome": "DENIED",
        "hops": [
          {
            "behaviors": [
              "L2"
            ],
            "deviceName": "string",
            "deviceType": "AZURE_SUBNET",
            "egressInterface": "string",
            "ingressInterface": "string",
            "networkFunctions": {}
          },
          {
            "behaviors": [
              "ACL_PERMIT"
            ],
            "deviceName": "string",
            "deviceType": "L2_VPN_SERVICE",
            "egressInterface": "string",
            "ingressInterface": "string",
            "networkFunctions": {}
          },
          {
            "behaviors": [
              "L3",
              "L2",
              "NAT",
              "ACL_DENY",
              "ACL_PERMIT"
            ],
            "deviceName": "string",
            "deviceType": "AZURE_FIREWALL",
            "egressInterface": "string",
            "ingressInterface": "string",
            "networkFunctions": {}
          },
          {
            "behaviors": [
              "NAT",
              "L2",
              "PBR",
              "NAT",
              "L3",
              "L3"
            ],
            "deviceName": "string",
            "deviceType": "AZURE_APP_GW",
            "egressInterface": "string",
            "ingressInterface": "string",
            "networkFunctions": {}
          },
          {
            "behaviors": [
              "L2",
              "NAT",
              "L3",
              "ACL_DENY",
              "ACL_PERMIT",
              "L3",
              "L2",
              "ACL_DENY"
            ],
            "deviceName": "string",
            "deviceType": "AWS_DIRECT_CONNECT_GW",
            "egressInterface": "string",
            "ingressInterface": "string",
            "networkFunctions": {}
          },
          {
            "behaviors": [
              "NAT",
              "L3",
              "NAT",
              "ACL_DENY",
              "L3",
              "L2",
              "L3",
              "L2"
            ],
            "deviceName": "string",
            "deviceType": "AWS_DIRECT_CONNECT_GW",
            "egressInterface": "string",
            "ingressInterface": "string",
            "networkFunctions": {}
          },
          {
            "behaviors": [
              "ACL_DENY",
              "L3",
              "PBR",
              "PBR",
              "ACL_DENY",
              "ACL_PERMIT",
              "NAT",
              "ACL_DENY"
            ],
            "deviceName": "string",
            "deviceType": "AWS_INTERNET_GW",
            "egressInterface": "string",
            "ingressInterface": "string",
            "networkFunctions": {}
          },
          {
            "behaviors": [
              "L3",
              "ACL_PERMIT",
              "NAT",
              "ACL_PERMIT"
            ],
            "deviceName": "string",
            "deviceType": "GCP_RT",
            "egressInterface": "string",
            "ingressInterface": "string",
            "networkFunctions": {}
          },
          {
            "behaviors": [
              "L3",
              "ACL_PERMIT",
              "ACL_DENY",
              "L3",
              "NAT",
              "PBR",
              "PBR",
              "PBR",
              "NAT",
              "PBR"
            ],
            "deviceName": "string",
            "deviceType": "AWS_RT",
            "egressInterface": "string",
            "ingressInterface": "string",
            "networkFunctions": {}
          }
        ]
      },
      {
        "forwardingOutcome": "LOOP",
        "securityOutcome": "DENIED",
        "hops": [
          {
            "behaviors": [
              "L3",
              "ACL_DENY",
              "L3",
              "ACL_DENY",
              "L3",
              "ACL_DENY",
              "NAT",
              "PBR"
            ],
            "deviceName": "string",
            "deviceType": "AWS_DIRECT_CONNECT_GW",
            "egressInterface": "string",
            "ingressInterface": "string",
            "networkFunctions": {}
          },
          {
            "behaviors": [
              "PBR",
              "PBR",
              "ACL_PERMIT",
              "L3",
              "NAT",
              "L3"
            ],
            "deviceName": "string",
            "deviceType": "WAN_OPTIMIZER",
            "egressInterface": "string",
            "ingressInterface": "string",
            "networkFunctions": {}
          },
          {
            "behaviors": [
              "ACL_DENY",
              "ACL_PERMIT"
            ],
            "deviceName": "string",
            "deviceType": "SWITCH",
            "egressInterface": "string",
            "ingressInterface": "string",
            "networkFunctions": {}
          },
          {
            "behaviors": [
              "NAT",
              "L2",
              "ACL_PERMIT",
              "L2",
              "NAT"
            ],
            "deviceName": "string",
            "deviceType": "WAN_OPTIMIZER",
            "egressInterface": "string",
            "ingressInterface": "string",
            "networkFunctions": {}
          }
        ]
      },
      {
        "forwardingOutcome": "DELIVERED_TO_INCORRECT_LOCATION",
        "securityOutcome": "DENIED",
        "hops": [
          {
            "behaviors": [
              "L3",
              "L2",
              "L2",
              "PBR",
              "L3",
              "NAT"
            ],
            "deviceName": "string",
            "deviceType": "AZURE_VNET",
            "egressInterface": "string",
            "ingressInterface": "string",
            "networkFunctions": {}
          },
          {
            "behaviors": [
              "ACL_PERMIT",
              "PBR"
            ],
            "deviceName": "string",
            "deviceType": "EDGE_VM",
            "egressInterface": "string",
            "ingressInterface": "string",
            "networkFunctions": {}
          },
          {
            "behaviors": [
              "ACL_PERMIT"
            ],
            "deviceName": "string",
            "deviceType": "RIVERBED_INTERCEPTOR",
            "egressInterface": "string",
            "ingressInterface": "string",
            "networkFunctions": {}
          },
          {
            "behaviors": [
              "ACL_DENY",
              "PBR",
              "NAT",
              "L3",
              "ACL_PERMIT",
              "L2",
              "PBR",
              "L2",
              "PBR",
              "L3"
            ],
            "deviceName": "string",
            "deviceType": "SD_WAN",
            "egressInterface": "string",
            "ingressInterface": "string",
            "networkFunctions": {}
          }
        ]
      },
      {
        "forwardingOutcome": "UNREACHABLE",
        "securityOutcome": "DENIED",
        "hops": [
          {
            "behaviors": [
              "PBR",
              "L3",
              "L2",
              "L3",
              "NAT",
              "ACL_DENY",
              "ACL_PERMIT",
              "ACL_DENY",
              "PBR",
              "NAT"
            ],
            "deviceName": "string",
            "deviceType": "CIRCUIT",
            "egressInterface": "string",
            "ingressInterface": "string",
            "networkFunctions": {}
          },
          {
            "behaviors": [
              "ACL_PERMIT",
              "ACL_DENY",
              "L2",
              "ACL_PERMIT",
              "NAT"
            ],
            "deviceName": "string",
            "deviceType": "FIREWALL",
            "egressInterface": "string",
            "ingressInterface": "string",
            "networkFunctions": {}
          },
          {
            "behaviors": [
              "ACL_DENY",
              "PBR",
              "ACL_PERMIT",
              "NAT",
              "NAT",
              "L2",
              "ACL_PERMIT"
            ],
            "deviceName": "string",
            "deviceType": "AWS_SUBNET",
            "egressInterface": "string",
            "ingressInterface": "string",
            "networkFunctions": {}
          },
          {
            "behaviors": [
              "ACL_DENY",
              "NAT",
              "NAT",
              "L2",
              "L2",
              "L3",
              "L3",
              "L3",
              "L3",
              "ACL_DENY"
            ],
            "deviceName": "string",
            "deviceType": "AZURE_VNET_GW",
            "egressInterface": "string",
            "ingressInterface": "string",
            "networkFunctions": {}
          },
          {
            "behaviors": [
              "L2"
            ],
            "deviceName": "string",
            "deviceType": "AZURE_SUBNET",
            "egressInterface": "string",
            "ingressInterface": "string",
            "networkFunctions": {}
          },
          {
            "behaviors": [
              "ACL_PERMIT",
              "NAT",
              "ACL_PERMIT",
              "L3",
              "NAT",
              "L2",
              "ACL_DENY",
              "ACL_DENY",
              "L3",
              "PBR"
            ],
            "deviceName": "string",
            "deviceType": "GCP_VPN_GW",
            "egressInterface": "string",
            "ingressInterface": "string",
            "networkFunctions": {}
          },
          {
            "behaviors": [
              "L3"
            ],
            "deviceName": "string",
            "deviceType": "GCP_LB",
            "egressInterface": "string",
            "ingressInterface": "string",
            "networkFunctions": {}
          },
          {
            "behaviors": [
              "ACL_PERMIT",
              "ACL_DENY",
              "ACL_PERMIT",
              "L2",
              "ACL_DENY"
            ],
            "deviceName": "string",
            "deviceType": "FIREWALL",
            "egressInterface": "string",
            "ingressInterface": "string",
            "networkFunctions": {}
          },
          {
            "behaviors": [
              "L2"
            ],
            "deviceName": "string",
            "deviceType": "SWITCH",
            "egressInterface": "string",
            "ingressInterface": "string",
            "networkFunctions": {}
          },
          {
            "behaviors": [
              "ACL_DENY",
              "ACL_PERMIT",
              "L2",
              "ACL_DENY",
              "L2",
              "L3",
              "NAT"
            ],
            "deviceName": "string",
            "deviceType": "FIREWALL",
            "egressInterface": "string",
            "ingressInterface": "string",
            "networkFunctions": {}
          }
        ]
      },
      {
        "forwardingOutcome": "INADMISSIBLE",
        "securityOutcome": "PERMITTED",
        "hops": [
          {
            "behaviors": [
              "PBR",
              "ACL_DENY",
              "ACL_DENY",
              "NAT",
              "L2",
              "ACL_DENY",
              "ACL_PERMIT",
              "PBR",
              "L3",
              "ACL_DENY"
            ],
            "deviceName": "string",
            "deviceType": "GCP_VPN_GW",
            "egressInterface": "string",
            "ingressInterface": "string",
            "networkFunctions": {}
          },
          {
            "behaviors": [
              "L2",
              "L2"
            ],
            "deviceName": "string",
            "deviceType": "AWS_RT",
            "egressInterface": "string",
            "ingressInterface": "string",
            "networkFunctions": {}
          },
          {
            "behaviors": [
              "L3",
              "L2",
              "NAT"
            ],
            "deviceName": "string",
            "deviceType": "OPENFLOW_SWITCH",
            "egressInterface": "string",
            "ingressInterface": "string",
            "networkFunctions": {}
          },
          {
            "behaviors": [
              "L3",
              "ACL_PERMIT",
              "PBR",
              "PBR",
              "ACL_PERMIT"
            ],
            "deviceName": "string",
            "deviceType": "HYPERVISOR",
            "egressInterface": "string",
            "ingressInterface": "string",
            "networkFunctions": {}
          },
          {
            "behaviors": [
              "NAT"
            ],
            "deviceName": "string",
            "deviceType": "GCP_VPN_GW",
            "egressInterface": "string",
            "ingressInterface": "string",
            "networkFunctions": {}
          }
        ]
      }
    ],
    "totalHits": {
      "type": "EXACT",
      "value": 10
    }
  },
  "returnPathInfo": {
    "paths": [
      {
        "forwardingOutcome": "LOOP",
        "securityOutcome": "PERMITTED",
        "hops": [
          {
            "behaviors": [
              "NAT"
            ],
            "deviceName": "string",
            "deviceType": "ROUTER",
            "egressInterface": "string",
            "ingressInterface": "string",
            "networkFunctions": {}
          },
          {
            "behaviors": [
              "PBR",
              "ACL_PERMIT",
              "L2",
              "L2",
              "L2",
              "L2"
            ],
            "deviceName": "string",
            "deviceType": "GCP_RT",
            "egressInterface": "string",
            "ingressInterface": "string",
            "networkFunctions": {}
          }
        ]
      },
      {
        "forwardingOutcome": "DROPPED",
        "securityOutcome": "DENIED",
        "hops": [
          {
            "behaviors": [
              "ACL_DENY",
              "PBR",
              "ACL_PERMIT",
              "PBR",
              "ACL_DENY",
              "L2",
              "ACL_DENY",
              "NAT",
              "ACL_DENY"
            ],
            "deviceName": "string",
            "deviceType": "AWS_VPN_GW",
            "egressInterface": "string",
            "ingressInterface": "string",
            "networkFunctions": {}
          },
          {
            "behaviors": [
              "PBR",
              "L2",
              "ACL_PERMIT",
              "ACL_DENY",
              "NAT"
            ],
            "deviceName": "string",
            "deviceType": "OPENFLOW_SWITCH",
            "egressInterface": "string",
            "ingressInterface": "string",
            "networkFunctions": {}
          },
          {
            "behaviors": [
              "L2",
              "L2",
              "L2"
            ],
            "deviceName": "string",
            "deviceType": "FIREWALL",
            "egressInterface": "string",
            "ingressInterface": "string",
            "networkFunctions": {}
          },
          {
            "behaviors": [
              "ACL_PERMIT",
              "ACL_PERMIT",
              "L3",
              "L3",
              "ACL_DENY",
              "ACL_PERMIT",
              "L3",
              "NAT",
              "ACL_PERMIT"
            ],
            "deviceName": "string",
            "deviceType": "GCP_SUBNET",
            "egressInterface": "string",
            "ingressInterface": "string",
            "networkFunctions": {}
          }
        ]
      },
      {
        "forwardingOutcome": "LOOP",
        "securityOutcome": "PERMITTED",
        "hops": [
          {
            "behaviors": [
              "ACL_PERMIT",
              "ACL_DENY",
              "L2",
              "ACL_PERMIT",
              "L3",
              "ACL_DENY"
            ],
            "deviceName": "string",
            "deviceType": "GCP_SUBNET",
            "egressInterface": "string",
            "ingressInterface": "string",
            "networkFunctions": {}
          },
          {
            "behaviors": [
              "ACL_DENY",
              "ACL_PERMIT",
              "L2"
            ],
            "deviceName": "string",
            "deviceType": "OPENFLOW_SWITCH",
            "egressInterface": "string",
            "ingressInterface": "string",
            "networkFunctions": {}
          },
          {
            "behaviors": [
              "NAT",
              "NAT",
              "L3",
              "PBR",
              "PBR",
              "L2",
              "ACL_DENY",
              "ACL_DENY",
              "L3"
            ],
            "deviceName": "string",
            "deviceType": "AWS_RT",
            "egressInterface": "string",
            "ingressInterface": "string",
            "networkFunctions": {}
          },
          {
            "behaviors": [
              "ACL_DENY",
              "L2",
              "ACL_PERMIT",
              "L2",
              "ACL_DENY"
            ],
            "deviceName": "string",
            "deviceType": "BUNDLED_ROUTER",
            "egressInterface": "string",
            "ingressInterface": "string",
            "networkFunctions": {}
          },
          {
            "behaviors": [
              "L3",
              "L3",
              "ACL_PERMIT",
              "ACL_PERMIT",
              "NAT",
              "L2",
              "PBR",
              "PBR",
              "L2",
              "L2"
            ],
            "deviceName": "string",
            "deviceType": "AWS_TRANSIT_GW",
            "egressInterface": "string",
            "ingressInterface": "string",
            "networkFunctions": {}
          },
          {
            "behaviors": [
              "NAT",
              "ACL_PERMIT",
              "PBR",
              "NAT",
              "PBR",
              "L2",
              "ACL_PERMIT",
              "L3",
              "ACL_DENY"
            ],
            "deviceName": "string",
            "deviceType": "AWS_DIRECT_CONNECT_GW",
            "egressInterface": "string",
            "ingressInterface": "string",
            "networkFunctions": {}
          },
          {
            "behaviors": [
              "ACL_DENY",
              "ACL_DENY",
              "PBR",
              "NAT",
              "NAT",
              "ACL_DENY",
              "ACL_PERMIT",
              "NAT"
            ],
            "deviceName": "string",
            "deviceType": "RIVERBED_INTERCEPTOR",
            "egressInterface": "string",
            "ingressInterface": "string",
            "networkFunctions": {}
          },
          {
            "behaviors": [
              "L2",
              "NAT"
            ],
            "deviceName": "string",
            "deviceType": "AZURE_CLOUD",
            "egressInterface": "string",
            "ingressInterface": "string",
            "networkFunctions": {}
          }
        ]
      },
      {
        "forwardingOutcome": "DELIVERED_TO_INCORRECT_LOCATION",
        "securityOutcome": "DENIED",
        "hops": [
          {
            "behaviors": [
              "L2"
            ],
            "deviceName": "string",
            "deviceType": "GCP_CLOUD",
            "egressInterface": "string",
            "ingressInterface": "string",
            "networkFunctions": {}
          },
          {
            "behaviors": [
              "PBR",
              "PBR",
              "PBR",
              "NAT",
              "PBR",
              "L2",
              "L3",
              "L3",
              "ACL_PERMIT",
              "L2"
            ],
            "deviceName": "string",
            "deviceType": "CIRCUIT",
            "egressInterface": "string",
            "ingressInterface": "string",
            "networkFunctions": {}
          },
          {
            "behaviors": [
              "L3",
              "NAT",
              "NAT",
              "PBR"
            ],
            "deviceName": "string",
            "deviceType": "AWS_LB",
            "egressInterface": "string",
            "ingressInterface": "string",
            "networkFunctions": {}
          },
          {
            "behaviors": [
              "PBR",
              "L2",
              "NAT",
              "NAT"
            ],
            "deviceName": "string",
            "deviceType": "GCP_VPN_GW",
            "egressInterface": "string",
            "ingressInterface": "string",
            "networkFunctions": {}
          }
        ]
      },
      {
        "forwardingOutcome": "DELIVERED",
        "securityOutcome": "PERMITTED",
        "hops": [
          {
            "behaviors": [
              "NAT",
              "NAT",
              "L2",
              "L2",
              "PBR",
              "NAT"
            ],
            "deviceName": "string",
            "deviceType": "AWS_RT",
            "egressInterface": "string",
            "ingressInterface": "string",
            "networkFunctions": {}
          },
          {
            "behaviors": [
              "NAT",
              "L3",
              "PBR"
            ],
            "deviceName": "string",
            "deviceType": "BUNDLED_ROUTER",
            "egressInterface": "string",
            "ingressInterface": "string",
            "networkFunctions": {}
          },
          {
            "behaviors": [
              "L2",
              "L2",
              "L2",
              "PBR",
              "PBR",
              "ACL_DENY"
            ],
            "deviceName": "string",
            "deviceType": "FIREWALL",
            "egressInterface": "string",
            "ingressInterface": "string",
            "networkFunctions": {}
          },
          {
            "behaviors": [
              "L2"
            ],
            "deviceName": "string",
            "deviceType": "EDGE_VM",
            "egressInterface": "string",
            "ingressInterface": "string",
            "networkFunctions": {}
          },
          {
            "behaviors": [
              "ACL_PERMIT",
              "ACL_PERMIT"
            ],
            "deviceName": "string",
            "deviceType": "FIREWALL",
            "egressInterface": "string",
            "ingressInterface": "string",
            "networkFunctions": {}
          },
          {
            "behaviors": [
              "ACL_PERMIT",
              "ACL_DENY",
              "L3",
              "L2",
              "PBR",
              "ACL_PERMIT",
              "ACL_PERMIT",
              "NAT",
              "ACL_PERMIT"
            ],
            "deviceName": "string",
            "deviceType": "GCP_NAT_GW",
            "egressInterface": "string",
            "ingressInterface": "string",
            "networkFunctions": {}
          },
          {
            "behaviors": [
              "ACL_DENY",
              "PBR",
              "L3",
              "NAT",
              "ACL_PERMIT",
              "PBR",
              "L2",
              "L3",
              "ACL_DENY",
              "L2"
            ],
            "deviceName": "string",
            "deviceType": "AWS_RT",
            "egressInterface": "string",
            "ingressInterface": "string",
            "networkFunctions": {}
          },
          {
            "behaviors": [
              "L2",
              "ACL_PERMIT",
              "ACL_DENY",
              "L2"
            ],
            "deviceName": "string",
            "deviceType": "OPENFLOW_SWITCH",
            "egressInterface": "string",
            "ingressInterface": "string",
            "networkFunctions": {}
          }
        ]
      },
      {
        "forwardingOutcome": "INADMISSIBLE",
        "securityOutcome": "DENIED",
        "hops": [
          {
            "behaviors": [
              "L2",
              "ACL_PERMIT",
              "L2",
              "PBR"
            ],
            "deviceName": "string",
            "deviceType": "AWS_NAT_GW",
            "egressInterface": "string",
            "ingressInterface": "string",
            "networkFunctions": {}
          },
          {
            "behaviors": [
              "L2",
              "ACL_PERMIT",
              "PBR",
              "ACL_PERMIT",
              "L3",
              "NAT",
              "NAT",
              "ACL_PERMIT"
            ],
            "deviceName": "string",
            "deviceType": "EDGE_VM",
            "egressInterface": "string",
            "ingressInterface": "string",
            "networkFunctions": {}
          },
          {
            "behaviors": [
              "ACL_PERMIT",
              "L3",
              "PBR",
              "L3",
              "L2",
              "L3",
              "ACL_DENY",
              "L2",
              "L3",
              "NAT"
            ],
            "deviceName": "string",
            "deviceType": "AZURE_CLOUD",
            "egressInterface": "string",
            "ingressInterface": "string",
            "networkFunctions": {}
          },
          {
            "behaviors": [
              "ACL_PERMIT",
              "NAT",
              "L2"
            ],
            "deviceName": "string",
            "deviceType": "OPENFLOW_SWITCH",
            "egressInterface": "string",
            "ingressInterface": "string",
            "networkFunctions": {}
          },
          {
            "behaviors": [
              "L2",
              "NAT"
            ],
            "deviceName": "string",
            "deviceType": "GCP_NAT_GW",
            "egressInterface": "string",
            "ingressInterface": "string",
            "networkFunctions": {}
          },
          {
            "behaviors": [
              "NAT",
              "ACL_PERMIT",
              "ACL_PERMIT",
              "PBR",
              "ACL_DENY",
              "ACL_PERMIT",
              "L2",
              "PBR"
            ],
            "deviceName": "string",
            "deviceType": "GCP_TRAFFIC_DIRECTOR",
            "egressInterface": "string",
            "ingressInterface": "string",
            "networkFunctions": {}
          }
        ]
      },
      {
        "forwardingOutcome": "LOOP",
        "securityOutcome": "PERMITTED",
        "hops": [
          {
            "behaviors": [
              "PBR",
              "ACL_DENY",
              "L3",
              "ACL_PERMIT",
              "NAT"
            ],
            "deviceName": "string",
            "deviceType": "BUNDLED_ROUTER",
            "egressInterface": "string",
            "ingressInterface": "string",
            "networkFunctions": {}
          },
          {
            "behaviors": [
              "ACL_PERMIT",
              "NAT",
              "L2",
              "NAT",
              "L3",
              "ACL_DENY",
              "PBR",
              "L2",
              "PBR"
            ],
            "deviceName": "string",
            "deviceType": "AZURE_FIREWALL",
            "egressInterface": "string",
            "ingressInterface": "string",
            "networkFunctions": {}
          },
          {
            "behaviors": [
              "ACL_PERMIT",
              "NAT",
              "ACL_DENY",
              "ACL_DENY",
              "L2",
              "ACL_PERMIT",
              "PBR",
              "L2"
            ],
            "deviceName": "string",
            "deviceType": "MPLS_VPN_SERVICE",
            "egressInterface": "string",
            "ingressInterface": "string",
            "networkFunctions": {}
          },
          {
            "behaviors": [
              "ACL_PERMIT",
              "PBR",
              "ACL_DENY",
              "NAT",
              "NAT"
            ],
            "deviceName": "string",
            "deviceType": "FIREWALL",
            "egressInterface": "string",
            "ingressInterface": "string",
            "networkFunctions": {}
          },
          {
            "behaviors": [
              "ACL_PERMIT",
              "L2",
              "PBR",
              "ACL_DENY"
            ],
            "deviceName": "string",
            "deviceType": "AWS_CLOUD",
            "egressInterface": "string",
            "ingressInterface": "string",
            "networkFunctions": {}
          },
          {
            "behaviors": [
              "ACL_DENY",
              "PBR",
              "L3",
              "L3"
            ],
            "deviceName": "string",
            "deviceType": "RIVERBED_INTERCEPTOR",
            "egressInterface": "string",
            "ingressInterface": "string",
            "networkFunctions": {}
          }
        ]
      }
    ],
    "totalHits": {
      "type": "LOWER_BOUND",
      "value": 7
    }
  },
  "timedOut": false,
  "queryUrl": "string"
}