{
  "actions": [
    {
      "name": "runNqeQueryUsingPOST",
      "protocol": "REST",
      "method": "POST",
      "entitypath": "{base_path}/{version}/api/nqe?{query}",
      "requestSchema": "schema.json",
      "responseSchema": "schema.json",
      "timeout": 0,
      "sendEmpty": false,
      "requestDatatype": "JSON",
      "responseDatatype": "JSON",
      "headers": {},
      "responseObjects": [
        {
          "type": "default",
          "key": "",
          "mockFile": "mockdatafiles/runNqeQueryUsingPOST-default.json"
        }
      ]
    },
    {
      "name": "getNqeQueriesUsingGET",
      "protocol": "REST",
      "method": "GET",
      "entitypath": "{base_path}/{version}/api/nqe/queries?{query}",
      "requestSchema": "schema.json",
      "responseSchema": "schema.json",
      "timeout": 0,
      "sendEmpty": false,
      "sendGetBody": false,
      "requestDatatype": "JSON",
      "responseDatatype": "JSON",
      "headers": {},
      "responseObjects": [
        {
          "type": "default",
          "key": "",
          "mockFile": "mockdatafiles/getNqeQueriesUsingGET-default.json"
        }
      ]
    }
  ]
}