[
  {
    "name": "atl-edge",
    "devices": [
      "atl-edge-fw01",
      "atl-edge-fw02",
      "atl-isp-edge01",
      "atl-isp-edge02"
    ]
  },
  {
    "name": "atl-edge",
    "devices": [
      "atl-edge-fw01",
      "atl-edge-fw02",
      "atl-isp-edge01",
      "atl-isp-edge02"
    ]
  },
  {
    "name": "atl-edge",
    "devices": [
      "atl-edge-fw01",
      "atl-edge-fw02",
      "atl-isp-edge01",
      "atl-isp-edge02"
    ]
  }
]