{
  "aliases": [
    {
      "creationTime": "string",
      "creatorId": "string",
      "name": "string",
      "type": "INTERFACES"
    },
    {
      "creationTime": "string",
      "creatorId": "string",
      "name": "string",
      "type": "HEADERS"
    }
  ]
}