[
  {
    "id": "8c4a168e-c6ca-4978-bcc9-c0ec7f64a164",
    "host": "10.121.7.14",
    "port": 23,
    "username": "admin",
    "password": "my-s3cr3t-p4s$w0rd",
    "supportsPortForwarding": true
  },
  {
    "id": "8c4a168e-c6ca-4978-bcc9-c0ec7f64a164",
    "host": "10.121.7.14",
    "port": 23,
    "username": "admin",
    "password": "my-s3cr3t-p4s$w0rd",
    "supportsPortForwarding": false
  },
  {
    "id": "8c4a168e-c6ca-4978-bcc9-c0ec7f64a164",
    "host": "10.121.7.14",
    "port": 23,
    "username": "admin",
    "password": "my-s3cr3t-p4s$w0rd",
    "supportsPortForwarding": false
  },
  {
    "id": "8c4a168e-c6ca-4978-bcc9-c0ec7f64a164",
    "host": "10.121.7.14",
    "port": 23,
    "username": "admin",
    "password": "my-s3cr3t-p4s$w0rd",
    "supportsPortForwarding": true
  }
]