[
  {
    "description": "string",
    "dynamic": true,
    "field": "activity",
    "filter": {},
    "id": 5,
    "include_custom_devices": true,
    "mod_time": 5,
    "name": "string",
    "value": "string"
  }
]