[
  {
    "description": "string",
    "id": 6,
    "mod_time": 5,
    "name": "string",
    "network_id": 6,
    "node_id": 2,
    "vlanid": 4
  },
  {
    "description": "string",
    "id": 5,
    "mod_time": 6,
    "name": "string",
    "network_id": 8,
    "node_id": 10,
    "vlanid": 2
  },
  {
    "description": "string",
    "id": 3,
    "mod_time": 5,
    "name": "string",
    "network_id": 1,
    "node_id": 10,
    "vlanid": 2
  },
  {
    "description": "string",
    "id": 4,
    "mod_time": 6,
    "name": "string",
    "network_id": 3,
    "node_id": 10,
    "vlanid": 6
  }
]