{
  "edges": [
    {
      "annotations": {
        "appearances": [],
        "protocols": []
      },
      "from": 8,
      "to": 6,
      "weight": 6
    },
    {
      "annotations": {
        "appearances": [],
        "protocols": []
      },
      "from": 6,
      "to": 1,
      "weight": 4
    },
    {
      "annotations": {
        "appearances": [],
        "protocols": []
      },
      "from": 4,
      "to": 5,
      "weight": 10
    },
    {
      "annotations": {
        "appearances": [],
        "protocols": []
      },
      "from": 9,
      "to": 6,
      "weight": 1
    }
  ],
  "from": 5,
  "until": 4,
  "warnings": [
    {
      "message": "string",
      "properties": {
        "node_hostname": "string",
        "node_id": 1
      },
      "type": "string"
    },
    {
      "message": "string",
      "properties": {
        "node_hostname": "string",
        "node_id": 6
      },
      "type": "string"
    },
    {
      "message": "string",
      "properties": {
        "node_hostname": "string",
        "node_id": 4
      },
      "type": "string"
    },
    {
      "message": "string",
      "properties": {
        "node_hostname": "string",
        "node_id": 7
      },
      "type": "string"
    },
    {
      "message": "string",
      "properties": {
        "node_hostname": "string",
        "node_id": 7
      },
      "type": "string"
    },
    {
      "message": "string",
      "properties": {
        "node_hostname": "string",
        "node_id": 4
      },
      "type": "string"
    },
    {
      "message": "string",
      "properties": {
        "node_hostname": "string",
        "node_id": 6
      },
      "type": "string"
    },
    {
      "message": "string",
      "properties": {
        "node_hostname": "string",
        "node_id": 10
      },
      "type": "string"
    },
    {
      "message": "string",
      "properties": {
        "node_hostname": "string",
        "node_id": 6
      },
      "type": "string"
    },
    {
      "message": "string",
      "properties": {
        "node_hostname": "string",
        "node_id": 3
      },
      "type": "string"
    }
  ]
}