{
  "actions": [
    {
      "name": "fetchCursorInBody",
      "protocol": "REST",
      "method": "POST",
      "entitypath": "{base_path}/{version}/records/cursor?{query}",
      "requestSchema": "schema.json",
      "responseSchema": "schema.json",
      "timeout": 0,
      "sendEmpty": false,
      "sendGetBody": false,
      "requestDatatype": "JSON",
      "responseDatatype": "JSON",
      "headers": {},
      "responseObjects": [
        {
          "type": "default",
          "key": "",
          "mockFile": "mockdatafiles/fetchCursorInBody-default.json"
        }
      ]
    },
    {
      "name": "fetchCursor",
      "protocol": "REST",
      "method": "GET",
      "entitypath": "{base_path}/{version}/records/cursor/{pathv1}?{query}",
      "requestSchema": "schema.json",
      "responseSchema": "schema.json",
      "timeout": 0,
      "sendEmpty": false,
      "sendGetBody": false,
      "requestDatatype": "JSON",
      "responseDatatype": "JSON",
      "headers": {},
      "responseObjects": [
        {
          "type": "default",
          "key": "",
          "mockFile": "mockdatafiles/fetchCursor-default.json"
        }
      ]
    },
    {
      "name": "performRecordQuery",
      "protocol": "REST",
      "method": "POST",
      "entitypath": "{base_path}/{version}/records/search?{query}",
      "requestSchema": "schema.json",
      "responseSchema": "schema.json",
      "timeout": 0,
      "sendEmpty": false,
      "sendGetBody": false,
      "requestDatatype": "JSON",
      "responseDatatype": "JSON",
      "headers": {},
      "responseObjects": [
        {
          "type": "default",
          "key": "",
          "mockFile": "mockdatafiles/performRecordQuery-default.json"
        }
      ]
    }
  ]
}