{
  "apply_all": true,
  "author": "string",
  "categories": [
    "string",
    "string",
    "string",
    "string",
    "string",
    "string",
    "string",
    "string",
    "string"
  ],
  "cc": [
    "string",
    "string",
    "string"
  ],
  "description": "string",
  "disabled": true,
  "field_name": "string",
  "field_name2": "string",
  "field_op": "null",
  "id": 7,
  "interval_length": 30,
  "mod_time": 7,
  "name": "string",
  "notify_snmp": false,
  "object_type": "device",
  "operand": "string",
  "operator": "<=",
  "param": {},
  "param2": {},
  "protocols": [
    "string",
    "string",
    "string",
    "string",
    "string",
    "string",
    "string",
    "string",
    "string"
  ],
  "refire_interval": 14400,
  "severity": 3,
  "stat_name": "string",
  "type": "threshold",
  "units": "none"
}