[
  {
    "bytes": 8,
    "device_id1": "string",
    "device_id2": "string",
    "id": "string",
    "ipaddr1": "string",
    "ipaddr2": "string",
    "ipproto": 4,
    "l7proto": "string",
    "name": "string",
    "pkts": 8,
    "port1": 4,
    "port2": 6,
    "snaplen": 2,
    "tend_usec": 10,
    "tstart_usec": 10,
    "vlanid": 1
  },
  {
    "bytes": 2,
    "device_id1": "string",
    "device_id2": "string",
    "id": "string",
    "ipaddr1": "string",
    "ipaddr2": "string",
    "ipproto": 1,
    "l7proto": "string",
    "name": "string",
    "pkts": 4,
    "port1": 10,
    "port2": 8,
    "snaplen": 3,
    "tend_usec": 8,
    "tstart_usec": 7,
    "vlanid": 8
  },
  {
    "bytes": 9,
    "device_id1": "string",
    "device_id2": "string",
    "id": "string",
    "ipaddr1": "string",
    "ipaddr2": "string",
    "ipproto": 6,
    "l7proto": "string",
    "name": "string",
    "pkts": 6,
    "port1": 1,
    "port2": 7,
    "snaplen": 4,
    "tend_usec": 10,
    "tstart_usec": 9,
    "vlanid": 10
  },
  {
    "bytes": 5,
    "device_id1": "string",
    "device_id2": "string",
    "id": "string",
    "ipaddr1": "string",
    "ipaddr2": "string",
    "ipproto": 4,
    "l7proto": "string",
    "name": "string",
    "pkts": 6,
    "port1": 9,
    "port2": 3,
    "snaplen": 9,
    "tend_usec": 10,
    "tstart_usec": 9,
    "vlanid": 3
  }
]