{
  "actions": [
    {
      "name": "get0",
      "protocol": "REST",
      "method": "GET",
      "entitypath": "{base_path}/{version}/analysispriority/config/{pathv1}?{query}",
      "requestSchema": "schema.json",
      "responseSchema": "schema.json",
      "timeout": 0,
      "sendEmpty": false,
      "sendGetBody": false,
      "requestDatatype": "JSON",
      "responseDatatype": "JSON",
      "headers": {},
      "responseObjects": [
        {
          "type": "default",
          "key": "",
          "mockFile": "mockdatafiles/get0-default.json"
        }
      ]
    },
    {
      "name": "replace",
      "protocol": "REST",
      "method": "PUT",
      "entitypath": "{base_path}/{version}/analysispriority/config/{pathv1}?{query}",
      "requestSchema": "schema.json",
      "responseSchema": "schema.json",
      "timeout": 0,
      "sendEmpty": false,
      "sendGetBody": false,
      "requestDatatype": "JSON",
      "responseDatatype": "JSON",
      "headers": {},
      "responseObjects": [
        {
          "type": "default",
          "key": "",
          "mockFile": ""
        }
      ]
    },
    {
      "name": "getAnalysispriorityApplianceIdManager",
      "protocol": "REST",
      "method": "GET",
      "entitypath": "{base_path}/{version}/analysispriority/{pathv1}/manager?{query}",
      "requestSchema": "schema.json",
      "responseSchema": "schema.json",
      "timeout": 0,
      "sendEmpty": false,
      "sendGetBody": false,
      "requestDatatype": "JSON",
      "responseDatatype": "JSON",
      "headers": {},
      "responseObjects": [
        {
          "type": "default",
          "key": "",
          "mockFile": "mockdatafiles/getAnalysispriorityApplianceIdManager-default.json"
        }
      ]
    },
    {
      "name": "patchAnalysispriorityApplianceIdManager",
      "protocol": "REST",
      "method": "PATCH",
      "entitypath": "{base_path}/{version}/analysispriority/{pathv1}/manager?{query}",
      "requestSchema": "schema.json",
      "responseSchema": "schema.json",
      "timeout": 0,
      "sendEmpty": false,
      "sendGetBody": false,
      "requestDatatype": "JSON",
      "responseDatatype": "JSON",
      "headers": {},
      "responseObjects": [
        {
          "type": "default",
          "key": "",
          "mockFile": ""
        }
      ]
    }
  ]
}