{
  "actions": [
    {
      "name": "getDevicegroups",
      "protocol": "REST",
      "method": "GET",
      "entitypath": "{base_path}/{version}/devicegroups?{query}",
      "requestSchema": "schema.json",
      "responseSchema": "schema.json",
      "timeout": 0,
      "sendEmpty": false,
      "sendGetBody": false,
      "requestDatatype": "JSON",
      "responseDatatype": "JSON",
      "headers": {},
      "responseObjects": [
        {
          "type": "default",
          "key": "",
          "mockFile": "mockdatafiles/getDevicegroups-default.json"
        }
      ]
    },
    {
      "name": "postDevicegroups",
      "protocol": "REST",
      "method": "POST",
      "entitypath": "{base_path}/{version}/devicegroups?{query}",
      "requestSchema": "schema.json",
      "responseSchema": "schema.json",
      "timeout": 0,
      "sendEmpty": false,
      "sendGetBody": false,
      "requestDatatype": "JSON",
      "responseDatatype": "JSON",
      "headers": {},
      "responseObjects": [
        {
          "type": "default",
          "key": "",
          "mockFile": ""
        }
      ]
    },
    {
      "name": "deleteDevicegroupsId",
      "protocol": "REST",
      "method": "DELETE",
      "entitypath": "{base_path}/{version}/devicegroups/{pathv1}?{query}",
      "requestSchema": "schema.json",
      "responseSchema": "schema.json",
      "timeout": 0,
      "sendEmpty": false,
      "sendGetBody": false,
      "requestDatatype": "JSON",
      "responseDatatype": "JSON",
      "headers": {},
      "responseObjects": [
        {
          "type": "default",
          "key": "",
          "mockFile": ""
        }
      ]
    },
    {
      "name": "getDevicegroupsId",
      "protocol": "REST",
      "method": "GET",
      "entitypath": "{base_path}/{version}/devicegroups/{pathv1}?{query}",
      "requestSchema": "schema.json",
      "responseSchema": "schema.json",
      "timeout": 0,
      "sendEmpty": false,
      "sendGetBody": false,
      "requestDatatype": "JSON",
      "responseDatatype": "JSON",
      "headers": {},
      "responseObjects": [
        {
          "type": "default",
          "key": "",
          "mockFile": "mockdatafiles/getDevicegroupsId-default.json"
        }
      ]
    },
    {
      "name": "patchDevicegroupsId",
      "protocol": "REST",
      "method": "PATCH",
      "entitypath": "{base_path}/{version}/devicegroups/{pathv1}?{query}",
      "requestSchema": "schema.json",
      "responseSchema": "schema.json",
      "timeout": 0,
      "sendEmpty": false,
      "sendGetBody": false,
      "requestDatatype": "JSON",
      "responseDatatype": "JSON",
      "headers": {},
      "responseObjects": [
        {
          "type": "default",
          "key": "",
          "mockFile": ""
        }
      ]
    },
    {
      "name": "getAllAssignedAlert0",
      "protocol": "REST",
      "method": "GET",
      "entitypath": "{base_path}/{version}/devicegroups/{pathv1}/alerts?{query}",
      "requestSchema": "schema.json",
      "responseSchema": "schema.json",
      "timeout": 0,
      "sendEmpty": false,
      "sendGetBody": false,
      "requestDatatype": "JSON",
      "responseDatatype": "JSON",
      "headers": {},
      "responseObjects": [
        {
          "type": "default",
          "key": "",
          "mockFile": "mockdatafiles/getAllAssignedAlert0-default.json"
        }
      ]
    },
    {
      "name": "manageAlertAssignments0",
      "protocol": "REST",
      "method": "POST",
      "entitypath": "{base_path}/{version}/devicegroups/{pathv1}/alerts?{query}",
      "requestSchema": "schema.json",
      "responseSchema": "schema.json",
      "timeout": 0,
      "sendEmpty": false,
      "sendGetBody": false,
      "requestDatatype": "JSON",
      "responseDatatype": "JSON",
      "headers": {},
      "responseObjects": [
        {
          "type": "default",
          "key": "",
          "mockFile": ""
        }
      ]
    },
    {
      "name": "unassignAlert0",
      "protocol": "REST",
      "method": "DELETE",
      "entitypath": "{base_path}/{version}/devicegroups/{pathv1}/alerts/{pathv2}?{query}",
      "requestSchema": "schema.json",
      "responseSchema": "schema.json",
      "timeout": 0,
      "sendEmpty": false,
      "sendGetBody": false,
      "requestDatatype": "JSON",
      "responseDatatype": "JSON",
      "headers": {},
      "responseObjects": [
        {
          "type": "default",
          "key": "",
          "mockFile": ""
        }
      ]
    },
    {
      "name": "assignAlert0",
      "protocol": "REST",
      "method": "POST",
      "entitypath": "{base_path}/{version}/devicegroups/{pathv1}/alerts/{pathv2}?{query}",
      "requestSchema": "schema.json",
      "responseSchema": "schema.json",
      "timeout": 0,
      "sendEmpty": false,
      "sendGetBody": false,
      "requestDatatype": "JSON",
      "responseDatatype": "JSON",
      "headers": {},
      "responseObjects": [
        {
          "type": "default",
          "key": "",
          "mockFile": ""
        }
      ]
    },
    {
      "name": "getAllDeviceGroupDashboards",
      "protocol": "REST",
      "method": "GET",
      "entitypath": "{base_path}/{version}/devicegroups/{pathv1}/dashboards?{query}",
      "requestSchema": "schema.json",
      "responseSchema": "schema.json",
      "timeout": 0,
      "sendEmpty": false,
      "sendGetBody": false,
      "requestDatatype": "JSON",
      "responseDatatype": "JSON",
      "headers": {},
      "responseObjects": [
        {
          "type": "default",
          "key": "",
          "mockFile": "mockdatafiles/getAllDeviceGroupDashboards-default.json"
        }
      ]
    },
    {
      "name": "getAllAssignedDevice1",
      "protocol": "REST",
      "method": "GET",
      "entitypath": "{base_path}/{version}/devicegroups/{pathv1}/devices?{query}",
      "requestSchema": "schema.json",
      "responseSchema": "schema.json",
      "timeout": 0,
      "sendEmpty": false,
      "sendGetBody": false,
      "requestDatatype": "JSON",
      "responseDatatype": "JSON",
      "headers": {},
      "responseObjects": [
        {
          "type": "default",
          "key": "",
          "mockFile": "mockdatafiles/getAllAssignedDevice1-default.json"
        }
      ]
    },
    {
      "name": "manageDeviceAssignments1",
      "protocol": "REST",
      "method": "POST",
      "entitypath": "{base_path}/{version}/devicegroups/{pathv1}/devices?{query}",
      "requestSchema": "schema.json",
      "responseSchema": "schema.json",
      "timeout": 0,
      "sendEmpty": false,
      "sendGetBody": false,
      "requestDatatype": "JSON",
      "responseDatatype": "JSON",
      "headers": {},
      "responseObjects": [
        {
          "type": "default",
          "key": "",
          "mockFile": ""
        }
      ]
    },
    {
      "name": "unassignDevice1",
      "protocol": "REST",
      "method": "DELETE",
      "entitypath": "{base_path}/{version}/devicegroups/{pathv1}/devices/{pathv2}?{query}",
      "requestSchema": "schema.json",
      "responseSchema": "schema.json",
      "timeout": 0,
      "sendEmpty": false,
      "sendGetBody": false,
      "requestDatatype": "JSON",
      "responseDatatype": "JSON",
      "headers": {},
      "responseObjects": [
        {
          "type": "default",
          "key": "",
          "mockFile": ""
        }
      ]
    },
    {
      "name": "assignDevice1",
      "protocol": "REST",
      "method": "POST",
      "entitypath": "{base_path}/{version}/devicegroups/{pathv1}/devices/{pathv2}?{query}",
      "requestSchema": "schema.json",
      "responseSchema": "schema.json",
      "timeout": 0,
      "sendEmpty": false,
      "sendGetBody": false,
      "requestDatatype": "JSON",
      "responseDatatype": "JSON",
      "headers": {},
      "responseObjects": [
        {
          "type": "default",
          "key": "",
          "mockFile": ""
        }
      ]
    },
    {
      "name": "getAllAssignedTrigger",
      "protocol": "REST",
      "method": "GET",
      "entitypath": "{base_path}/{version}/devicegroups/{pathv1}/triggers?{query}",
      "requestSchema": "schema.json",
      "responseSchema": "schema.json",
      "timeout": 0,
      "sendEmpty": false,
      "sendGetBody": false,
      "requestDatatype": "JSON",
      "responseDatatype": "JSON",
      "headers": {},
      "responseObjects": [
        {
          "type": "default",
          "key": "",
          "mockFile": "mockdatafiles/getAllAssignedTrigger-default.json"
        }
      ]
    },
    {
      "name": "manageTriggerAssignments",
      "protocol": "REST",
      "method": "POST",
      "entitypath": "{base_path}/{version}/devicegroups/{pathv1}/triggers?{query}",
      "requestSchema": "schema.json",
      "responseSchema": "schema.json",
      "timeout": 0,
      "sendEmpty": false,
      "sendGetBody": false,
      "requestDatatype": "JSON",
      "responseDatatype": "JSON",
      "headers": {},
      "responseObjects": [
        {
          "type": "default",
          "key": "",
          "mockFile": ""
        }
      ]
    },
    {
      "name": "unassignTrigger",
      "protocol": "REST",
      "method": "DELETE",
      "entitypath": "{base_path}/{version}/devicegroups/{pathv1}/triggers/{pathv2}?{query}",
      "requestSchema": "schema.json",
      "responseSchema": "schema.json",
      "timeout": 0,
      "sendEmpty": false,
      "sendGetBody": false,
      "requestDatatype": "JSON",
      "responseDatatype": "JSON",
      "headers": {},
      "responseObjects": [
        {
          "type": "default",
          "key": "",
          "mockFile": ""
        }
      ]
    },
    {
      "name": "assignTrigger",
      "protocol": "REST",
      "method": "POST",
      "entitypath": "{base_path}/{version}/devicegroups/{pathv1}/triggers/{pathv2}?{query}",
      "requestSchema": "schema.json",
      "responseSchema": "schema.json",
      "timeout": 0,
      "sendEmpty": false,
      "sendGetBody": false,
      "requestDatatype": "JSON",
      "responseDatatype": "JSON",
      "headers": {},
      "responseObjects": [
        {
          "type": "default",
          "key": "",
          "mockFile": ""
        }
      ]
    }
  ]
}