{
  "actions": [
    {
      "name": "getAllAuthIDP",
      "protocol": "REST",
      "method": "GET",
      "entitypath": "{base_path}/{version}/auth/identityproviders?{query}",
      "requestSchema": "schema.json",
      "responseSchema": "schema.json",
      "timeout": 0,
      "sendEmpty": false,
      "sendGetBody": false,
      "requestDatatype": "JSON",
      "responseDatatype": "JSON",
      "headers": {},
      "responseObjects": [
        {
          "type": "default",
          "key": "",
          "mockFile": "mockdatafiles/getAllAuthIDP-default.json"
        }
      ]
    },
    {
      "name": "createAuthIDP",
      "protocol": "REST",
      "method": "POST",
      "entitypath": "{base_path}/{version}/auth/identityproviders?{query}",
      "requestSchema": "schema.json",
      "responseSchema": "schema.json",
      "timeout": 0,
      "sendEmpty": false,
      "sendGetBody": false,
      "requestDatatype": "JSON",
      "responseDatatype": "JSON",
      "headers": {},
      "responseObjects": [
        {
          "type": "default",
          "key": "",
          "mockFile": ""
        }
      ]
    },
    {
      "name": "deleteAuthIDP",
      "protocol": "REST",
      "method": "DELETE",
      "entitypath": "{base_path}/{version}/auth/identityproviders/{pathv1}?{query}",
      "requestSchema": "schema.json",
      "responseSchema": "schema.json",
      "timeout": 0,
      "sendEmpty": false,
      "sendGetBody": false,
      "requestDatatype": "JSON",
      "responseDatatype": "JSON",
      "headers": {},
      "responseObjects": [
        {
          "type": "default",
          "key": "",
          "mockFile": ""
        }
      ]
    },
    {
      "name": "getAuthIDP",
      "protocol": "REST",
      "method": "GET",
      "entitypath": "{base_path}/{version}/auth/identityproviders/{pathv1}?{query}",
      "requestSchema": "schema.json",
      "responseSchema": "schema.json",
      "timeout": 0,
      "sendEmpty": false,
      "sendGetBody": false,
      "requestDatatype": "JSON",
      "responseDatatype": "JSON",
      "headers": {},
      "responseObjects": [
        {
          "type": "default",
          "key": "",
          "mockFile": "mockdatafiles/getAuthIDP-default.json"
        }
      ]
    },
    {
      "name": "updateAuthIDP",
      "protocol": "REST",
      "method": "PATCH",
      "entitypath": "{base_path}/{version}/auth/identityproviders/{pathv1}?{query}",
      "requestSchema": "schema.json",
      "responseSchema": "schema.json",
      "timeout": 0,
      "sendEmpty": false,
      "sendGetBody": false,
      "requestDatatype": "JSON",
      "responseDatatype": "JSON",
      "headers": {},
      "responseObjects": [
        {
          "type": "default",
          "key": "",
          "mockFile": ""
        }
      ]
    },
    {
      "name": "getAuthSAMLSPMetadata",
      "protocol": "REST",
      "method": "GET",
      "entitypath": "{base_path}/{version}/auth/samlsp?{query}",
      "requestSchema": "schema.json",
      "responseSchema": "schema.json",
      "timeout": 0,
      "sendEmpty": false,
      "sendGetBody": false,
      "requestDatatype": "JSON",
      "responseDatatype": "JSON",
      "headers": {},
      "responseObjects": [
        {
          "type": "default",
          "key": "",
          "mockFile": "mockdatafiles/getAuthSAMLSPMetadata-default.json"
        }
      ]
    }
  ]
}