[
  {
    "id": 6,
    "last_updated": 5,
    "name": "string",
    "observables": 3,
    "user_key": "string"
  },
  {
    "id": 7,
    "last_updated": 9,
    "name": "string",
    "observables": 2,
    "user_key": "string"
  },
  {
    "id": 3,
    "last_updated": 10,
    "name": "string",
    "observables": 7,
    "user_key": "string"
  },
  {
    "id": 6,
    "last_updated": 10,
    "name": "string",
    "observables": 9,
    "user_key": "string"
  }
]