[
  {
    "author": "string",
    "comment": "string",
    "id": 10,
    "mod_time": 7,
    "name": "string",
    "owner": "string",
    "rights": "view",
    "short_code": "string",
    "type": "summary_dashboard"
  },
  {
    "author": "string",
    "comment": "string",
    "id": 5,
    "mod_time": 7,
    "name": "string",
    "owner": "string",
    "rights": "share",
    "short_code": "string",
    "type": "summary_dashboard"
  }
]