{
  "$id": "schema.json",
  "type": "object",
  "schema": "http://json-schema.org/draft-07/schema#",
  "translate": true,
  "dynamicfields": true,
  "properties": {
    "ph_request_type": {
      "type": "string",
      "description": "type of request (internal to adapter)",
      "default": "getCustomdevices",
      "enum": [
        "getCustomdevices",
        "postCustomdevices",
        "deleteCustomdevicesId",
        "getCustomdevicesId",
        "patchCustomdevicesId",
        "getAllAssignedCriteria",
        "createCriteria",
        "deleteCriteria",
        "getCriteria"
      ],
      "external_name": "ph_request_type"
    },
    "includeCriteria": {
      "type": "boolean",
      "description": "Indicates whether the custom device criteria should be included.",
      "parse": false,
      "encode": false,
      "encrypt": {
        "type": "AES",
        "key": ""
      },
      "external_name": "include_criteria"
    },
    "childId": {
      "type": "number",
      "description": "The unique identifier for the custom device criterion.",
      "parse": false,
      "encode": false,
      "encrypt": {
        "type": "AES",
        "key": ""
      },
      "external_name": "child-id"
    }
  },
  "definitions": {}
}