[
  {
    "created_time": 3,
    "filename": "string",
    "size": "string"
  },
  {
    "created_time": 2,
    "filename": "string",
    "size": "string"
  },
  {
    "created_time": 3,
    "filename": "string",
    "size": "string"
  }
]