{
  "is_favorite": false,
  "name": "<NEW_DASHBOARD_LIST_TITLE>",
  "dashboard_count": 0,
  "author": {
    "handle": "test@datadoghq.com",
    "name": "John Doe"
  },
  "created": "2019-04-19T12:29:38.231231+00:00",
  "type": "manual_dashboard_list",
  "dashboards": null,
  "modified": "2019-04-19T12:32:16.412326+00:00",
  "id": 57440
}