{
  "clientIp": {},
  "method": "string",
  "path": "string",
  "query": "string",
  "requestAcceptHeader": "string",
  "requestReceivedTime": 2,
  "responseSentTime": 1,
  "responseStatus": 8,
  "responseTime": 2,
  "userAgent": "string",
  "username": "string"
}