{
  "apCount": 10,
  "clearedAlarms": 8,
  "clientCount": 9,
  "criticalAlarms": 4,
  "description": "string",
  "deviceCount": 5,
  "groupId": 2,
  "groupName": "string",
  "informationAlarms": 4,
  "isExplicit": true,
  "latitude": 4,
  "locationAddress": "string",
  "locationGroupType": "string",
  "longitude": 10,
  "majorAlarms": 4,
  "membersCount": 3,
  "minorAlarms": 9,
  "name": "string",
  "siteType": "string",
  "unacknowledgedClearedAlarms": 8,
  "unacknowledgedCriticalAlarms": 2,
  "unacknowledgedInformationAlarms": 2,
  "unacknowledgedMajorAlarms": 5,
  "unacknowledgedMinorAlarms": 4,
  "unacknowledgedWarningAlarms": 5,
  "warningAlarms": 1
}