{
  "adDomainName": "string",
  "anchorIpAddress": {},
  "apMacAddress": {},
  "authenticationAlgorithm": "string",
  "authorizationPolicy": "string",
  "bytesReceived": 7,
  "bytesSent": 7,
  "clientInterface": "string",
  "connectionType": "string",
  "ctsSecurityGroup": "string",
  "deviceMgmtAddress": {},
  "deviceName": "string",
  "eapType": "string",
  "encryptionCypher": "string",
  "ipAddress": {},
  "ipType": "string",
  "location": "string",
  "macAddress": {},
  "packetsReceived": 8,
  "packetsSent": 7,
  "policyTypeStatus": "string",
  "portSpeed": "string",
  "postureStatus": "string",
  "profileName": "string",
  "protocol": "string",
  "roamReason": "string",
  "rssi": 6,
  "securityPolicy": "string",
  "sessionEndTime": 7,
  "sessionStartTime": 2,
  "snr": 8,
  "ssid": "string",
  "throughput": 10,
  "userName": "string",
  "vlan": 4,
  "webSecurity": "string",
  "wgbMacAddress": {},
  "wgbStatus": "string"
}