{
  "comments": "string",
  "createdAt": 5,
  "createdBy": "string",
  "deviceIpAddress": "string",
  "deviceName": "string",
  "diffType": "string",
  "fileInfos": [
    {},
    {}
  ],
  "isFirst": false,
  "isLast": true,
  "outOfBand": false,
  "tags": [
    {},
    {},
    {},
    {}
  ]
}