{
  "currentDateTime": "string",
  "description": "string",
  "metricName": "string",
  "metricRows": [
    {}
  ],
  "resourceName": "string",
  "xValueProperty": {},
  "yValueProperty": [
    {},
    {},
    {},
    {},
    {}
  ]
}