{
  "collectionTime": 5,
  "dot11aReceived": 3,
  "dot11aSent": 8,
  "dot11aThroughput": 1,
  "dot11acReceived": 1,
  "dot11acSent": 2,
  "dot11acThroughput": 8,
  "dot11bReceived": 5,
  "dot11bSent": 3,
  "dot11bThroughput": 4,
  "dot11gReceived": 9,
  "dot11gSent": 3,
  "dot11gThroughput": 4,
  "dot11n24Received": 6,
  "dot11n24Sent": 2,
  "dot11n24Throughput": 6,
  "dot11n5Received": 7,
  "dot11n5Sent": 8,
  "dot11n5Throughput": 1,
  "key": "string",
  "received": 10,
  "sent": 1,
  "subkey": "string",
  "throughput": 5,
  "type": "string",
  "wired100MReceived": 6,
  "wired100MSent": 1,
  "wired100MThroughput": 7,
  "wired10GReceived": 5,
  "wired10GSent": 8,
  "wired10GThroughput": 4,
  "wired10MReceived": 6,
  "wired10MSent": 10,
  "wired10MThroughput": 10,
  "wired1GReceived": 4,
  "wired1GSent": 3,
  "wired1GThroughput": 5
}