{
  "clearedAlarms": 10,
  "criticalAlarms": 8,
  "description": "string",
  "groupId": 6,
  "groupName": "string",
  "groupType": "string",
  "informationAlarms": 3,
  "isExplicit": true,
  "majorAlarms": 2,
  "membersCount": 10,
  "minorAlarms": 6,
  "name": "string",
  "unacknowledgedClearedAlarms": 2,
  "unacknowledgedCriticalAlarms": 8,
  "unacknowledgedInformationAlarms": 4,
  "unacknowledgedMajorAlarms": 6,
  "unacknowledgedMinorAlarms": 5,
  "unacknowledgedWarningAlarms": 5,
  "warningAlarms": 2
}