{
  "adminStatus": "string",
  "clientCount": 8,
  "clientCount24GHz": 3,
  "clientCount5GHz": 5,
  "controllerIpAddress": "string",
  "controllerName": "string",
  "ethernetMac": "string",
  "ipAddress": "string",
  "location": "string",
  "macAddress": "string",
  "model": "string",
  "name": "string",
  "operationalStatus": "string",
  "serialNumber": "string",
  "softwareVersion": "string",
  "status": "string"
}