{
  "actions": [
    {
      "name": "getDomainNameDatacenters",
      "protocol": "REST",
      "method": "GET",
      "entitypath": "{base_path}/{version}/domains/{pathv1}/datacenters?{query}",
      "requestSchema": "schema.json",
      "responseSchema": "schema.json",
      "timeout": 0,
      "sendEmpty": false,
      "sendGetBody": false,
      "requestDatatype": "JSON",
      "responseDatatype": "JSON",
      "headers": {},
      "responseObjects": [
        {
          "type": "default",
          "key": "",
          "mockFile": "mockdatafiles/getDomainNameDatacenters-default.json"
        }
      ]
    },
    {
      "name": "postDomainNameDatacenters",
      "protocol": "REST",
      "method": "POST",
      "entitypath": "{base_path}/{version}/domains/{pathv1}/datacenters?{query}",
      "requestSchema": "schema.json",
      "responseSchema": "schema.json",
      "timeout": 0,
      "sendEmpty": false,
      "requestDatatype": "JSON",
      "responseDatatype": "JSON",
      "headers": {},
      "responseObjects": [
        {
          "type": "default",
          "key": "",
          "mockFile": "mockdatafiles/postDomainNameDatacenters-default.json"
        }
      ]
    },
    {
      "name": "getDomainNameDatacentersDatacenterId",
      "protocol": "REST",
      "method": "GET",
      "entitypath": "{base_path}/{version}/domains/{pathv1}/datacenters/{pathv2}?{query}",
      "requestSchema": "schema.json",
      "responseSchema": "schema.json",
      "timeout": 0,
      "sendEmpty": false,
      "sendGetBody": false,
      "requestDatatype": "JSON",
      "responseDatatype": "JSON",
      "headers": {},
      "responseObjects": [
        {
          "type": "default",
          "key": "",
          "mockFile": "mockdatafiles/getDomainNameDatacentersDatacenterId-default.json"
        }
      ]
    },
    {
      "name": "putDomainNameDatacentersDatacenterId",
      "protocol": "REST",
      "method": "PUT",
      "entitypath": "{base_path}/{version}/domains/{pathv1}/datacenters/{pathv2}?{query}",
      "requestSchema": "schema.json",
      "responseSchema": "schema.json",
      "timeout": 0,
      "sendEmpty": false,
      "requestDatatype": "JSON",
      "responseDatatype": "JSON",
      "headers": {},
      "responseObjects": [
        {
          "type": "default",
          "key": "",
          "mockFile": "mockdatafiles/putDomainNameDatacentersDatacenterId-default.json"
        }
      ]
    },
    {
      "name": "deleteDomainNameDatacentersDatacenterId",
      "protocol": "REST",
      "method": "DELETE",
      "entitypath": "{base_path}/{version}/domains/{pathv1}/datacenters/{pathv2}?{query}",
      "requestSchema": "schema.json",
      "responseSchema": "schema.json",
      "timeout": 0,
      "sendEmpty": false,
      "requestDatatype": "JSON",
      "responseDatatype": "JSON",
      "headers": {},
      "responseObjects": [
        {
          "type": "default",
          "key": "",
          "mockFile": "mockdatafiles/deleteDomainNameDatacentersDatacenterId-default.json"
        }
      ]
    },
    {
      "name": "postDomainNameDatacentersDefaultDatacenterForMaps",
      "protocol": "REST",
      "method": "POST",
      "entitypath": "{base_path}/{version}/domains/{pathv1}/datacenters/default-datacenter-for-maps?{query}",
      "requestSchema": "schema.json",
      "responseSchema": "schema.json",
      "timeout": 0,
      "sendEmpty": false,
      "requestDatatype": "JSON",
      "responseDatatype": "JSON",
      "headers": {},
      "responseObjects": [
        {
          "type": "default",
          "key": "",
          "mockFile": "mockdatafiles/postDomainNameDatacentersDefaultDatacenterForMaps-default.json"
        }
      ]
    },
    {
      "name": "postDomainNameDatacentersDatacenterForIpVersionSelectorIpv4",
      "protocol": "REST",
      "method": "POST",
      "entitypath": "{base_path}/{version}/domains/{pathv1}/datacenters/datacenter-for-ip-version-selector-ipv4?{query}",
      "requestSchema": "schema.json",
      "responseSchema": "schema.json",
      "timeout": 0,
      "sendEmpty": false,
      "requestDatatype": "JSON",
      "responseDatatype": "JSON",
      "headers": {},
      "responseObjects": [
        {
          "type": "default",
          "key": "",
          "mockFile": "mockdatafiles/postDomainNameDatacentersDatacenterForIpVersionSelectorIpv4-default.json"
        }
      ]
    },
    {
      "name": "postDomainNameDatacentersDatacenterForIpVersionSelectorIpv6",
      "protocol": "REST",
      "method": "POST",
      "entitypath": "{base_path}/{version}/domains/{pathv1}/datacenters/datacenter-for-ip-version-selector-ipv6?{query}",
      "requestSchema": "schema.json",
      "responseSchema": "schema.json",
      "timeout": 0,
      "sendEmpty": false,
      "requestDatatype": "JSON",
      "responseDatatype": "JSON",
      "headers": {},
      "responseObjects": [
        {
          "type": "default",
          "key": "",
          "mockFile": "mockdatafiles/postDomainNameDatacentersDatacenterForIpVersionSelectorIpv6-default.json"
        }
      ]
    }
  ]
}