{
  "accountId": "1-1TJZFB",
  "userName": "ed@example.com",
  "userTimeZone": "-05:00",
  "locale": "en_US",
  "firstName": "Eddard",
  "lastName": "Stark",
  "email": "ed@example.com",
  "active": true,
  "contracts": [
    {
      "contractId": "1-1TJZH5",
      "features": [
        "FAILOVER",
        "QTR",
        "ASMAPPING",
        "CIDRMAPPING",
        "GEOGRAPHIC",
        "WEIGHTED_ROUND_ROBIN",
        "WEIGHTED_ROUND_ROBIN_LOAD_FEEDBACK",
        "WEIGHTED_HASHED",
        "PERFORMANCE"
      ],
      "permissions": [
        "READ",
        "WRITE",
        "ADD"
      ]
    },
    {
      "contractId": "3-ZQ0H6H",
      "features": [
        "FAILOVER",
        "QTR",
        "ASMAPPING",
        "CIDRMAPPING",
        "GEOGRAPHIC"
      ],
      "permissions": [
        "READ",
        "WRITE"
      ]
    }
  ]
}