{
  "actions": [
    {
      "name": "getDomainNameAsMaps",
      "protocol": "REST",
      "method": "GET",
      "entitypath": "{base_path}/{version}/domains/{pathv1}/as-maps?{query}",
      "requestSchema": "schema.json",
      "responseSchema": "schema.json",
      "timeout": 0,
      "sendEmpty": false,
      "sendGetBody": false,
      "requestDatatype": "JSON",
      "responseDatatype": "JSON",
      "headers": {},
      "responseObjects": [
        {
          "type": "default",
          "key": "",
          "mockFile": ""
        }
      ]
    },
    {
      "name": "getDomainNameAsMapsMapName",
      "protocol": "REST",
      "method": "GET",
      "entitypath": "{base_path}/{version}/domains/{pathv1}/as-maps/{pathv2}?{query}",
      "requestSchema": "schema.json",
      "responseSchema": "schema.json",
      "timeout": 0,
      "sendEmpty": false,
      "sendGetBody": false,
      "requestDatatype": "JSON",
      "responseDatatype": "JSON",
      "headers": {},
      "responseObjects": [
        {
          "type": "default",
          "key": "",
          "mockFile": "mockdatafiles/getDomainNameAsMapsMapName-default.json"
        }
      ]
    },
    {
      "name": "putDomainNameAsMapsMapName",
      "protocol": "REST",
      "method": "PUT",
      "entitypath": "{base_path}/{version}/domains/{pathv1}/as-maps/{pathv2}?{query}",
      "requestSchema": "schema.json",
      "responseSchema": "schema.json",
      "timeout": 0,
      "sendEmpty": false,
      "requestDatatype": "JSON",
      "responseDatatype": "JSON",
      "headers": {},
      "responseObjects": [
        {
          "type": "default",
          "key": "",
          "mockFile": "mockdatafiles/putDomainNameAsMapsMapName-default.json"
        }
      ]
    },
    {
      "name": "deleteDomainNameAsMapsMapName",
      "protocol": "REST",
      "method": "DELETE",
      "entitypath": "{base_path}/{version}/domains/{pathv1}/as-maps/{pathv2}?{query}",
      "requestSchema": "schema.json",
      "responseSchema": "schema.json",
      "timeout": 0,
      "sendEmpty": false,
      "requestDatatype": "JSON",
      "responseDatatype": "JSON",
      "headers": {},
      "responseObjects": [
        {
          "type": "default",
          "key": "",
          "mockFile": "mockdatafiles/deleteDomainNameAsMapsMapName-default.json"
        }
      ]
    }
  ]
}