{
  "actions": [
    {
      "name": "getDomainNameResources",
      "protocol": "REST",
      "method": "GET",
      "entitypath": "{base_path}/{version}/domains/{pathv1}/resources?{query}",
      "requestSchema": "schema.json",
      "responseSchema": "schema.json",
      "timeout": 0,
      "sendEmpty": false,
      "sendGetBody": false,
      "requestDatatype": "JSON",
      "responseDatatype": "JSON",
      "headers": {},
      "responseObjects": [
        {
          "type": "default",
          "key": "",
          "mockFile": "mockdatafiles/getDomainNameResources-default.json"
        }
      ]
    },
    {
      "name": "getDomainNameResourcesResourceName",
      "protocol": "REST",
      "method": "GET",
      "entitypath": "{base_path}/{version}/domains/{pathv1}/resources/{pathv2}?{query}",
      "requestSchema": "schema.json",
      "responseSchema": "schema.json",
      "timeout": 0,
      "sendEmpty": false,
      "sendGetBody": false,
      "requestDatatype": "JSON",
      "responseDatatype": "JSON",
      "headers": {},
      "responseObjects": [
        {
          "type": "default",
          "key": "",
          "mockFile": "mockdatafiles/getDomainNameResourcesResourceName-default.json"
        }
      ]
    },
    {
      "name": "putDomainNameResourcesResourceName",
      "protocol": "REST",
      "method": "PUT",
      "entitypath": "{base_path}/{version}/domains/{pathv1}/resources/{pathv2}?{query}",
      "requestSchema": "schema.json",
      "responseSchema": "schema.json",
      "timeout": 0,
      "sendEmpty": false,
      "requestDatatype": "JSON",
      "responseDatatype": "JSON",
      "headers": {},
      "responseObjects": [
        {
          "type": "default",
          "key": "",
          "mockFile": "mockdatafiles/putDomainNameResourcesResourceName-default.json"
        }
      ]
    },
    {
      "name": "deleteDomainNameResourcesResourceName",
      "protocol": "REST",
      "method": "DELETE",
      "entitypath": "{base_path}/{version}/domains/{pathv1}/resources/{pathv2}?{query}",
      "requestSchema": "schema.json",
      "responseSchema": "schema.json",
      "timeout": 0,
      "sendEmpty": false,
      "requestDatatype": "JSON",
      "responseDatatype": "JSON",
      "headers": {},
      "responseObjects": [
        {
          "type": "default",
          "key": "",
          "mockFile": "mockdatafiles/deleteDomainNameResourcesResourceName-default.json"
        }
      ]
    }
  ]
}