{
  "name": "adapter-accedian_skylight",
  "webName": "Adapter for Integration to Accedian Skylight",
  "supportLevel": "community",
  "vendor": "Accedian",
  "product": "Skylight",
  "techAlliance": false,
  "osVersion": [],
  "apiVersions": [
    "2021.03.0",
    "2021.12.0"
  ],
  "iapVersions": [
    "2021.1.x",
    "2021.2.x",
    "2022.1.x",
    "2023.1.x"
  ],
  "method": "REST",
  "type": "Adapter",
  "domains": [
    "Service Assurance"
  ],
  "tags": [
    "Monitoring & Troubleshooting"
  ],
  "useCases": [
    "Add Device to Monitoring",
    "Automated network data gathering for diagnostics",
    "Verify network connectivity"
  ],
  "deprecated": {
    "isDeprecated": false
  },
  "brokerSince": "",
  "authMethods": [
    {
      "type": "Token",
      "primary": true
    }
  ],
  "documentation": {
    "storeLink": "",
    "npmLink": "https://www.npmjs.com/package/@itentialopensource/adapter-accedian_skylight",
    "repoLink": "https://gitlab.com/itentialopensource/adapters/adapter-accedian_skylight",
    "docLink": "https://gitlab.com/itentialopensource/adapters/adapter-accedian_skylight/-/blob/master/README.md?ref_type=heads",
    "demoLinks": [],
    "trainingLinks": [
      {
        "title": "Itential Academy",
        "link": "https://www.itential.com/itential-academy/"
      }
    ],
    "faqLink": "https://docs.itential.com/opensource/docs/troubleshooting-an-adapter",
    "contributeLink": "https://gitlab.com/itentialopensource/adapters/contributing-guide",
    "issueLink": "https://itential.atlassian.net/servicedesk/customer/portals",
    "webLink": "https://www.itential.com/adapters/accedian-skylight/",
    "vendorLink": "https://www.cisco.com/",
    "productLink": "https://www.cisco.com/site/us/en/products/networking/software/provider-connectivity-assurance/index.html",
    "apiLinks": [
      {
        "title": "Skylight Analytics API documentation",
        "link": "https://api.analytics.accedian.io/session.html",
        "public": true
      },
      {
        "title": "Skylight Analytics API documentation",
        "link": "https://api.analytics.accedian.io/session.html",
        "public": true
      }
    ],
    "workshopLinks": [],
    "workshopHomePage": "https://www.itential.com/get-started/"
  },
  "assets": [],
  "relatedItems": {
    "adapters": [],
    "integrations": [],
    "ecosystemApplications": [],
    "workflowProjects": [],
    "transformationProjects": [],
    "exampleProjects": []
  }
}