{
  "$id": "schema.json",
  "type": "object",
  "schema": "http://json-schema.org/draft-07/schema#",
  "translate": true,
  "dynamicfields": true,
  "properties": {
    "ph_request_type": {
      "type": "string",
      "description": "type of request (internal to adapter)",
      "default": "listalldowntimesofametaservice",
      "enum": [
        "listalldowntimesofametaservice",
        "addadowntimeonametaservice",
        "listalldowntimes",
        "displayonedowntime",
        "canceladowntime",
        "listallhostsdowntimes",
        "addandowntimeonmultiplehosts",
        "listallservicesdowntimes",
        "addandowntimeonmultipleservices",
        "listalldowntimesofahost",
        "addadowntimeonahost",
        "listalldowntimesofaservice",
        "addadowntimeonaservice",
        "setdowntimeformultipleresources"
      ],
      "external_name": "ph_request_type"
    },
    "sortBy": {
      "type": "object",
      "description": "Sort the resulted data by its properties",
      "parse": false,
      "encode": false,
      "encrypt": {
        "type": "AES",
        "key": ""
      },
      "external_name": "sort_by"
    },
    "metaId": {
      "type": "number",
      "description": "ID of the meta service",
      "parse": false,
      "encode": false,
      "encrypt": {
        "type": "AES",
        "key": ""
      },
      "external_name": "meta_id"
    },
    "downtimeId": {
      "type": "number",
      "description": "ID of the downtime",
      "parse": false,
      "encode": false,
      "encrypt": {
        "type": "AES",
        "key": ""
      },
      "external_name": "downtime_id"
    },
    "hostId": {
      "type": "number",
      "description": "ID of the host",
      "parse": false,
      "encode": false,
      "encrypt": {
        "type": "AES",
        "key": ""
      },
      "external_name": "host_id"
    },
    "showService": {
      "type": "boolean",
      "description": "Allows to display services belonging to items",
      "parse": false,
      "encode": false,
      "encrypt": {
        "type": "AES",
        "key": ""
      },
      "external_name": "show_service"
    },
    "serviceId": {
      "type": "number",
      "description": "ID of the service",
      "parse": false,
      "encode": false,
      "encrypt": {
        "type": "AES",
        "key": ""
      },
      "external_name": "service_id"
    }
  },
  "definitions": {}
}