{
  "actions": [
    {
      "name": "listallmonitoringserversconfigurations",
      "protocol": "REST",
      "method": "GET",
      "entitypath": "{base_path}/{version}/configuration/monitoring-servers?{query}",
      "requestSchema": "schema.json",
      "responseSchema": "schema.json",
      "timeout": 0,
      "sendEmpty": false,
      "sendGetBody": false,
      "requestDatatype": "JSON",
      "responseDatatype": "JSON",
      "headers": {},
      "responseObjects": [
        {
          "type": "default",
          "key": "",
          "mockFile": ""
        }
      ]
    },
    {
      "name": "generatetheconfigurationofthemonitoringserver",
      "protocol": "REST",
      "method": "GET",
      "entitypath": "{base_path}/{version}/configuration/monitoring-servers/{pathv1}/generate?{query}",
      "requestSchema": "schema.json",
      "responseSchema": "schema.json",
      "timeout": 0,
      "sendEmpty": false,
      "sendGetBody": false,
      "requestDatatype": "JSON",
      "responseDatatype": "JSON",
      "headers": {},
      "responseObjects": [
        {
          "type": "default",
          "key": "",
          "mockFile": ""
        }
      ]
    },
    {
      "name": "reloadtheconfigurationofthemonitoringserver",
      "protocol": "REST",
      "method": "GET",
      "entitypath": "{base_path}/{version}/configuration/monitoring-servers/{pathv1}/reload?{query}",
      "requestSchema": "schema.json",
      "responseSchema": "schema.json",
      "timeout": 0,
      "sendEmpty": false,
      "sendGetBody": false,
      "requestDatatype": "JSON",
      "responseDatatype": "JSON",
      "headers": {},
      "responseObjects": [
        {
          "type": "default",
          "key": "",
          "mockFile": ""
        }
      ]
    },
    {
      "name": "generateandreloadtheconfigurationofthemonitoringserver",
      "protocol": "REST",
      "method": "GET",
      "entitypath": "{base_path}/{version}/configuration/monitoring-servers/{pathv1}/generate-and-reload?{query}",
      "requestSchema": "schema.json",
      "responseSchema": "schema.json",
      "timeout": 0,
      "sendEmpty": false,
      "sendGetBody": false,
      "requestDatatype": "JSON",
      "responseDatatype": "JSON",
      "headers": {},
      "responseObjects": [
        {
          "type": "default",
          "key": "",
          "mockFile": ""
        }
      ]
    },
    {
      "name": "generatetheconfigurationforallmonitoringservers",
      "protocol": "REST",
      "method": "GET",
      "entitypath": "{base_path}/{version}/configuration/monitoring-servers/generate?{query}",
      "requestSchema": "schema.json",
      "responseSchema": "schema.json",
      "timeout": 0,
      "sendEmpty": false,
      "sendGetBody": false,
      "requestDatatype": "JSON",
      "responseDatatype": "JSON",
      "headers": {},
      "responseObjects": [
        {
          "type": "default",
          "key": "",
          "mockFile": ""
        }
      ]
    },
    {
      "name": "reloadtheconfigurationforallmonitoringservers",
      "protocol": "REST",
      "method": "GET",
      "entitypath": "{base_path}/{version}/configuration/monitoring-servers/reload?{query}",
      "requestSchema": "schema.json",
      "responseSchema": "schema.json",
      "timeout": 0,
      "sendEmpty": false,
      "sendGetBody": false,
      "requestDatatype": "JSON",
      "responseDatatype": "JSON",
      "headers": {},
      "responseObjects": [
        {
          "type": "default",
          "key": "",
          "mockFile": ""
        }
      ]
    },
    {
      "name": "generateandreloadtheconfigurationforallmonitoringservers",
      "protocol": "REST",
      "method": "GET",
      "entitypath": "{base_path}/{version}/configuration/monitoring-servers/generate-and-reload?{query}",
      "requestSchema": "schema.json",
      "responseSchema": "schema.json",
      "timeout": 0,
      "sendEmpty": false,
      "sendGetBody": false,
      "requestDatatype": "JSON",
      "responseDatatype": "JSON",
      "headers": {},
      "responseObjects": [
        {
          "type": "default",
          "key": "",
          "mockFile": ""
        }
      ]
    },
    {
      "name": "listallrealtimemonitoringservers",
      "protocol": "REST",
      "method": "GET",
      "entitypath": "{base_path}/{version}/monitoring/servers?{query}",
      "requestSchema": "schema.json",
      "responseSchema": "schema.json",
      "timeout": 0,
      "sendEmpty": false,
      "sendGetBody": false,
      "requestDatatype": "JSON",
      "responseDatatype": "JSON",
      "headers": {},
      "responseObjects": [
        {
          "type": "default",
          "key": "",
          "mockFile": ""
        }
      ]
    }
  ]
}