{
  "$id": "schema.json",
  "type": "object",
  "schema": "http://json-schema.org/draft-07/schema#",
  "translate": true,
  "dynamicfields": true,
  "properties": {
    "ph_request_type": {
      "type": "string",
      "description": "type of request (internal to adapter)",
      "default": "adduserfilter",
      "enum": [
        "adduserfilter",
        "updateuserfilter",
        "patchuserfilter",
        "deleteuserfilter"
      ],
      "external_name": "ph_request_type"
    },
    "pageName": {
      "type": "string",
      "description": "name of the page",
      "parse": false,
      "encode": false,
      "encrypt": {
        "type": "AES",
        "key": ""
      },
      "external_name": "page_name"
    },
    "filterId": {
      "type": "number",
      "description": "id of the filter",
      "parse": false,
      "encode": false,
      "encrypt": {
        "type": "AES",
        "key": ""
      },
      "external_name": "filter_id"
    }
  },
  "definitions": {}
}