{
  "actions": [
    {
      "name": "listallacknowledgements",
      "protocol": "REST",
      "method": "GET",
      "entitypath": "{base_path}/{version}/monitoring/acknowledgements?{query}",
      "requestSchema": "schema.json",
      "responseSchema": "schema.json",
      "timeout": 0,
      "sendEmpty": false,
      "sendGetBody": false,
      "requestDatatype": "JSON",
      "responseDatatype": "JSON",
      "headers": {},
      "responseObjects": [
        {
          "type": "default",
          "key": "",
          "mockFile": ""
        }
      ]
    },
    {
      "name": "massivelydisacknowledgeresources",
      "protocol": "REST",
      "method": "DELETE",
      "entitypath": "{base_path}/{version}/monitoring/resources/acknowledgements?{query}",
      "requestSchema": "schema.json",
      "responseSchema": "schema.json",
      "timeout": 0,
      "sendEmpty": false,
      "requestDatatype": "JSON",
      "responseDatatype": "JSON",
      "headers": {},
      "responseObjects": [
        {
          "type": "default",
          "key": "",
          "mockFile": ""
        }
      ]
    },
    {
      "name": "displayoneacknowledgement",
      "protocol": "REST",
      "method": "GET",
      "entitypath": "{base_path}/{version}/monitoring/acknowledgements/{pathv1}?{query}",
      "requestSchema": "schema.json",
      "responseSchema": "schema.json",
      "timeout": 0,
      "sendEmpty": false,
      "sendGetBody": false,
      "requestDatatype": "JSON",
      "responseDatatype": "JSON",
      "headers": {},
      "responseObjects": [
        {
          "type": "default",
          "key": "",
          "mockFile": ""
        }
      ]
    },
    {
      "name": "listallhostsacknowledgements",
      "protocol": "REST",
      "method": "GET",
      "entitypath": "{base_path}/{version}/monitoring/hosts/acknowledgements?{query}",
      "requestSchema": "schema.json",
      "responseSchema": "schema.json",
      "timeout": 0,
      "sendEmpty": false,
      "sendGetBody": false,
      "requestDatatype": "JSON",
      "responseDatatype": "JSON",
      "headers": {},
      "responseObjects": [
        {
          "type": "default",
          "key": "",
          "mockFile": ""
        }
      ]
    },
    {
      "name": "addanacknowledgementonmultiplehosts",
      "protocol": "REST",
      "method": "POST",
      "entitypath": "{base_path}/{version}/monitoring/hosts/acknowledgements?{query}",
      "requestSchema": "schema.json",
      "responseSchema": "schema.json",
      "timeout": 0,
      "sendEmpty": false,
      "requestDatatype": "JSON",
      "responseDatatype": "JSON",
      "headers": {},
      "responseObjects": [
        {
          "type": "default",
          "key": "",
          "mockFile": ""
        }
      ]
    },
    {
      "name": "listallservicesacknowledgements",
      "protocol": "REST",
      "method": "GET",
      "entitypath": "{base_path}/{version}/monitoring/services/acknowledgements?{query}",
      "requestSchema": "schema.json",
      "responseSchema": "schema.json",
      "timeout": 0,
      "sendEmpty": false,
      "sendGetBody": false,
      "requestDatatype": "JSON",
      "responseDatatype": "JSON",
      "headers": {},
      "responseObjects": [
        {
          "type": "default",
          "key": "",
          "mockFile": ""
        }
      ]
    },
    {
      "name": "addanacknowledgementonmultipleservices",
      "protocol": "REST",
      "method": "POST",
      "entitypath": "{base_path}/{version}/monitoring/services/acknowledgements?{query}",
      "requestSchema": "schema.json",
      "responseSchema": "schema.json",
      "timeout": 0,
      "sendEmpty": false,
      "requestDatatype": "JSON",
      "responseDatatype": "JSON",
      "headers": {},
      "responseObjects": [
        {
          "type": "default",
          "key": "",
          "mockFile": ""
        }
      ]
    },
    {
      "name": "listallacknowledgementsofahost",
      "protocol": "REST",
      "method": "GET",
      "entitypath": "{base_path}/{version}/monitoring/hosts/{pathv1}/acknowledgements?{query}",
      "requestSchema": "schema.json",
      "responseSchema": "schema.json",
      "timeout": 0,
      "sendEmpty": false,
      "sendGetBody": false,
      "requestDatatype": "JSON",
      "responseDatatype": "JSON",
      "headers": {},
      "responseObjects": [
        {
          "type": "default",
          "key": "",
          "mockFile": ""
        }
      ]
    },
    {
      "name": "addanacknowledgementonchosenhost",
      "protocol": "REST",
      "method": "POST",
      "entitypath": "{base_path}/{version}/monitoring/hosts/{pathv1}/acknowledgements?{query}",
      "requestSchema": "schema.json",
      "responseSchema": "schema.json",
      "timeout": 0,
      "sendEmpty": false,
      "requestDatatype": "JSON",
      "responseDatatype": "JSON",
      "headers": {},
      "responseObjects": [
        {
          "type": "default",
          "key": "",
          "mockFile": ""
        }
      ]
    },
    {
      "name": "cancelanacknowledgementonahost",
      "protocol": "REST",
      "method": "DELETE",
      "entitypath": "{base_path}/{version}/monitoring/hosts/{pathv1}/acknowledgements?{query}",
      "requestSchema": "schema.json",
      "responseSchema": "schema.json",
      "timeout": 0,
      "sendEmpty": false,
      "requestDatatype": "JSON",
      "responseDatatype": "JSON",
      "headers": {},
      "responseObjects": [
        {
          "type": "default",
          "key": "",
          "mockFile": ""
        }
      ]
    },
    {
      "name": "listallacknowledgementsofaservice",
      "protocol": "REST",
      "method": "GET",
      "entitypath": "{base_path}/{version}/monitoring/hosts/{pathv1}/services/{pathv2}/acknowledgements?{query}",
      "requestSchema": "schema.json",
      "responseSchema": "schema.json",
      "timeout": 0,
      "sendEmpty": false,
      "sendGetBody": false,
      "requestDatatype": "JSON",
      "responseDatatype": "JSON",
      "headers": {},
      "responseObjects": [
        {
          "type": "default",
          "key": "",
          "mockFile": ""
        }
      ]
    },
    {
      "name": "addanacknowledgementonchosenservice",
      "protocol": "REST",
      "method": "POST",
      "entitypath": "{base_path}/{version}/monitoring/hosts/{pathv1}/services/{pathv2}/acknowledgements?{query}",
      "requestSchema": "schema.json",
      "responseSchema": "schema.json",
      "timeout": 0,
      "sendEmpty": false,
      "requestDatatype": "JSON",
      "responseDatatype": "JSON",
      "headers": {},
      "responseObjects": [
        {
          "type": "default",
          "key": "",
          "mockFile": ""
        }
      ]
    },
    {
      "name": "cancelanacknowledgementonaservice",
      "protocol": "REST",
      "method": "DELETE",
      "entitypath": "{base_path}/{version}/monitoring/hosts/{pathv1}/services/{pathv2}/acknowledgements?{query}",
      "requestSchema": "schema.json",
      "responseSchema": "schema.json",
      "timeout": 0,
      "sendEmpty": false,
      "requestDatatype": "JSON",
      "responseDatatype": "JSON",
      "headers": {},
      "responseObjects": [
        {
          "type": "default",
          "key": "",
          "mockFile": ""
        }
      ]
    },
    {
      "name": "listallacknowledgementsofametaservice",
      "protocol": "REST",
      "method": "GET",
      "entitypath": "{base_path}/{version}/monitoring/metaservices/{pathv1}/acknowledgements?{query}",
      "requestSchema": "schema.json",
      "responseSchema": "schema.json",
      "timeout": 0,
      "sendEmpty": false,
      "sendGetBody": false,
      "requestDatatype": "JSON",
      "responseDatatype": "JSON",
      "headers": {},
      "responseObjects": [
        {
          "type": "default",
          "key": "",
          "mockFile": ""
        }
      ]
    },
    {
      "name": "addanacknowledgementonchosenmetaservice",
      "protocol": "REST",
      "method": "POST",
      "entitypath": "{base_path}/{version}/monitoring/metaservices/{pathv1}/acknowledgements?{query}",
      "requestSchema": "schema.json",
      "responseSchema": "schema.json",
      "timeout": 0,
      "sendEmpty": false,
      "requestDatatype": "JSON",
      "responseDatatype": "JSON",
      "headers": {},
      "responseObjects": [
        {
          "type": "default",
          "key": "",
          "mockFile": ""
        }
      ]
    },
    {
      "name": "cancelanacknowledgementonametaservice",
      "protocol": "REST",
      "method": "DELETE",
      "entitypath": "{base_path}/{version}/monitoring/metaservices/{pathv1}/acknowledgements?{query}",
      "requestSchema": "schema.json",
      "responseSchema": "schema.json",
      "timeout": 0,
      "sendEmpty": false,
      "requestDatatype": "JSON",
      "responseDatatype": "JSON",
      "headers": {},
      "responseObjects": [
        {
          "type": "default",
          "key": "",
          "mockFile": ""
        }
      ]
    },
    {
      "name": "acknowledgemultipleresources",
      "protocol": "REST",
      "method": "POST",
      "entitypath": "{base_path}/{version}/monitoring/resources/acknowledge?{query}",
      "requestSchema": "schema.json",
      "responseSchema": "schema.json",
      "timeout": 0,
      "sendEmpty": false,
      "requestDatatype": "JSON",
      "responseDatatype": "JSON",
      "headers": {},
      "responseObjects": [
        {
          "type": "default",
          "key": "",
          "mockFile": ""
        }
      ]
    }
  ]
}