[
  {
    "id": 6,
    "name": "string",
    "networkApplications": [
      "string"
    ],
    "description": "string"
  },
  {
    "id": 6,
    "name": "string",
    "networkApplications": [
      "string",
      "string",
      "string",
      "string"
    ],
    "description": "string"
  }
]