{
  "name": "string",
  "id": 10,
  "country": "FRENCH_SOUTHERN_TERRITORIES",
  "managedBy": {
    "id": 1,
    "name": "string",
    "extensions": {}
  },
  "vpnCredentials": [
    {
      "id": 10,
      "type": "XAUTH",
      "fqdn": "string",
      "preSharedKey": "string",
      "comments": "string",
      "location": [
        {
          "id": 2,
          "name": "string",
          "extensions": {}
        },
        {
          "id": 9,
          "name": "string",
          "extensions": {}
        },
        {
          "id": 7,
          "name": "string",
          "extensions": {}
        },
        {
          "id": 2,
          "name": "string",
          "extensions": {}
        },
        {
          "id": 4,
          "name": "string",
          "extensions": {}
        },
        {
          "id": 3,
          "name": "string",
          "extensions": {}
        }
      ],
      "managedBy": [
        {
          "id": 6,
          "name": "string",
          "extensions": {}
        },
        {
          "id": 7,
          "name": "string",
          "extensions": {}
        },
        {
          "id": 6,
          "name": "string",
          "extensions": {}
        },
        {
          "id": 6,
          "name": "string",
          "extensions": {}
        },
        {
          "id": 9,
          "name": "string",
          "extensions": {}
        }
      ]
    },
    {
      "id": 9,
      "type": "UFQDN",
      "fqdn": "string",
      "preSharedKey": "string",
      "comments": "string",
      "location": [
        {
          "id": 8,
          "name": "string",
          "extensions": {}
        }
      ],
      "managedBy": [
        {
          "id": 2,
          "name": "string",
          "extensions": {}
        },
        {
          "id": 8,
          "name": "string",
          "extensions": {}
        },
        {
          "id": 6,
          "name": "string",
          "extensions": {}
        },
        {
          "id": 3,
          "name": "string",
          "extensions": {}
        },
        {
          "id": 4,
          "name": "string",
          "extensions": {}
        },
        {
          "id": 9,
          "name": "string",
          "extensions": {}
        },
        {
          "id": 4,
          "name": "string",
          "extensions": {}
        }
      ]
    },
    {
      "id": 6,
      "type": "UFQDN",
      "fqdn": "string",
      "preSharedKey": "string",
      "comments": "string",
      "location": [
        {
          "id": 10,
          "name": "string",
          "extensions": {}
        },
        {
          "id": 10,
          "name": "string",
          "extensions": {}
        },
        {
          "id": 6,
          "name": "string",
          "extensions": {}
        },
        {
          "id": 3,
          "name": "string",
          "extensions": {}
        },
        {
          "id": 4,
          "name": "string",
          "extensions": {}
        },
        {
          "id": 8,
          "name": "string",
          "extensions": {}
        },
        {
          "id": 7,
          "name": "string",
          "extensions": {}
        },
        {
          "id": 10,
          "name": "string",
          "extensions": {}
        },
        {
          "id": 6,
          "name": "string",
          "extensions": {}
        }
      ],
      "managedBy": [
        {
          "id": 9,
          "name": "string",
          "extensions": {}
        }
      ]
    },
    {
      "id": 2,
      "type": "XAUTH",
      "fqdn": "string",
      "preSharedKey": "string",
      "comments": "string",
      "location": [
        {
          "id": 3,
          "name": "string",
          "extensions": {}
        },
        {
          "id": 10,
          "name": "string",
          "extensions": {}
        },
        {
          "id": 2,
          "name": "string",
          "extensions": {}
        },
        {
          "id": 4,
          "name": "string",
          "extensions": {}
        },
        {
          "id": 8,
          "name": "string",
          "extensions": {}
        }
      ],
      "managedBy": [
        {
          "id": 4,
          "name": "string",
          "extensions": {}
        },
        {
          "id": 2,
          "name": "string",
          "extensions": {}
        },
        {
          "id": 7,
          "name": "string",
          "extensions": {}
        },
        {
          "id": 10,
          "name": "string",
          "extensions": {}
        },
        {
          "id": 8,
          "name": "string",
          "extensions": {}
        },
        {
          "id": 9,
          "name": "string",
          "extensions": {}
        },
        {
          "id": 3,
          "name": "string",
          "extensions": {}
        },
        {
          "id": 8,
          "name": "string",
          "extensions": {}
        },
        {
          "id": 9,
          "name": "string",
          "extensions": {}
        }
      ]
    },
    {
      "id": 9,
      "type": "UFQDN",
      "fqdn": "string",
      "preSharedKey": "string",
      "comments": "string",
      "location": [
        {
          "id": 6,
          "name": "string",
          "extensions": {}
        },
        {
          "id": 7,
          "name": "string",
          "extensions": {}
        },
        {
          "id": 10,
          "name": "string",
          "extensions": {}
        }
      ],
      "managedBy": [
        {
          "id": 3,
          "name": "string",
          "extensions": {}
        },
        {
          "id": 4,
          "name": "string",
          "extensions": {}
        },
        {
          "id": 1,
          "name": "string",
          "extensions": {}
        },
        {
          "id": 3,
          "name": "string",
          "extensions": {}
        },
        {
          "id": 2,
          "name": "string",
          "extensions": {}
        },
        {
          "id": 3,
          "name": "string",
          "extensions": {}
        },
        {
          "id": 7,
          "name": "string",
          "extensions": {}
        },
        {
          "id": 6,
          "name": "string",
          "extensions": {}
        },
        {
          "id": 7,
          "name": "string",
          "extensions": {}
        },
        {
          "id": 9,
          "name": "string",
          "extensions": {}
        }
      ]
    },
    {
      "id": 5,
      "type": "UFQDN",
      "fqdn": "string",
      "preSharedKey": "string",
      "comments": "string",
      "location": [
        {
          "id": 5,
          "name": "string",
          "extensions": {}
        },
        {
          "id": 6,
          "name": "string",
          "extensions": {}
        },
        {
          "id": 3,
          "name": "string",
          "extensions": {}
        },
        {
          "id": 1,
          "name": "string",
          "extensions": {}
        },
        {
          "id": 3,
          "name": "string",
          "extensions": {}
        },
        {
          "id": 2,
          "name": "string",
          "extensions": {}
        },
        {
          "id": 2,
          "name": "string",
          "extensions": {}
        },
        {
          "id": 7,
          "name": "string",
          "extensions": {}
        },
        {
          "id": 10,
          "name": "string",
          "extensions": {}
        },
        {
          "id": 1,
          "name": "string",
          "extensions": {}
        }
      ],
      "managedBy": [
        {
          "id": 8,
          "name": "string",
          "extensions": {}
        },
        {
          "id": 1,
          "name": "string",
          "extensions": {}
        },
        {
          "id": 3,
          "name": "string",
          "extensions": {}
        },
        {
          "id": 5,
          "name": "string",
          "extensions": {}
        },
        {
          "id": 1,
          "name": "string",
          "extensions": {}
        },
        {
          "id": 4,
          "name": "string",
          "extensions": {}
        }
      ]
    },
    {
      "id": 7,
      "type": "IP",
      "fqdn": "string",
      "preSharedKey": "string",
      "comments": "string",
      "location": [
        {
          "id": 10,
          "name": "string",
          "extensions": {}
        },
        {
          "id": 4,
          "name": "string",
          "extensions": {}
        }
      ],
      "managedBy": [
        {
          "id": 9,
          "name": "string",
          "extensions": {}
        },
        {
          "id": 3,
          "name": "string",
          "extensions": {}
        },
        {
          "id": 5,
          "name": "string",
          "extensions": {}
        },
        {
          "id": 10,
          "name": "string",
          "extensions": {}
        },
        {
          "id": 10,
          "name": "string",
          "extensions": {}
        },
        {
          "id": 4,
          "name": "string",
          "extensions": {}
        },
        {
          "id": 10,
          "name": "string",
          "extensions": {}
        },
        {
          "id": 10,
          "name": "string",
          "extensions": {}
        },
        {
          "id": 9,
          "name": "string",
          "extensions": {}
        },
        {
          "id": 5,
          "name": "string",
          "extensions": {}
        }
      ]
    },
    {
      "id": 7,
      "type": "CN",
      "fqdn": "string",
      "preSharedKey": "string",
      "comments": "string",
      "location": [
        {
          "id": 3,
          "name": "string",
          "extensions": {}
        }
      ],
      "managedBy": [
        {
          "id": 6,
          "name": "string",
          "extensions": {}
        },
        {
          "id": 8,
          "name": "string",
          "extensions": {}
        },
        {
          "id": 9,
          "name": "string",
          "extensions": {}
        },
        {
          "id": 8,
          "name": "string",
          "extensions": {}
        },
        {
          "id": 9,
          "name": "string",
          "extensions": {}
        },
        {
          "id": 2,
          "name": "string",
          "extensions": {}
        },
        {
          "id": 1,
          "name": "string",
          "extensions": {}
        },
        {
          "id": 1,
          "name": "string",
          "extensions": {}
        },
        {
          "id": 10,
          "name": "string",
          "extensions": {}
        }
      ]
    },
    {
      "id": 5,
      "type": "CN",
      "fqdn": "string",
      "preSharedKey": "string",
      "comments": "string",
      "location": [
        {
          "id": 8,
          "name": "string",
          "extensions": {}
        },
        {
          "id": 1,
          "name": "string",
          "extensions": {}
        },
        {
          "id": 7,
          "name": "string",
          "extensions": {}
        },
        {
          "id": 7,
          "name": "string",
          "extensions": {}
        },
        {
          "id": 2,
          "name": "string",
          "extensions": {}
        }
      ],
      "managedBy": [
        {
          "id": 2,
          "name": "string",
          "extensions": {}
        }
      ]
    },
    {
      "id": 3,
      "type": "IP",
      "fqdn": "string",
      "preSharedKey": "string",
      "comments": "string",
      "location": [
        {
          "id": 6,
          "name": "string",
          "extensions": {}
        },
        {
          "id": 1,
          "name": "string",
          "extensions": {}
        },
        {
          "id": 3,
          "name": "string",
          "extensions": {}
        },
        {
          "id": 7,
          "name": "string",
          "extensions": {}
        },
        {
          "id": 9,
          "name": "string",
          "extensions": {}
        },
        {
          "id": 3,
          "name": "string",
          "extensions": {}
        },
        {
          "id": 6,
          "name": "string",
          "extensions": {}
        }
      ],
      "managedBy": [
        {
          "id": 1,
          "name": "string",
          "extensions": {}
        },
        {
          "id": 4,
          "name": "string",
          "extensions": {}
        },
        {
          "id": 1,
          "name": "string",
          "extensions": {}
        },
        {
          "id": 9,
          "name": "string",
          "extensions": {}
        },
        {
          "id": 1,
          "name": "string",
          "extensions": {}
        },
        {
          "id": 7,
          "name": "string",
          "extensions": {}
        },
        {
          "id": 6,
          "name": "string",
          "extensions": {}
        },
        {
          "id": 7,
          "name": "string",
          "extensions": {}
        }
      ]
    }
  ],
  "xffForwardEnabled": false,
  "tz": "string",
  "authRequired": false,
  "upBandwidth": 2,
  "sslScanEnabled": false,
  "dnBandwidth": 7,
  "ofwEnabled": false
}