[
  {
    "id": 6,
    "name": "string",
    "ipAddresses": [
      "string",
      "string",
      "string",
      "string",
      "string"
    ],
    "description": "string",
    "isNonEditable": true
  }
]