[
  {
    "id": 2,
    "name": "string",
    "deviceGroupType": null,
    "deviceModel": "string",
    "osType": null,
    "osVersion": "string",
    "description": "string",
    "ownerUserId": 5,
    "ownerName": "string",
    "hostName": "string"
  },
  {
    "id": 2,
    "name": "string",
    "deviceGroupType": null,
    "deviceModel": "string",
    "osType": null,
    "osVersion": "string",
    "description": "string",
    "ownerUserId": 8,
    "ownerName": "string",
    "hostName": "string"
  }
]