[
  {
    "id": "string",
    "name": "string",
    "url": "string",
    "defaultProfile": false
  },
  {
    "id": "string",
    "name": "string",
    "url": "string",
    "defaultProfile": false
  },
  {
    "id": "string",
    "name": "string",
    "url": "string",
    "defaultProfile": false
  }
]