[
  {
    "id": 1,
    "name": "string",
    "deleted": false,
    "groupType": null,
    "dynamicLocationGroupCriteria": {
      "name": {
        "matchString": "string",
        "matchType": null
      },
      "countries": [
        "string",
        "string",
        "string",
        "string",
        "string",
        "string",
        "string",
        "string",
        "string",
        "string"
      ],
      "city": {
        "matchString": "string",
        "matchType": null
      },
      "managedBy": [
        {
          "id": 10,
          "name": "string",
          "externalId": "string",
          "extensions": {}
        },
        {
          "id": 5,
          "name": "string",
          "externalId": "string",
          "extensions": {}
        },
        {
          "id": 8,
          "name": "string",
          "externalId": "string",
          "extensions": {}
        },
        {
          "id": 6,
          "name": "string",
          "externalId": "string",
          "extensions": {}
        },
        {
          "id": 1,
          "name": "string",
          "externalId": "string",
          "extensions": {}
        },
        {
          "id": 1,
          "name": "string",
          "externalId": "string",
          "extensions": {}
        },
        {
          "id": 1,
          "name": "string",
          "externalId": "string",
          "extensions": {}
        },
        {
          "id": 1,
          "name": "string",
          "externalId": "string",
          "extensions": {}
        },
        {
          "id": 6,
          "name": "string",
          "externalId": "string",
          "extensions": {}
        }
      ],
      "enforceAuthentication": false,
      "enforceAup": false,
      "enforceFirewallControl": true,
      "enableXffForwarding": true,
      "enableCaution": false,
      "enableBandwidthControl": true,
      "profiles": [
        "GUESTWIFI",
        "NONE",
        "SERVER",
        "SERVER",
        "CORPORATE"
      ]
    },
    "locations": [
      {
        "id": 3,
        "name": "string",
        "externalId": "string",
        "extensions": {}
      },
      {
        "id": 6,
        "name": "string",
        "externalId": "string",
        "extensions": {}
      },
      {
        "id": 5,
        "name": "string",
        "externalId": "string",
        "extensions": {}
      },
      {
        "id": 1,
        "name": "string",
        "externalId": "string",
        "extensions": {}
      },
      {
        "id": 9,
        "name": "string",
        "externalId": "string",
        "extensions": {}
      }
    ],
    "comments": "string",
    "lastModUser": {
      "id": 4,
      "name": "string",
      "externalId": "string",
      "extensions": {}
    },
    "lastModTime": 10,
    "predefined": false
  },
  {
    "id": 9,
    "name": "string",
    "deleted": false,
    "groupType": null,
    "dynamicLocationGroupCriteria": {
      "name": {
        "matchString": "string",
        "matchType": null
      },
      "countries": [
        "string",
        "string",
        "string"
      ],
      "city": {
        "matchString": "string",
        "matchType": null
      },
      "managedBy": [
        {
          "id": 3,
          "name": "string",
          "externalId": "string",
          "extensions": {}
        },
        {
          "id": 5,
          "name": "string",
          "externalId": "string",
          "extensions": {}
        },
        {
          "id": 8,
          "name": "string",
          "externalId": "string",
          "extensions": {}
        },
        {
          "id": 7,
          "name": "string",
          "externalId": "string",
          "extensions": {}
        },
        {
          "id": 2,
          "name": "string",
          "externalId": "string",
          "extensions": {}
        },
        {
          "id": 5,
          "name": "string",
          "externalId": "string",
          "extensions": {}
        },
        {
          "id": 10,
          "name": "string",
          "externalId": "string",
          "extensions": {}
        },
        {
          "id": 8,
          "name": "string",
          "externalId": "string",
          "extensions": {}
        }
      ],
      "enforceAuthentication": true,
      "enforceAup": false,
      "enforceFirewallControl": false,
      "enableXffForwarding": true,
      "enableCaution": true,
      "enableBandwidthControl": true,
      "profiles": [
        "GUESTWIFI",
        "NONE",
        "NONE"
      ]
    },
    "locations": [
      {
        "id": 7,
        "name": "string",
        "externalId": "string",
        "extensions": {}
      },
      {
        "id": 7,
        "name": "string",
        "externalId": "string",
        "extensions": {}
      },
      {
        "id": 2,
        "name": "string",
        "externalId": "string",
        "extensions": {}
      },
      {
        "id": 10,
        "name": "string",
        "externalId": "string",
        "extensions": {}
      },
      {
        "id": 3,
        "name": "string",
        "externalId": "string",
        "extensions": {}
      },
      {
        "id": 6,
        "name": "string",
        "externalId": "string",
        "extensions": {}
      }
    ],
    "comments": "string",
    "lastModUser": {
      "id": 7,
      "name": "string",
      "externalId": "string",
      "extensions": {}
    },
    "lastModTime": 7,
    "predefined": true
  },
  {
    "id": 9,
    "name": "string",
    "deleted": false,
    "groupType": null,
    "dynamicLocationGroupCriteria": {
      "name": {
        "matchString": "string",
        "matchType": null
      },
      "countries": [
        "string",
        "string",
        "string",
        "string",
        "string"
      ],
      "city": {
        "matchString": "string",
        "matchType": null
      },
      "managedBy": [
        {
          "id": 10,
          "name": "string",
          "externalId": "string",
          "extensions": {}
        },
        {
          "id": 8,
          "name": "string",
          "externalId": "string",
          "extensions": {}
        },
        {
          "id": 10,
          "name": "string",
          "externalId": "string",
          "extensions": {}
        },
        {
          "id": 1,
          "name": "string",
          "externalId": "string",
          "extensions": {}
        },
        {
          "id": 1,
          "name": "string",
          "externalId": "string",
          "extensions": {}
        }
      ],
      "enforceAuthentication": true,
      "enforceAup": false,
      "enforceFirewallControl": true,
      "enableXffForwarding": false,
      "enableCaution": false,
      "enableBandwidthControl": true,
      "profiles": [
        "IOT",
        "CORPORATE",
        "NONE",
        "NONE",
        "GUESTWIFI"
      ]
    },
    "locations": [
      {
        "id": 2,
        "name": "string",
        "externalId": "string",
        "extensions": {}
      },
      {
        "id": 2,
        "name": "string",
        "externalId": "string",
        "extensions": {}
      },
      {
        "id": 5,
        "name": "string",
        "externalId": "string",
        "extensions": {}
      },
      {
        "id": 7,
        "name": "string",
        "externalId": "string",
        "extensions": {}
      }
    ],
    "comments": "string",
    "lastModUser": {
      "id": 3,
      "name": "string",
      "externalId": "string",
      "extensions": {}
    },
    "lastModTime": 3,
    "predefined": false
  }
]