{
  "id": "string",
  "object": "string",
  "version": 1,
  "account": "WGC-1-123abc456",
  "created": 1579907960,
  "device": 12345,
  "author": "string",
  "action": "drop",
  "description": "Allow Sales Presentation.",
  "md5": "d2ffd57b48ee2ac34a4797ea44571a05"
}