{
  "id": "wbe_12124_7HM70EvrifZ7rSfXSA",
  "object": "webblocker_exception",
  "device": 12345,
  "version": 2,
  "account": "WGC-1-123abc456",
  "created": 1579907960,
  "author": "testuser",
  "name": "Allow www.example.com",
  "rule_type": "string",
  "rule": "www.example.com/*",
  "action": "allow"
}