{
  "$id": "schema.json",
  "type": "object",
  "schema": "http://json-schema.org/draft-07/schema#",
  "translate": false,
  "dynamicfields": true,
  "properties": {
    "ph_request_type": {
      "type": "string",
      "description": "type of request (internal to adapter)",
      "default": "set",
      "enum": [
        "set",
        "setPolicy",
        "get",
        "readEffective",
        "readPolicy",
        "getItems",
        "getPolicyItems",
        "getItemsForClass",
        "getItemGuids",
        "find",
        "defineItem",
        "undefineItem",
        "findItem",
        "loadItem",
        "loadItemGuid",
        "updateItem",
        "getAllItems"
      ],
      "external_name": "ph_request_type"
    }
  },
  "definitions": {}
}