{
  "$id": "schema.json",
  "type": "object",
  "schema": "http://json-schema.org/draft-07/schema#",
  "translate": true,
  "dynamicfields": true,
  "properties": {
    "ph_request_type": {
      "type": "string",
      "description": "type of request (internal to adapter)",
      "default": "getKeysetDetail",
      "enum": [
        "getKeysetDetail",
        "getKeysetDetails",
        "testDeviceConnection",
        "importKeyUsageData",
        "getKeyUsages",
        "remove",
        "cancelKeyOperation",
        "retryKeyOperation",
        "startRotation",
        "cancelRotation",
        "retryRotation",
        "editKeyOptions",
        "editSelfServiceAuthorizedKey",
        "addSelfServicePrivateKey",
        "addSelfServiceAuthorizedKey",
        "confirmSelfServiceKeyInstallation",
        "moveKeysetsToPolicy",
        "exportSelfServiceAuthorizedKey",
        "exportSelfServicePrivateKey",
        "skipKeyRotation",
        "addUserPrivateKey",
        "addHostPrivateKey",
        "addAuthorizedKey",
        "addKnownHostKey",
        "importAuthorizedKey",
        "importPrivateKey",
        "changePrivateKeyPassphrase",
        "setUnmatchedKeysetPasshrase",
        "deleteUnmatchedKeyset",
        "getKeyDetails",
        "getDevices",
        "approveKeyOperation",
        "rejectKeyOperation",
        "stats",
        "policyViolations",
        "criticalAlerts"
      ],
      "external_name": "ph_request_type"
    },
    "keysetId": {
      "type": "string",
      "description": "",
      "parse": false,
      "encode": false,
      "encrypt": {
        "type": "AES",
        "key": ""
      },
      "external_name": "KeysetId"
    },
    "loadKeyData": {
      "type": "boolean",
      "description": "",
      "parse": false,
      "encode": false,
      "encrypt": {
        "type": "AES",
        "key": ""
      },
      "external_name": "LoadKeyData"
    },
    "generatedKeysetFilterPageSizeOffsetLoadKeyData": {
      "type": "object",
      "description": "",
      "parse": false,
      "encode": false,
      "encrypt": {
        "type": "AES",
        "key": ""
      },
      "external_name": "GeneratedKeysetFilterPageSizeOffsetLoadKeyData"
    },
    "generateddeviceGuids": {
      "type": "object",
      "description": "",
      "parse": false,
      "encode": false,
      "encrypt": {
        "type": "AES",
        "key": ""
      },
      "external_name": "GenerateddeviceGuids"
    },
    "generatedSshKeyUsageFilterPageSizeOffset": {
      "type": "object",
      "description": "",
      "parse": false,
      "encode": false,
      "encrypt": {
        "type": "AES",
        "key": ""
      },
      "external_name": "GeneratedSshKeyUsageFilterPageSizeOffset"
    },
    "generatedKeyId": {
      "type": "object",
      "description": "",
      "parse": false,
      "encode": false,
      "encrypt": {
        "type": "AES",
        "key": ""
      },
      "external_name": "GeneratedKeyId"
    },
    "generatedSshDeviceFilterPageSizeOffset": {
      "type": "object",
      "description": "",
      "parse": false,
      "encode": false,
      "encrypt": {
        "type": "AES",
        "key": ""
      },
      "external_name": "GeneratedSshDeviceFilterPageSizeOffset"
    }
  },
  "definitions": {}
}