{
  "actions": [
    {
      "name": "deleteInterfaceConnection",
      "protocol": "REST",
      "method": "DELETE",
      "entitypath": "{base_path}/{version}/securechangeworkflow/api/secureapp/repository/applications/{pathv1}/application_interfaces/{pathv2}/interface_connections/{pathv3}?{query}",
      "requestSchema": "schema.json",
      "responseSchema": "schema.json",
      "timeout": 0,
      "sendEmpty": false,
      "sendGetBody": false,
      "requestDatatype": "JSON",
      "responseDatatype": "JSON",
      "headers": {},
      "responseObjects": [
        {
          "type": "default",
          "key": "",
          "mockFile": ""
        }
      ]
    },
    {
      "name": "updateAnInterfaceConnection",
      "protocol": "REST",
      "method": "PUT",
      "entitypath": "{base_path}/{version}/securechangeworkflow/api/secureapp/repository/applications/{pathv1}/application_interfaces/{pathv2}/interface_connections/{pathv3}?{query}",
      "requestSchema": "schema.json",
      "responseSchema": "schema.json",
      "timeout": 0,
      "sendEmpty": false,
      "sendGetBody": false,
      "requestDatatype": "JSON",
      "responseDatatype": "JSON",
      "headers": {},
      "responseObjects": [
        {
          "type": "default",
          "key": "",
          "mockFile": ""
        }
      ]
    },
    {
      "name": "retrieveAnExistingInterfaceConnectionByID",
      "protocol": "REST",
      "method": "GET",
      "entitypath": "{base_path}/{version}/securechangeworkflow/api/secureapp/repository/applications/{pathv1}/application_interfaces/{pathv2}/interface_connections/{pathv3}?{query}",
      "requestSchema": "schema.json",
      "responseSchema": "schema.json",
      "timeout": 0,
      "sendEmpty": false,
      "sendGetBody": false,
      "requestDatatype": "JSON",
      "responseDatatype": "JSON",
      "headers": {},
      "responseObjects": [
        {
          "type": "default",
          "key": "",
          "mockFile": ""
        }
      ]
    },
    {
      "name": "retrieveExistingConnectionsToApplication",
      "protocol": "REST",
      "method": "GET",
      "entitypath": "{base_path}/{version}/securechangeworkflow/api/secureapp/repository/applications/{pathv1}/connections_to_applications?{query}",
      "requestSchema": "schema.json",
      "responseSchema": "schema.json",
      "timeout": 0,
      "sendEmpty": false,
      "sendGetBody": false,
      "requestDatatype": "JSON",
      "responseDatatype": "JSON",
      "headers": {},
      "responseObjects": [
        {
          "type": "default",
          "key": "",
          "mockFile": ""
        }
      ]
    },
    {
      "name": "createConnectionToApplication",
      "protocol": "REST",
      "method": "POST",
      "entitypath": "{base_path}/{version}/securechangeworkflow/api/secureapp/repository/applications/{pathv1}/connections_to_applications?{query}",
      "requestSchema": "schema.json",
      "responseSchema": "schema.json",
      "timeout": 0,
      "sendEmpty": false,
      "sendGetBody": false,
      "requestDatatype": "JSON",
      "responseDatatype": "JSON",
      "headers": {},
      "responseObjects": [
        {
          "type": "default",
          "key": "",
          "mockFile": ""
        }
      ]
    },
    {
      "name": "updateAnApplicationInterface",
      "protocol": "REST",
      "method": "PUT",
      "entitypath": "{base_path}/{version}/securechangeworkflow/api/secureapp/repository/applications/{pathv1}/application_interfaces/{pathv2}?{query}",
      "requestSchema": "schema.json",
      "responseSchema": "schema.json",
      "timeout": 0,
      "sendEmpty": false,
      "sendGetBody": false,
      "requestDatatype": "JSON",
      "responseDatatype": "JSON",
      "headers": {},
      "responseObjects": [
        {
          "type": "default",
          "key": "",
          "mockFile": ""
        }
      ]
    },
    {
      "name": "deleteApplicationInterface",
      "protocol": "REST",
      "method": "DELETE",
      "entitypath": "{base_path}/{version}/securechangeworkflow/api/secureapp/repository/applications/{pathv1}/application_interfaces/{pathv2}?{query}",
      "requestSchema": "schema.json",
      "responseSchema": "schema.json",
      "timeout": 0,
      "sendEmpty": false,
      "sendGetBody": false,
      "requestDatatype": "JSON",
      "responseDatatype": "JSON",
      "headers": {},
      "responseObjects": [
        {
          "type": "default",
          "key": "",
          "mockFile": ""
        }
      ]
    },
    {
      "name": "retrieveAnExistingApplicationInterfaceByID",
      "protocol": "REST",
      "method": "GET",
      "entitypath": "{base_path}/{version}/securechangeworkflow/api/secureapp/repository/applications/{pathv1}/application_interfaces/{pathv2}?{query}",
      "requestSchema": "schema.json",
      "responseSchema": "schema.json",
      "timeout": 0,
      "sendEmpty": false,
      "sendGetBody": false,
      "requestDatatype": "JSON",
      "responseDatatype": "JSON",
      "headers": {},
      "responseObjects": [
        {
          "type": "default",
          "key": "",
          "mockFile": ""
        }
      ]
    },
    {
      "name": "retrieveExistingInterfaceConnections",
      "protocol": "REST",
      "method": "GET",
      "entitypath": "{base_path}/{version}/securechangeworkflow/api/secureapp/repository/applications/{pathv1}/application_interfaces/{pathv2}/interface_connections?{query}",
      "requestSchema": "schema.json",
      "responseSchema": "schema.json",
      "timeout": 0,
      "sendEmpty": false,
      "sendGetBody": false,
      "requestDatatype": "JSON",
      "responseDatatype": "JSON",
      "headers": {},
      "responseObjects": [
        {
          "type": "default",
          "key": "",
          "mockFile": ""
        }
      ]
    },
    {
      "name": "createInterfaceConnections",
      "protocol": "REST",
      "method": "POST",
      "entitypath": "{base_path}/{version}/securechangeworkflow/api/secureapp/repository/applications/{pathv1}/application_interfaces/{pathv2}/interface_connections?{query}",
      "requestSchema": "schema.json",
      "responseSchema": "schema.json",
      "timeout": 0,
      "sendEmpty": false,
      "sendGetBody": false,
      "requestDatatype": "JSON",
      "responseDatatype": "JSON",
      "headers": {},
      "responseObjects": [
        {
          "type": "default",
          "key": "",
          "mockFile": ""
        }
      ]
    },
    {
      "name": "retrieveExistingApplicationInterfaces",
      "protocol": "REST",
      "method": "GET",
      "entitypath": "{base_path}/{version}/securechangeworkflow/api/secureapp/repository/applications/{pathv1}/application_interfaces?{query}",
      "requestSchema": "schema.json",
      "responseSchema": "schema.json",
      "timeout": 0,
      "sendEmpty": false,
      "sendGetBody": false,
      "requestDatatype": "JSON",
      "responseDatatype": "JSON",
      "headers": {},
      "responseObjects": [
        {
          "type": "default",
          "key": "",
          "mockFile": ""
        }
      ]
    },
    {
      "name": "createApplicationInterface",
      "protocol": "REST",
      "method": "POST",
      "entitypath": "{base_path}/{version}/securechangeworkflow/api/secureapp/repository/applications/{pathv1}/application_interfaces?{query}",
      "requestSchema": "schema.json",
      "responseSchema": "schema.json",
      "timeout": 0,
      "sendEmpty": false,
      "sendGetBody": false,
      "requestDatatype": "JSON",
      "responseDatatype": "JSON",
      "headers": {},
      "responseObjects": [
        {
          "type": "default",
          "key": "",
          "mockFile": ""
        }
      ]
    },
    {
      "name": "retrieveAnExistingConnectionToApplicationByID",
      "protocol": "REST",
      "method": "GET",
      "entitypath": "{base_path}/{version}/securechangeworkflow/api/secureapp/repository/applications/{pathv1}/connections_to_applications/{pathv2}?{query}",
      "requestSchema": "schema.json",
      "responseSchema": "schema.json",
      "timeout": 0,
      "sendEmpty": false,
      "sendGetBody": false,
      "requestDatatype": "JSON",
      "responseDatatype": "JSON",
      "headers": {},
      "responseObjects": [
        {
          "type": "default",
          "key": "",
          "mockFile": ""
        }
      ]
    },
    {
      "name": "updateAConnectionToApplication",
      "protocol": "REST",
      "method": "PUT",
      "entitypath": "{base_path}/{version}/securechangeworkflow/api/secureapp/repository/applications/{pathv1}/connections_to_applications/{pathv2}?{query}",
      "requestSchema": "schema.json",
      "responseSchema": "schema.json",
      "timeout": 0,
      "sendEmpty": false,
      "sendGetBody": false,
      "requestDatatype": "JSON",
      "responseDatatype": "JSON",
      "headers": {},
      "responseObjects": [
        {
          "type": "default",
          "key": "",
          "mockFile": ""
        }
      ]
    },
    {
      "name": "deleteConnectionToApplication",
      "protocol": "REST",
      "method": "DELETE",
      "entitypath": "{base_path}/{version}/securechangeworkflow/api/secureapp/repository/applications/{pathv1}/connections_to_applications/{pathv2}?{query}",
      "requestSchema": "schema.json",
      "responseSchema": "schema.json",
      "timeout": 0,
      "sendEmpty": false,
      "sendGetBody": false,
      "requestDatatype": "JSON",
      "responseDatatype": "JSON",
      "headers": {},
      "responseObjects": [
        {
          "type": "default",
          "key": "",
          "mockFile": ""
        }
      ]
    }
  ]
}