{
  "$id": "schema.json",
  "type": "object",
  "schema": "http://json-schema.org/draft-07/schema#",
  "translate": true,
  "dynamicfields": true,
  "properties": {
    "ph_request_type": {
      "type": "string",
      "description": "type of request (internal to adapter)",
      "default": "createConnections",
      "enum": [
        "createConnections",
        "updateConnections",
        "retrieveExistingConnections",
        "retrieveExistingConnectionsWithExtendedResourcesInformation",
        "createATicketToRepairAConnection",
        "deleteConnection",
        "updateAConnection",
        "retrieveAnExistingConnectionByID"
      ],
      "external_name": "ph_request_type"
    },
    "applicationId": {
      "description": "path parameter",
      "parse": false,
      "encode": false,
      "encrypt": {
        "type": "AES",
        "key": ""
      },
      "external_name": "application_id"
    },
    "connectionId": {
      "description": "path parameter",
      "parse": false,
      "encode": false,
      "encrypt": {
        "type": "AES",
        "key": ""
      },
      "external_name": "connection_id"
    }
  },
  "definitions": {}
}