{
  "id": 3,
  "customerId": 5,
  "accountId": 7,
  "internalId": 5,
  "lines": [
    {
      "id": 3,
      "accountId": 7,
      "targetId": 4,
      "quantity": 3,
      "description": "string",
      "amount": 9,
      "lineType": "PURCHASE",
      "lineItemType": "INVENTORY",
      "itemIds": [
        1
      ],
      "inventory": {
        "inHandDate": "string",
        "id": 2,
        "accountId": 3,
        "eventId": 3,
        "quantity": 9,
        "notes": "string",
        "section": "string",
        "row": "string",
        "secondRow": "string",
        "lowSeat": 6,
        "highSeat": 4,
        "cost": 4,
        "faceValue": 6,
        "tickets": [
          {
            "id": 2,
            "seatNumber": 1,
            "fileName": "string",
            "barCode": "string",
            "inventoryId": 6,
            "invoiceLineId": 8,
            "purchaseLineId": 6,
            "section": "string",
            "row": "string",
            "notes": "string",
            "cost": 7,
            "faceValue": 3,
            "sellPrice": 3,
            "stockType": "ELECTRONIC",
            "eventId": 9,
            "accountId": 9,
            "status": "SOLD",
            "base64FileBytes": "string",
            "disclosures": [
              "string",
              "string",
              "string",
              "string"
            ],
            "attributes": [
              "string",
              "string",
              "string",
              "string",
              "string",
              "string",
              "string",
              "string"
            ],
            "createdDate": "string",
            "createdBy": "string",
            "lastUpdate": "string",
            "lastUpdateBy": "string",
            "dateCancelled": "string",
            "cancelledByUserId": 5,
            "auditNote": "string"
          },
          {
            "id": 1,
            "seatNumber": 1,
            "fileName": "string",
            "barCode": "string",
            "inventoryId": 6,
            "invoiceLineId": 4,
            "purchaseLineId": 6,
            "section": "string",
            "row": "string",
            "notes": "string",
            "cost": 9,
            "faceValue": 5,
            "sellPrice": 1,
            "stockType": "ELECTRONIC",
            "eventId": 6,
            "accountId": 8,
            "status": "SOLD",
            "base64FileBytes": "string",
            "disclosures": [
              "string",
              "string",
              "string",
              "string",
              "string"
            ],
            "attributes": [
              "string",
              "string"
            ],
            "createdDate": "string",
            "createdBy": "string",
            "lastUpdate": "string",
            "lastUpdateBy": "string",
            "dateCancelled": "string",
            "cancelledByUserId": 4,
            "auditNote": "string"
          },
          {
            "id": 2,
            "seatNumber": 2,
            "fileName": "string",
            "barCode": "string",
            "inventoryId": 10,
            "invoiceLineId": 3,
            "purchaseLineId": 3,
            "section": "string",
            "row": "string",
            "notes": "string",
            "cost": 4,
            "faceValue": 5,
            "sellPrice": 7,
            "stockType": "MOBILE_SCREENCAP",
            "eventId": 2,
            "accountId": 6,
            "status": "AVAILABLE",
            "base64FileBytes": "string",
            "disclosures": [
              "string",
              "string",
              "string",
              "string",
              "string"
            ],
            "attributes": [
              "string",
              "string",
              "string",
              "string",
              "string",
              "string",
              "string",
              "string",
              "string",
              "string"
            ],
            "createdDate": "string",
            "createdBy": "string",
            "lastUpdate": "string",
            "lastUpdateBy": "string",
            "dateCancelled": "string",
            "cancelledByUserId": 8,
            "auditNote": "string"
          },
          {
            "id": 1,
            "seatNumber": 7,
            "fileName": "string",
            "barCode": "string",
            "inventoryId": 8,
            "invoiceLineId": 8,
            "purchaseLineId": 9,
            "section": "string",
            "row": "string",
            "notes": "string",
            "cost": 8,
            "faceValue": 5,
            "sellPrice": 9,
            "stockType": "PAPERLESS",
            "eventId": 2,
            "accountId": 9,
            "status": "CANCELLED",
            "base64FileBytes": "string",
            "disclosures": [
              "string",
              "string",
              "string",
              "string",
              "string",
              "string",
              "string",
              "string",
              "string",
              "string"
            ],
            "attributes": [
              "string",
              "string",
              "string",
              "string",
              "string",
              "string"
            ],
            "createdDate": "string",
            "createdBy": "string",
            "lastUpdate": "string",
            "lastUpdateBy": "string",
            "dateCancelled": "string",
            "cancelledByUserId": 8,
            "auditNote": "string"
          },
          {
            "id": 10,
            "seatNumber": 4,
            "fileName": "string",
            "barCode": "string",
            "inventoryId": 6,
            "invoiceLineId": 10,
            "purchaseLineId": 2,
            "section": "string",
            "row": "string",
            "notes": "string",
            "cost": 8,
            "faceValue": 6,
            "sellPrice": 10,
            "stockType": "HARD",
            "eventId": 4,
            "accountId": 4,
            "status": "AVAILABLE",
            "base64FileBytes": "string",
            "disclosures": [
              "string",
              "string",
              "string",
              "string",
              "string",
              "string",
              "string",
              "string",
              "string"
            ],
            "attributes": [
              "string",
              "string",
              "string",
              "string",
              "string",
              "string",
              "string",
              "string"
            ],
            "createdDate": "string",
            "createdBy": "string",
            "lastUpdate": "string",
            "lastUpdateBy": "string",
            "dateCancelled": "string",
            "cancelledByUserId": 2,
            "auditNote": "string"
          },
          {
            "id": 2,
            "seatNumber": 10,
            "fileName": "string",
            "barCode": "string",
            "inventoryId": 10,
            "invoiceLineId": 9,
            "purchaseLineId": 2,
            "section": "string",
            "row": "string",
            "notes": "string",
            "cost": 8,
            "faceValue": 10,
            "sellPrice": 2,
            "stockType": "MOBILE_SCREENCAP",
            "eventId": 9,
            "accountId": 8,
            "status": "AVAILABLE",
            "base64FileBytes": "string",
            "disclosures": [
              "string",
              "string",
              "string",
              "string",
              "string",
              "string",
              "string"
            ],
            "attributes": [
              "string"
            ],
            "createdDate": "string",
            "createdBy": "string",
            "lastUpdate": "string",
            "lastUpdateBy": "string",
            "dateCancelled": "string",
            "cancelledByUserId": 1,
            "auditNote": "string"
          },
          {
            "id": 1,
            "seatNumber": 7,
            "fileName": "string",
            "barCode": "string",
            "inventoryId": 1,
            "invoiceLineId": 2,
            "purchaseLineId": 4,
            "section": "string",
            "row": "string",
            "notes": "string",
            "cost": 6,
            "faceValue": 8,
            "sellPrice": 8,
            "stockType": "FLASH",
            "eventId": 7,
            "accountId": 9,
            "status": "CANCELLED",
            "base64FileBytes": "string",
            "disclosures": [
              "string",
              "string",
              "string"
            ],
            "attributes": [
              "string",
              "string",
              "string",
              "string",
              "string",
              "string",
              "string",
              "string"
            ],
            "createdDate": "string",
            "createdBy": "string",
            "lastUpdate": "string",
            "lastUpdateBy": "string",
            "dateCancelled": "string",
            "cancelledByUserId": 5,
            "auditNote": "string"
          },
          {
            "id": 8,
            "seatNumber": 9,
            "fileName": "string",
            "barCode": "string",
            "inventoryId": 7,
            "invoiceLineId": 5,
            "purchaseLineId": 10,
            "section": "string",
            "row": "string",
            "notes": "string",
            "cost": 7,
            "faceValue": 2,
            "sellPrice": 9,
            "stockType": "PAPERLESS",
            "eventId": 7,
            "accountId": 4,
            "status": "AVAILABLE",
            "base64FileBytes": "string",
            "disclosures": [
              "string",
              "string",
              "string",
              "string",
              "string",
              "string",
              "string",
              "string"
            ],
            "attributes": [
              "string",
              "string",
              "string",
              "string",
              "string",
              "string",
              "string",
              "string"
            ],
            "createdDate": "string",
            "createdBy": "string",
            "lastUpdate": "string",
            "lastUpdateBy": "string",
            "dateCancelled": "string",
            "cancelledByUserId": 1,
            "auditNote": "string"
          },
          {
            "id": 3,
            "seatNumber": 7,
            "fileName": "string",
            "barCode": "string",
            "inventoryId": 10,
            "invoiceLineId": 5,
            "purchaseLineId": 8,
            "section": "string",
            "row": "string",
            "notes": "string",
            "cost": 5,
            "faceValue": 10,
            "sellPrice": 1,
            "stockType": "PAPERLESS",
            "eventId": 2,
            "accountId": 4,
            "status": "CANCELLED",
            "base64FileBytes": "string",
            "disclosures": [
              "string",
              "string",
              "string",
              "string",
              "string",
              "string",
              "string",
              "string",
              "string"
            ],
            "attributes": [
              "string",
              "string",
              "string",
              "string",
              "string",
              "string"
            ],
            "createdDate": "string",
            "createdBy": "string",
            "lastUpdate": "string",
            "lastUpdateBy": "string",
            "dateCancelled": "string",
            "cancelledByUserId": 4,
            "auditNote": "string"
          },
          {
            "id": 2,
            "seatNumber": 1,
            "fileName": "string",
            "barCode": "string",
            "inventoryId": 10,
            "invoiceLineId": 10,
            "purchaseLineId": 8,
            "section": "string",
            "row": "string",
            "notes": "string",
            "cost": 3,
            "faceValue": 9,
            "sellPrice": 1,
            "stockType": "ELECTRONIC",
            "eventId": 10,
            "accountId": 2,
            "status": "AVAILABLE",
            "base64FileBytes": "string",
            "disclosures": [
              "string",
              "string",
              "string",
              "string",
              "string",
              "string",
              "string",
              "string",
              "string",
              "string"
            ],
            "attributes": [
              "string",
              "string"
            ],
            "createdDate": "string",
            "createdBy": "string",
            "lastUpdate": "string",
            "lastUpdateBy": "string",
            "dateCancelled": "string",
            "cancelledByUserId": 1,
            "auditNote": "string"
          }
        ],
        "ticketIds": [
          8,
          7,
          3,
          4
        ],
        "stockType": "PAPERLESS",
        "splitType": "CUSTOM",
        "customSplit": "string",
        "listPrice": 8,
        "expectedValue": 1,
        "publicNotes": "string",
        "attributes": [
          "string",
          "string",
          "string",
          "string",
          "string",
          "string",
          "string"
        ],
        "status": "DEPLETED",
        "inHandDaysBeforeEvent": 4,
        "lastPriceUpdate": "string",
        "createdDate": "string",
        "createdBy": "string",
        "lastUpdate": "string",
        "lastUpdateBy": "string",
        "lastDeltaUpdate": "string",
        "version": 8,
        "tags": "string",
        "seatType": "ALTERNATING",
        "eventMapping": {
          "eventName": "string",
          "venueName": "string",
          "eventDate": "string",
          "valid": false
        },
        "mappingId": 9,
        "exchangePosId": 2,
        "broadcast": false,
        "zoneSeating": false,
        "electronicTransfer": false,
        "optOutAutoPrice": true,
        "hideSeatNumbers": false,
        "vsrOption": "EVENT_INVENTORY",
        "replenishmentGroupId": 8,
        "replenishmentGroup": "string",
        "shownQuantity": 9,
        "ticketsMerged": true,
        "ticketsSplit": true,
        "auditNote": "string",
        "filesUploaded": false,
        "barCodesEntered": false
      },
      "cancelled": false,
      "delete": false,
      "cancel": false,
      "fillLineId": 6,
      "inventoryIds": [
        3,
        1,
        8,
        6,
        8
      ],
      "createdDate": "string",
      "createdBy": "string",
      "lastUpdate": "string",
      "lastUpdateBy": "string"
    },
    {
      "id": 10,
      "accountId": 8,
      "targetId": 3,
      "quantity": 1,
      "description": "string",
      "amount": 4,
      "lineType": "PURCHASE",
      "lineItemType": "GENERIC",
      "itemIds": [
        10,
        5
      ],
      "inventory": {
        "inHandDate": "string",
        "id": 5,
        "accountId": 6,
        "eventId": 7,
        "quantity": 5,
        "notes": "string",
        "section": "string",
        "row": "string",
        "secondRow": "string",
        "lowSeat": 3,
        "highSeat": 4,
        "cost": 4,
        "faceValue": 9,
        "tickets": [
          {
            "id": 8,
            "seatNumber": 3,
            "fileName": "string",
            "barCode": "string",
            "inventoryId": 10,
            "invoiceLineId": 4,
            "purchaseLineId": 5,
            "section": "string",
            "row": "string",
            "notes": "string",
            "cost": 5,
            "faceValue": 8,
            "sellPrice": 3,
            "stockType": "PAPERLESS_CARD",
            "eventId": 2,
            "accountId": 4,
            "status": "CANCELLED",
            "base64FileBytes": "string",
            "disclosures": [
              "string",
              "string"
            ],
            "attributes": [
              "string"
            ],
            "createdDate": "string",
            "createdBy": "string",
            "lastUpdate": "string",
            "lastUpdateBy": "string",
            "dateCancelled": "string",
            "cancelledByUserId": 5,
            "auditNote": "string"
          },
          {
            "id": 9,
            "seatNumber": 5,
            "fileName": "string",
            "barCode": "string",
            "inventoryId": 3,
            "invoiceLineId": 2,
            "purchaseLineId": 2,
            "section": "string",
            "row": "string",
            "notes": "string",
            "cost": 4,
            "faceValue": 9,
            "sellPrice": 4,
            "stockType": "HARD",
            "eventId": 5,
            "accountId": 1,
            "status": "AVAILABLE",
            "base64FileBytes": "string",
            "disclosures": [
              "string",
              "string",
              "string",
              "string",
              "string",
              "string",
              "string",
              "string",
              "string",
              "string"
            ],
            "attributes": [
              "string",
              "string",
              "string",
              "string",
              "string",
              "string",
              "string",
              "string",
              "string",
              "string"
            ],
            "createdDate": "string",
            "createdBy": "string",
            "lastUpdate": "string",
            "lastUpdateBy": "string",
            "dateCancelled": "string",
            "cancelledByUserId": 1,
            "auditNote": "string"
          },
          {
            "id": 5,
            "seatNumber": 2,
            "fileName": "string",
            "barCode": "string",
            "inventoryId": 1,
            "invoiceLineId": 9,
            "purchaseLineId": 4,
            "section": "string",
            "row": "string",
            "notes": "string",
            "cost": 6,
            "faceValue": 3,
            "sellPrice": 4,
            "stockType": "PAPERLESS",
            "eventId": 5,
            "accountId": 8,
            "status": "CANCELLED",
            "base64FileBytes": "string",
            "disclosures": [
              "string",
              "string",
              "string",
              "string",
              "string",
              "string",
              "string"
            ],
            "attributes": [
              "string",
              "string",
              "string"
            ],
            "createdDate": "string",
            "createdBy": "string",
            "lastUpdate": "string",
            "lastUpdateBy": "string",
            "dateCancelled": "string",
            "cancelledByUserId": 7,
            "auditNote": "string"
          },
          {
            "id": 3,
            "seatNumber": 1,
            "fileName": "string",
            "barCode": "string",
            "inventoryId": 5,
            "invoiceLineId": 1,
            "purchaseLineId": 9,
            "section": "string",
            "row": "string",
            "notes": "string",
            "cost": 3,
            "faceValue": 1,
            "sellPrice": 7,
            "stockType": "HARD",
            "eventId": 4,
            "accountId": 5,
            "status": "CANCELLED",
            "base64FileBytes": "string",
            "disclosures": [
              "string",
              "string",
              "string",
              "string",
              "string",
              "string"
            ],
            "attributes": [
              "string",
              "string",
              "string",
              "string"
            ],
            "createdDate": "string",
            "createdBy": "string",
            "lastUpdate": "string",
            "lastUpdateBy": "string",
            "dateCancelled": "string",
            "cancelledByUserId": 8,
            "auditNote": "string"
          },
          {
            "id": 4,
            "seatNumber": 9,
            "fileName": "string",
            "barCode": "string",
            "inventoryId": 8,
            "invoiceLineId": 5,
            "purchaseLineId": 9,
            "section": "string",
            "row": "string",
            "notes": "string",
            "cost": 8,
            "faceValue": 10,
            "sellPrice": 3,
            "stockType": "ELECTRONIC",
            "eventId": 10,
            "accountId": 5,
            "status": "AVAILABLE",
            "base64FileBytes": "string",
            "disclosures": [
              "string",
              "string",
              "string",
              "string",
              "string"
            ],
            "attributes": [
              "string",
              "string",
              "string",
              "string",
              "string",
              "string",
              "string",
              "string",
              "string",
              "string"
            ],
            "createdDate": "string",
            "createdBy": "string",
            "lastUpdate": "string",
            "lastUpdateBy": "string",
            "dateCancelled": "string",
            "cancelledByUserId": 3,
            "auditNote": "string"
          },
          {
            "id": 7,
            "seatNumber": 4,
            "fileName": "string",
            "barCode": "string",
            "inventoryId": 2,
            "invoiceLineId": 9,
            "purchaseLineId": 6,
            "section": "string",
            "row": "string",
            "notes": "string",
            "cost": 3,
            "faceValue": 9,
            "sellPrice": 5,
            "stockType": "PAPERLESS_CARD",
            "eventId": 1,
            "accountId": 8,
            "status": "CANCELLED",
            "base64FileBytes": "string",
            "disclosures": [
              "string",
              "string",
              "string"
            ],
            "attributes": [
              "string",
              "string"
            ],
            "createdDate": "string",
            "createdBy": "string",
            "lastUpdate": "string",
            "lastUpdateBy": "string",
            "dateCancelled": "string",
            "cancelledByUserId": 4,
            "auditNote": "string"
          },
          {
            "id": 9,
            "seatNumber": 10,
            "fileName": "string",
            "barCode": "string",
            "inventoryId": 10,
            "invoiceLineId": 4,
            "purchaseLineId": 7,
            "section": "string",
            "row": "string",
            "notes": "string",
            "cost": 2,
            "faceValue": 2,
            "sellPrice": 3,
            "stockType": "PAPERLESS",
            "eventId": 7,
            "accountId": 9,
            "status": "CANCELLED",
            "base64FileBytes": "string",
            "disclosures": [
              "string"
            ],
            "attributes": [
              "string",
              "string",
              "string",
              "string",
              "string",
              "string",
              "string"
            ],
            "createdDate": "string",
            "createdBy": "string",
            "lastUpdate": "string",
            "lastUpdateBy": "string",
            "dateCancelled": "string",
            "cancelledByUserId": 5,
            "auditNote": "string"
          }
        ],
        "ticketIds": [
          4,
          7,
          10,
          3
        ],
        "stockType": "PAPERLESS",
        "splitType": "ANY",
        "customSplit": "string",
        "listPrice": 5,
        "expectedValue": 3,
        "publicNotes": "string",
        "attributes": [
          "string",
          "string",
          "string"
        ],
        "status": "DEPLETED",
        "inHandDaysBeforeEvent": 4,
        "lastPriceUpdate": "string",
        "createdDate": "string",
        "createdBy": "string",
        "lastUpdate": "string",
        "lastUpdateBy": "string",
        "lastDeltaUpdate": "string",
        "version": 4,
        "tags": "string",
        "seatType": "GA",
        "eventMapping": {
          "eventName": "string",
          "venueName": "string",
          "eventDate": "string",
          "valid": true
        },
        "mappingId": 1,
        "exchangePosId": 4,
        "broadcast": true,
        "zoneSeating": false,
        "electronicTransfer": false,
        "optOutAutoPrice": false,
        "hideSeatNumbers": false,
        "vsrOption": "ALL",
        "replenishmentGroupId": 10,
        "replenishmentGroup": "string",
        "shownQuantity": 4,
        "ticketsMerged": false,
        "ticketsSplit": false,
        "auditNote": "string",
        "filesUploaded": false,
        "barCodesEntered": true
      },
      "cancelled": false,
      "delete": true,
      "cancel": true,
      "fillLineId": 9,
      "inventoryIds": [
        6,
        3,
        4,
        9,
        7,
        7,
        6
      ],
      "createdDate": "string",
      "createdBy": "string",
      "lastUpdate": "string",
      "lastUpdateBy": "string"
    },
    {
      "id": 7,
      "accountId": 5,
      "targetId": 3,
      "quantity": 10,
      "description": "string",
      "amount": 9,
      "lineType": "PURCHASE",
      "lineItemType": "INVENTORY",
      "itemIds": [
        3,
        4,
        4,
        5,
        6,
        4,
        2,
        3,
        10,
        10
      ],
      "inventory": {
        "inHandDate": "string",
        "id": 7,
        "accountId": 2,
        "eventId": 6,
        "quantity": 1,
        "notes": "string",
        "section": "string",
        "row": "string",
        "secondRow": "string",
        "lowSeat": 9,
        "highSeat": 10,
        "cost": 5,
        "faceValue": 8,
        "tickets": [
          {
            "id": 7,
            "seatNumber": 5,
            "fileName": "string",
            "barCode": "string",
            "inventoryId": 7,
            "invoiceLineId": 7,
            "purchaseLineId": 7,
            "section": "string",
            "row": "string",
            "notes": "string",
            "cost": 6,
            "faceValue": 10,
            "sellPrice": 1,
            "stockType": "HARD",
            "eventId": 9,
            "accountId": 1,
            "status": "SOLD",
            "base64FileBytes": "string",
            "disclosures": [
              "string",
              "string",
              "string",
              "string",
              "string"
            ],
            "attributes": [
              "string",
              "string",
              "string"
            ],
            "createdDate": "string",
            "createdBy": "string",
            "lastUpdate": "string",
            "lastUpdateBy": "string",
            "dateCancelled": "string",
            "cancelledByUserId": 5,
            "auditNote": "string"
          },
          {
            "id": 7,
            "seatNumber": 4,
            "fileName": "string",
            "barCode": "string",
            "inventoryId": 2,
            "invoiceLineId": 7,
            "purchaseLineId": 6,
            "section": "string",
            "row": "string",
            "notes": "string",
            "cost": 3,
            "faceValue": 6,
            "sellPrice": 9,
            "stockType": "PAPERLESS_CARD",
            "eventId": 6,
            "accountId": 1,
            "status": "AVAILABLE",
            "base64FileBytes": "string",
            "disclosures": [
              "string",
              "string",
              "string",
              "string",
              "string",
              "string",
              "string",
              "string"
            ],
            "attributes": [
              "string",
              "string",
              "string",
              "string",
              "string",
              "string",
              "string",
              "string",
              "string",
              "string"
            ],
            "createdDate": "string",
            "createdBy": "string",
            "lastUpdate": "string",
            "lastUpdateBy": "string",
            "dateCancelled": "string",
            "cancelledByUserId": 7,
            "auditNote": "string"
          }
        ],
        "ticketIds": [
          6,
          4,
          9
        ],
        "stockType": "ELECTRONIC",
        "splitType": "DEFAULT",
        "customSplit": "string",
        "listPrice": 3,
        "expectedValue": 9,
        "publicNotes": "string",
        "attributes": [
          "string",
          "string",
          "string",
          "string",
          "string",
          "string"
        ],
        "status": "DEPLETED",
        "inHandDaysBeforeEvent": 1,
        "lastPriceUpdate": "string",
        "createdDate": "string",
        "createdBy": "string",
        "lastUpdate": "string",
        "lastUpdateBy": "string",
        "lastDeltaUpdate": "string",
        "version": 4,
        "tags": "string",
        "seatType": "GA",
        "eventMapping": {
          "eventName": "string",
          "venueName": "string",
          "eventDate": "string",
          "valid": true
        },
        "mappingId": 10,
        "exchangePosId": 6,
        "broadcast": false,
        "zoneSeating": false,
        "electronicTransfer": true,
        "optOutAutoPrice": true,
        "hideSeatNumbers": true,
        "vsrOption": "OTHER",
        "replenishmentGroupId": 3,
        "replenishmentGroup": "string",
        "shownQuantity": 3,
        "ticketsMerged": false,
        "ticketsSplit": true,
        "auditNote": "string",
        "filesUploaded": true,
        "barCodesEntered": false
      },
      "cancelled": false,
      "delete": false,
      "cancel": true,
      "fillLineId": 10,
      "inventoryIds": [
        5,
        7,
        8,
        2,
        10,
        10
      ],
      "createdDate": "string",
      "createdBy": "string",
      "lastUpdate": "string",
      "lastUpdateBy": "string"
    },
    {
      "id": 6,
      "accountId": 9,
      "targetId": 9,
      "quantity": 2,
      "description": "string",
      "amount": 5,
      "lineType": "INVOICE",
      "lineItemType": "GENERIC",
      "itemIds": [
        6,
        3
      ],
      "inventory": {
        "inHandDate": "string",
        "id": 5,
        "accountId": 4,
        "eventId": 5,
        "quantity": 3,
        "notes": "string",
        "section": "string",
        "row": "string",
        "secondRow": "string",
        "lowSeat": 8,
        "highSeat": 5,
        "cost": 6,
        "faceValue": 7,
        "tickets": [
          {
            "id": 2,
            "seatNumber": 4,
            "fileName": "string",
            "barCode": "string",
            "inventoryId": 5,
            "invoiceLineId": 2,
            "purchaseLineId": 7,
            "section": "string",
            "row": "string",
            "notes": "string",
            "cost": 9,
            "faceValue": 4,
            "sellPrice": 6,
            "stockType": "HARD",
            "eventId": 6,
            "accountId": 7,
            "status": "AVAILABLE",
            "base64FileBytes": "string",
            "disclosures": [
              "string",
              "string",
              "string"
            ],
            "attributes": [
              "string",
              "string",
              "string",
              "string",
              "string",
              "string",
              "string",
              "string",
              "string"
            ],
            "createdDate": "string",
            "createdBy": "string",
            "lastUpdate": "string",
            "lastUpdateBy": "string",
            "dateCancelled": "string",
            "cancelledByUserId": 5,
            "auditNote": "string"
          }
        ],
        "ticketIds": [
          7,
          7,
          10,
          8
        ],
        "stockType": "PAPERLESS_CARD",
        "splitType": "ANY",
        "customSplit": "string",
        "listPrice": 6,
        "expectedValue": 3,
        "publicNotes": "string",
        "attributes": [
          "string",
          "string",
          "string",
          "string",
          "string",
          "string"
        ],
        "status": "DEPLETED",
        "inHandDaysBeforeEvent": 5,
        "lastPriceUpdate": "string",
        "createdDate": "string",
        "createdBy": "string",
        "lastUpdate": "string",
        "lastUpdateBy": "string",
        "lastDeltaUpdate": "string",
        "version": 4,
        "tags": "string",
        "seatType": "ALTERNATING",
        "eventMapping": {
          "eventName": "string",
          "venueName": "string",
          "eventDate": "string",
          "valid": false
        },
        "mappingId": 7,
        "exchangePosId": 3,
        "broadcast": false,
        "zoneSeating": true,
        "electronicTransfer": true,
        "optOutAutoPrice": true,
        "hideSeatNumbers": true,
        "vsrOption": "EVENT_INVENTORY",
        "replenishmentGroupId": 9,
        "replenishmentGroup": "string",
        "shownQuantity": 7,
        "ticketsMerged": true,
        "ticketsSplit": false,
        "auditNote": "string",
        "filesUploaded": true,
        "barCodesEntered": false
      },
      "cancelled": true,
      "delete": false,
      "cancel": false,
      "fillLineId": 9,
      "inventoryIds": [
        7,
        4,
        4,
        2,
        2
      ],
      "createdDate": "string",
      "createdBy": "string",
      "lastUpdate": "string",
      "lastUpdateBy": "string"
    },
    {
      "id": 7,
      "accountId": 10,
      "targetId": 10,
      "quantity": 1,
      "description": "string",
      "amount": 5,
      "lineType": "INVOICE",
      "lineItemType": "GENERIC",
      "itemIds": [
        8,
        1,
        3,
        8,
        2,
        4,
        3,
        10,
        2,
        2
      ],
      "inventory": {
        "inHandDate": "string",
        "id": 4,
        "accountId": 6,
        "eventId": 5,
        "quantity": 9,
        "notes": "string",
        "section": "string",
        "row": "string",
        "secondRow": "string",
        "lowSeat": 6,
        "highSeat": 8,
        "cost": 5,
        "faceValue": 3,
        "tickets": [
          {
            "id": 8,
            "seatNumber": 4,
            "fileName": "string",
            "barCode": "string",
            "inventoryId": 6,
            "invoiceLineId": 4,
            "purchaseLineId": 3,
            "section": "string",
            "row": "string",
            "notes": "string",
            "cost": 8,
            "faceValue": 2,
            "sellPrice": 7,
            "stockType": "ELECTRONIC",
            "eventId": 9,
            "accountId": 5,
            "status": "AVAILABLE",
            "base64FileBytes": "string",
            "disclosures": [
              "string",
              "string",
              "string",
              "string",
              "string",
              "string",
              "string",
              "string"
            ],
            "attributes": [
              "string",
              "string",
              "string",
              "string",
              "string",
              "string",
              "string",
              "string",
              "string",
              "string"
            ],
            "createdDate": "string",
            "createdBy": "string",
            "lastUpdate": "string",
            "lastUpdateBy": "string",
            "dateCancelled": "string",
            "cancelledByUserId": 9,
            "auditNote": "string"
          },
          {
            "id": 6,
            "seatNumber": 5,
            "fileName": "string",
            "barCode": "string",
            "inventoryId": 4,
            "invoiceLineId": 9,
            "purchaseLineId": 3,
            "section": "string",
            "row": "string",
            "notes": "string",
            "cost": 4,
            "faceValue": 10,
            "sellPrice": 4,
            "stockType": "FLASH",
            "eventId": 4,
            "accountId": 5,
            "status": "SOLD",
            "base64FileBytes": "string",
            "disclosures": [
              "string",
              "string"
            ],
            "attributes": [
              "string",
              "string",
              "string",
              "string",
              "string",
              "string",
              "string",
              "string",
              "string",
              "string"
            ],
            "createdDate": "string",
            "createdBy": "string",
            "lastUpdate": "string",
            "lastUpdateBy": "string",
            "dateCancelled": "string",
            "cancelledByUserId": 4,
            "auditNote": "string"
          },
          {
            "id": 7,
            "seatNumber": 1,
            "fileName": "string",
            "barCode": "string",
            "inventoryId": 10,
            "invoiceLineId": 2,
            "purchaseLineId": 3,
            "section": "string",
            "row": "string",
            "notes": "string",
            "cost": 5,
            "faceValue": 10,
            "sellPrice": 1,
            "stockType": "PAPERLESS",
            "eventId": 8,
            "accountId": 1,
            "status": "SOLD",
            "base64FileBytes": "string",
            "disclosures": [
              "string",
              "string",
              "string",
              "string",
              "string",
              "string",
              "string",
              "string",
              "string"
            ],
            "attributes": [
              "string",
              "string",
              "string"
            ],
            "createdDate": "string",
            "createdBy": "string",
            "lastUpdate": "string",
            "lastUpdateBy": "string",
            "dateCancelled": "string",
            "cancelledByUserId": 5,
            "auditNote": "string"
          },
          {
            "id": 1,
            "seatNumber": 3,
            "fileName": "string",
            "barCode": "string",
            "inventoryId": 3,
            "invoiceLineId": 8,
            "purchaseLineId": 9,
            "section": "string",
            "row": "string",
            "notes": "string",
            "cost": 1,
            "faceValue": 6,
            "sellPrice": 3,
            "stockType": "FLASH",
            "eventId": 7,
            "accountId": 2,
            "status": "SOLD",
            "base64FileBytes": "string",
            "disclosures": [
              "string",
              "string",
              "string",
              "string",
              "string",
              "string",
              "string",
              "string",
              "string"
            ],
            "attributes": [
              "string",
              "string",
              "string",
              "string"
            ],
            "createdDate": "string",
            "createdBy": "string",
            "lastUpdate": "string",
            "lastUpdateBy": "string",
            "dateCancelled": "string",
            "cancelledByUserId": 5,
            "auditNote": "string"
          },
          {
            "id": 5,
            "seatNumber": 1,
            "fileName": "string",
            "barCode": "string",
            "inventoryId": 6,
            "invoiceLineId": 8,
            "purchaseLineId": 2,
            "section": "string",
            "row": "string",
            "notes": "string",
            "cost": 1,
            "faceValue": 6,
            "sellPrice": 10,
            "stockType": "PAPERLESS",
            "eventId": 4,
            "accountId": 2,
            "status": "SOLD",
            "base64FileBytes": "string",
            "disclosures": [
              "string"
            ],
            "attributes": [
              "string",
              "string",
              "string",
              "string",
              "string",
              "string",
              "string",
              "string",
              "string"
            ],
            "createdDate": "string",
            "createdBy": "string",
            "lastUpdate": "string",
            "lastUpdateBy": "string",
            "dateCancelled": "string",
            "cancelledByUserId": 10,
            "auditNote": "string"
          },
          {
            "id": 4,
            "seatNumber": 1,
            "fileName": "string",
            "barCode": "string",
            "inventoryId": 4,
            "invoiceLineId": 4,
            "purchaseLineId": 2,
            "section": "string",
            "row": "string",
            "notes": "string",
            "cost": 3,
            "faceValue": 10,
            "sellPrice": 2,
            "stockType": "MOBILE_TRANSFER",
            "eventId": 5,
            "accountId": 4,
            "status": "CANCELLED",
            "base64FileBytes": "string",
            "disclosures": [
              "string",
              "string",
              "string",
              "string"
            ],
            "attributes": [
              "string",
              "string",
              "string",
              "string",
              "string",
              "string",
              "string",
              "string",
              "string"
            ],
            "createdDate": "string",
            "createdBy": "string",
            "lastUpdate": "string",
            "lastUpdateBy": "string",
            "dateCancelled": "string",
            "cancelledByUserId": 2,
            "auditNote": "string"
          },
          {
            "id": 2,
            "seatNumber": 3,
            "fileName": "string",
            "barCode": "string",
            "inventoryId": 10,
            "invoiceLineId": 3,
            "purchaseLineId": 1,
            "section": "string",
            "row": "string",
            "notes": "string",
            "cost": 9,
            "faceValue": 2,
            "sellPrice": 6,
            "stockType": "FLASH",
            "eventId": 5,
            "accountId": 4,
            "status": "CANCELLED",
            "base64FileBytes": "string",
            "disclosures": [
              "string",
              "string",
              "string",
              "string",
              "string",
              "string"
            ],
            "attributes": [
              "string",
              "string",
              "string",
              "string"
            ],
            "createdDate": "string",
            "createdBy": "string",
            "lastUpdate": "string",
            "lastUpdateBy": "string",
            "dateCancelled": "string",
            "cancelledByUserId": 5,
            "auditNote": "string"
          },
          {
            "id": 6,
            "seatNumber": 6,
            "fileName": "string",
            "barCode": "string",
            "inventoryId": 5,
            "invoiceLineId": 3,
            "purchaseLineId": 10,
            "section": "string",
            "row": "string",
            "notes": "string",
            "cost": 7,
            "faceValue": 9,
            "sellPrice": 10,
            "stockType": "PAPERLESS",
            "eventId": 7,
            "accountId": 9,
            "status": "AVAILABLE",
            "base64FileBytes": "string",
            "disclosures": [
              "string",
              "string"
            ],
            "attributes": [
              "string",
              "string",
              "string",
              "string",
              "string"
            ],
            "createdDate": "string",
            "createdBy": "string",
            "lastUpdate": "string",
            "lastUpdateBy": "string",
            "dateCancelled": "string",
            "cancelledByUserId": 4,
            "auditNote": "string"
          }
        ],
        "ticketIds": [
          3,
          4,
          8,
          6,
          1
        ],
        "stockType": "ELECTRONIC",
        "splitType": "DEFAULT",
        "customSplit": "string",
        "listPrice": 10,
        "expectedValue": 7,
        "publicNotes": "string",
        "attributes": [
          "string",
          "string",
          "string",
          "string",
          "string"
        ],
        "status": "DEPLETED",
        "inHandDaysBeforeEvent": 5,
        "lastPriceUpdate": "string",
        "createdDate": "string",
        "createdBy": "string",
        "lastUpdate": "string",
        "lastUpdateBy": "string",
        "lastDeltaUpdate": "string",
        "version": 7,
        "tags": "string",
        "seatType": "CONSECUTIVE",
        "eventMapping": {
          "eventName": "string",
          "venueName": "string",
          "eventDate": "string",
          "valid": true
        },
        "mappingId": 4,
        "exchangePosId": 4,
        "broadcast": true,
        "zoneSeating": true,
        "electronicTransfer": true,
        "optOutAutoPrice": false,
        "hideSeatNumbers": true,
        "vsrOption": "ALL",
        "replenishmentGroupId": 7,
        "replenishmentGroup": "string",
        "shownQuantity": 3,
        "ticketsMerged": true,
        "ticketsSplit": false,
        "auditNote": "string",
        "filesUploaded": true,
        "barCodesEntered": false
      },
      "cancelled": false,
      "delete": true,
      "cancel": false,
      "fillLineId": 5,
      "inventoryIds": [
        5,
        4,
        1,
        7,
        1,
        3
      ],
      "createdDate": "string",
      "createdBy": "string",
      "lastUpdate": "string",
      "lastUpdateBy": "string"
    }
  ],
  "salesTerm": "NET0",
  "paymentMethod": "CASH",
  "paymentRef": "string",
  "deliveryMethod": "EMAIL",
  "shippingAddressId": 10,
  "billingAddressId": 2,
  "taxAmount": 7,
  "shippingAmount": 10,
  "otherAmount": 7,
  "internalNotes": "string",
  "publicNotes": "string",
  "createdDate": "string",
  "lastUpdate": "string",
  "dueDate": "string",
  "tags": "string",
  "createdBy": "string",
  "lastUpdateBy": "string",
  "paymentStatus": "PAID",
  "fulfillmentStatus": "PENDING",
  "externalRef": "string",
  "airbill": "string",
  "status": "MANAGER_REVIEW",
  "currencyCode": "AUD",
  "payments": [
    {
      "id": 10,
      "accountId": 9,
      "referenceNumber": "string",
      "amount": 4,
      "paymentDate": "string",
      "userId": 6,
      "entityId": 7,
      "paymentType": "INVOICE",
      "paymentMethod": "PAYPAL",
      "invoiceId": 7
    },
    {
      "id": 2,
      "accountId": 9,
      "referenceNumber": "string",
      "amount": 1,
      "paymentDate": "string",
      "userId": 7,
      "entityId": 1,
      "paymentType": "INVOICE",
      "paymentMethod": "ACH",
      "invoiceId": 7
    },
    {
      "id": 10,
      "accountId": 5,
      "referenceNumber": "string",
      "amount": 5,
      "paymentDate": "string",
      "userId": 1,
      "entityId": 8,
      "paymentType": "PURCHASE",
      "paymentMethod": "EVOPAY",
      "invoiceId": 1
    },
    {
      "id": 10,
      "accountId": 8,
      "referenceNumber": "string",
      "amount": 10,
      "paymentDate": "string",
      "userId": 9,
      "entityId": 2,
      "paymentType": "PURCHASE",
      "paymentMethod": "AP",
      "invoiceId": 3
    },
    {
      "id": 5,
      "accountId": 2,
      "referenceNumber": "string",
      "amount": 8,
      "paymentDate": "string",
      "userId": 1,
      "entityId": 10,
      "paymentType": "PURCHASE",
      "paymentMethod": "CHECK",
      "invoiceId": 7
    }
  ],
  "invoiceDeliveryLink": {
    "enabled": false,
    "description": "string",
    "allTicketsWithBarcodes": true,
    "allTicketsWithPdfs": true
  },
  "notes": [
    {
      "id": 4,
      "userId": 3,
      "accountId": 10,
      "invoiceId": 7,
      "date": "string",
      "text": "string",
      "author": "string"
    }
  ],
  "fulfillmentDate": "string",
  "fulfillmentByUserId": 6,
  "outstandingBalance": 9,
  "barcodesEntered": false,
  "filesUploaded": true
}