{
  "id": 6,
  "creatorId": 8,
  "accountId": 5,
  "subject": "string",
  "message": "string",
  "alertType": "RELEASE",
  "createdDate": "string",
  "lastUpdate": "string",
  "acknowledged": true,
  "senderName": "string",
  "senderEmail": "string",
  "releaseAlertId": 2
}