[
  {
    "id": 7,
    "accountId": 8,
    "targetId": 1,
    "quantity": 10,
    "description": "string",
    "amount": 6,
    "lineType": "PURCHASE",
    "lineItemType": "GENERIC",
    "itemIds": [
      10,
      7,
      1,
      5,
      3,
      10,
      2,
      1,
      9,
      10
    ],
    "inventory": {
      "inHandDate": "string",
      "id": 4,
      "accountId": 4,
      "eventId": 5,
      "quantity": 7,
      "notes": "string",
      "section": "string",
      "row": "string",
      "secondRow": "string",
      "lowSeat": 1,
      "highSeat": 2,
      "cost": 10,
      "faceValue": 9,
      "tickets": [
        {
          "id": 1,
          "seatNumber": 6,
          "fileName": "string",
          "barCode": "string",
          "inventoryId": 4,
          "invoiceLineId": 10,
          "purchaseLineId": 1,
          "section": "string",
          "row": "string",
          "notes": "string",
          "cost": 1,
          "faceValue": 1,
          "sellPrice": 5,
          "stockType": "MOBILE_TRANSFER",
          "eventId": 2,
          "accountId": 7,
          "status": "AVAILABLE",
          "base64FileBytes": "string",
          "disclosures": [
            "string",
            "string",
            "string",
            "string"
          ],
          "attributes": [
            "string",
            "string",
            "string",
            "string",
            "string",
            "string",
            "string",
            "string",
            "string",
            "string"
          ],
          "createdDate": "string",
          "createdBy": "string",
          "lastUpdate": "string",
          "lastUpdateBy": "string",
          "dateCancelled": "string",
          "cancelledByUserId": 1,
          "auditNote": "string"
        }
      ],
      "ticketIds": [
        9,
        1,
        2,
        7,
        4,
        8,
        9
      ],
      "stockType": "PAPERLESS",
      "splitType": "NEVERLEAVEONE",
      "customSplit": "string",
      "listPrice": 10,
      "expectedValue": 8,
      "publicNotes": "string",
      "attributes": [
        "string",
        "string"
      ],
      "status": "AVAILABLE",
      "inHandDaysBeforeEvent": 5,
      "lastPriceUpdate": "string",
      "createdDate": "string",
      "createdBy": "string",
      "lastUpdate": "string",
      "lastUpdateBy": "string",
      "lastDeltaUpdate": "string",
      "version": 8,
      "tags": "string",
      "seatType": "PIGGYBACK",
      "eventMapping": {
        "eventName": "string",
        "venueName": "string",
        "eventDate": "string",
        "valid": false
      },
      "mappingId": 1,
      "exchangePosId": 5,
      "broadcast": false,
      "zoneSeating": true,
      "electronicTransfer": false,
      "optOutAutoPrice": false,
      "hideSeatNumbers": false,
      "vsrOption": "OTHER",
      "replenishmentGroupId": 7,
      "replenishmentGroup": "string",
      "shownQuantity": 3,
      "ticketsMerged": true,
      "ticketsSplit": true,
      "auditNote": "string",
      "filesUploaded": false,
      "barCodesEntered": false
    },
    "cancelled": false,
    "delete": true,
    "cancel": true,
    "fillLineId": 2,
    "inventoryIds": [
      5,
      4,
      8
    ],
    "createdDate": "string",
    "createdBy": "string",
    "lastUpdate": "string",
    "lastUpdateBy": "string"
  },
  {
    "id": 3,
    "accountId": 1,
    "targetId": 8,
    "quantity": 8,
    "description": "string",
    "amount": 9,
    "lineType": "INVOICE",
    "lineItemType": "GENERIC",
    "itemIds": [
      1,
      7,
      5,
      2,
      6,
      4,
      1
    ],
    "inventory": {
      "inHandDate": "string",
      "id": 8,
      "accountId": 6,
      "eventId": 4,
      "quantity": 2,
      "notes": "string",
      "section": "string",
      "row": "string",
      "secondRow": "string",
      "lowSeat": 9,
      "highSeat": 5,
      "cost": 1,
      "faceValue": 3,
      "tickets": [
        {
          "id": 6,
          "seatNumber": 7,
          "fileName": "string",
          "barCode": "string",
          "inventoryId": 5,
          "invoiceLineId": 1,
          "purchaseLineId": 10,
          "section": "string",
          "row": "string",
          "notes": "string",
          "cost": 5,
          "faceValue": 3,
          "sellPrice": 1,
          "stockType": "PAPERLESS",
          "eventId": 2,
          "accountId": 6,
          "status": "CANCELLED",
          "base64FileBytes": "string",
          "disclosures": [
            "string",
            "string",
            "string",
            "string",
            "string",
            "string",
            "string",
            "string",
            "string"
          ],
          "attributes": [
            "string"
          ],
          "createdDate": "string",
          "createdBy": "string",
          "lastUpdate": "string",
          "lastUpdateBy": "string",
          "dateCancelled": "string",
          "cancelledByUserId": 1,
          "auditNote": "string"
        },
        {
          "id": 7,
          "seatNumber": 10,
          "fileName": "string",
          "barCode": "string",
          "inventoryId": 3,
          "invoiceLineId": 3,
          "purchaseLineId": 9,
          "section": "string",
          "row": "string",
          "notes": "string",
          "cost": 8,
          "faceValue": 1,
          "sellPrice": 5,
          "stockType": "PAPERLESS",
          "eventId": 4,
          "accountId": 2,
          "status": "SOLD",
          "base64FileBytes": "string",
          "disclosures": [
            "string",
            "string",
            "string",
            "string",
            "string",
            "string",
            "string",
            "string",
            "string",
            "string"
          ],
          "attributes": [
            "string",
            "string",
            "string",
            "string",
            "string",
            "string",
            "string"
          ],
          "createdDate": "string",
          "createdBy": "string",
          "lastUpdate": "string",
          "lastUpdateBy": "string",
          "dateCancelled": "string",
          "cancelledByUserId": 3,
          "auditNote": "string"
        }
      ],
      "ticketIds": [
        1,
        8,
        8,
        2,
        2,
        4,
        8,
        5,
        9,
        5
      ],
      "stockType": "PAPERLESS",
      "splitType": "DEFAULT",
      "customSplit": "string",
      "listPrice": 3,
      "expectedValue": 10,
      "publicNotes": "string",
      "attributes": [
        "string",
        "string",
        "string",
        "string",
        "string",
        "string",
        "string"
      ],
      "status": "DEPLETED",
      "inHandDaysBeforeEvent": 6,
      "lastPriceUpdate": "string",
      "createdDate": "string",
      "createdBy": "string",
      "lastUpdate": "string",
      "lastUpdateBy": "string",
      "lastDeltaUpdate": "string",
      "version": 3,
      "tags": "string",
      "seatType": "PIGGYBACK",
      "eventMapping": {
        "eventName": "string",
        "venueName": "string",
        "eventDate": "string",
        "valid": true
      },
      "mappingId": 2,
      "exchangePosId": 3,
      "broadcast": false,
      "zoneSeating": true,
      "electronicTransfer": false,
      "optOutAutoPrice": false,
      "hideSeatNumbers": false,
      "vsrOption": "OTHER",
      "replenishmentGroupId": 7,
      "replenishmentGroup": "string",
      "shownQuantity": 8,
      "ticketsMerged": true,
      "ticketsSplit": true,
      "auditNote": "string",
      "filesUploaded": false,
      "barCodesEntered": true
    },
    "cancelled": true,
    "delete": false,
    "cancel": true,
    "fillLineId": 8,
    "inventoryIds": [
      6,
      1,
      1,
      1,
      8,
      8,
      1
    ],
    "createdDate": "string",
    "createdBy": "string",
    "lastUpdate": "string",
    "lastUpdateBy": "string"
  },
  {
    "id": 7,
    "accountId": 5,
    "targetId": 4,
    "quantity": 5,
    "description": "string",
    "amount": 5,
    "lineType": "PURCHASE",
    "lineItemType": "GENERIC",
    "itemIds": [
      10,
      3,
      4
    ],
    "inventory": {
      "inHandDate": "string",
      "id": 9,
      "accountId": 9,
      "eventId": 9,
      "quantity": 7,
      "notes": "string",
      "section": "string",
      "row": "string",
      "secondRow": "string",
      "lowSeat": 6,
      "highSeat": 8,
      "cost": 3,
      "faceValue": 4,
      "tickets": [
        {
          "id": 7,
          "seatNumber": 10,
          "fileName": "string",
          "barCode": "string",
          "inventoryId": 1,
          "invoiceLineId": 6,
          "purchaseLineId": 6,
          "section": "string",
          "row": "string",
          "notes": "string",
          "cost": 5,
          "faceValue": 1,
          "sellPrice": 5,
          "stockType": "ELECTRONIC",
          "eventId": 3,
          "accountId": 6,
          "status": "SOLD",
          "base64FileBytes": "string",
          "disclosures": [
            "string",
            "string",
            "string",
            "string",
            "string",
            "string",
            "string",
            "string"
          ],
          "attributes": [
            "string",
            "string",
            "string",
            "string",
            "string",
            "string",
            "string"
          ],
          "createdDate": "string",
          "createdBy": "string",
          "lastUpdate": "string",
          "lastUpdateBy": "string",
          "dateCancelled": "string",
          "cancelledByUserId": 2,
          "auditNote": "string"
        },
        {
          "id": 2,
          "seatNumber": 6,
          "fileName": "string",
          "barCode": "string",
          "inventoryId": 2,
          "invoiceLineId": 4,
          "purchaseLineId": 9,
          "section": "string",
          "row": "string",
          "notes": "string",
          "cost": 2,
          "faceValue": 4,
          "sellPrice": 5,
          "stockType": "MOBILE_TRANSFER",
          "eventId": 1,
          "accountId": 5,
          "status": "AVAILABLE",
          "base64FileBytes": "string",
          "disclosures": [
            "string",
            "string",
            "string",
            "string",
            "string",
            "string"
          ],
          "attributes": [
            "string",
            "string",
            "string",
            "string",
            "string",
            "string"
          ],
          "createdDate": "string",
          "createdBy": "string",
          "lastUpdate": "string",
          "lastUpdateBy": "string",
          "dateCancelled": "string",
          "cancelledByUserId": 6,
          "auditNote": "string"
        },
        {
          "id": 6,
          "seatNumber": 7,
          "fileName": "string",
          "barCode": "string",
          "inventoryId": 3,
          "invoiceLineId": 10,
          "purchaseLineId": 4,
          "section": "string",
          "row": "string",
          "notes": "string",
          "cost": 10,
          "faceValue": 10,
          "sellPrice": 9,
          "stockType": "PAPERLESS",
          "eventId": 10,
          "accountId": 9,
          "status": "CANCELLED",
          "base64FileBytes": "string",
          "disclosures": [
            "string",
            "string",
            "string",
            "string"
          ],
          "attributes": [
            "string",
            "string",
            "string",
            "string",
            "string",
            "string",
            "string"
          ],
          "createdDate": "string",
          "createdBy": "string",
          "lastUpdate": "string",
          "lastUpdateBy": "string",
          "dateCancelled": "string",
          "cancelledByUserId": 4,
          "auditNote": "string"
        }
      ],
      "ticketIds": [
        3,
        1,
        4,
        1,
        2,
        1,
        4,
        7
      ],
      "stockType": "FLASH",
      "splitType": "DEFAULT",
      "customSplit": "string",
      "listPrice": 4,
      "expectedValue": 6,
      "publicNotes": "string",
      "attributes": [
        "string",
        "string",
        "string",
        "string",
        "string",
        "string",
        "string"
      ],
      "status": "ON_HOLD",
      "inHandDaysBeforeEvent": 10,
      "lastPriceUpdate": "string",
      "createdDate": "string",
      "createdBy": "string",
      "lastUpdate": "string",
      "lastUpdateBy": "string",
      "lastDeltaUpdate": "string",
      "version": 8,
      "tags": "string",
      "seatType": "GA",
      "eventMapping": {
        "eventName": "string",
        "venueName": "string",
        "eventDate": "string",
        "valid": false
      },
      "mappingId": 9,
      "exchangePosId": 9,
      "broadcast": false,
      "zoneSeating": false,
      "electronicTransfer": true,
      "optOutAutoPrice": true,
      "hideSeatNumbers": true,
      "vsrOption": "ALL",
      "replenishmentGroupId": 6,
      "replenishmentGroup": "string",
      "shownQuantity": 3,
      "ticketsMerged": true,
      "ticketsSplit": true,
      "auditNote": "string",
      "filesUploaded": true,
      "barCodesEntered": false
    },
    "cancelled": true,
    "delete": false,
    "cancel": false,
    "fillLineId": 8,
    "inventoryIds": [
      6,
      9,
      6,
      9,
      5,
      2,
      8,
      6,
      5,
      9
    ],
    "createdDate": "string",
    "createdBy": "string",
    "lastUpdate": "string",
    "lastUpdateBy": "string"
  }
]