[
  {
    "inHandDate": "string",
    "id": 4,
    "accountId": 2,
    "eventId": 7,
    "quantity": 3,
    "notes": "string",
    "section": "string",
    "row": "string",
    "secondRow": "string",
    "lowSeat": 8,
    "highSeat": 5,
    "cost": 5,
    "faceValue": 6,
    "tickets": [
      {
        "id": 6,
        "seatNumber": 7,
        "fileName": "string",
        "barCode": "string",
        "inventoryId": 1,
        "invoiceLineId": 4,
        "purchaseLineId": 4,
        "section": "string",
        "row": "string",
        "notes": "string",
        "cost": 1,
        "faceValue": 9,
        "sellPrice": 6,
        "stockType": "MOBILE_TRANSFER",
        "eventId": 9,
        "accountId": 7,
        "status": "CANCELLED",
        "base64FileBytes": "string",
        "disclosures": [
          "string",
          "string",
          "string",
          "string",
          "string",
          "string",
          "string",
          "string",
          "string"
        ],
        "attributes": [
          "string",
          "string"
        ],
        "createdDate": "string",
        "createdBy": "string",
        "lastUpdate": "string",
        "lastUpdateBy": "string",
        "dateCancelled": "string",
        "cancelledByUserId": 7,
        "auditNote": "string"
      },
      {
        "id": 6,
        "seatNumber": 9,
        "fileName": "string",
        "barCode": "string",
        "inventoryId": 7,
        "invoiceLineId": 5,
        "purchaseLineId": 6,
        "section": "string",
        "row": "string",
        "notes": "string",
        "cost": 1,
        "faceValue": 8,
        "sellPrice": 1,
        "stockType": "MOBILE_SCREENCAP",
        "eventId": 4,
        "accountId": 1,
        "status": "CANCELLED",
        "base64FileBytes": "string",
        "disclosures": [
          "string",
          "string",
          "string",
          "string",
          "string",
          "string",
          "string",
          "string"
        ],
        "attributes": [
          "string"
        ],
        "createdDate": "string",
        "createdBy": "string",
        "lastUpdate": "string",
        "lastUpdateBy": "string",
        "dateCancelled": "string",
        "cancelledByUserId": 10,
        "auditNote": "string"
      },
      {
        "id": 8,
        "seatNumber": 4,
        "fileName": "string",
        "barCode": "string",
        "inventoryId": 3,
        "invoiceLineId": 2,
        "purchaseLineId": 5,
        "section": "string",
        "row": "string",
        "notes": "string",
        "cost": 10,
        "faceValue": 5,
        "sellPrice": 2,
        "stockType": "MOBILE_TRANSFER",
        "eventId": 10,
        "accountId": 3,
        "status": "CANCELLED",
        "base64FileBytes": "string",
        "disclosures": [
          "string",
          "string",
          "string",
          "string",
          "string",
          "string",
          "string",
          "string",
          "string"
        ],
        "attributes": [
          "string",
          "string",
          "string",
          "string",
          "string",
          "string"
        ],
        "createdDate": "string",
        "createdBy": "string",
        "lastUpdate": "string",
        "lastUpdateBy": "string",
        "dateCancelled": "string",
        "cancelledByUserId": 7,
        "auditNote": "string"
      },
      {
        "id": 10,
        "seatNumber": 9,
        "fileName": "string",
        "barCode": "string",
        "inventoryId": 4,
        "invoiceLineId": 1,
        "purchaseLineId": 4,
        "section": "string",
        "row": "string",
        "notes": "string",
        "cost": 9,
        "faceValue": 8,
        "sellPrice": 9,
        "stockType": "MOBILE_TRANSFER",
        "eventId": 9,
        "accountId": 7,
        "status": "SOLD",
        "base64FileBytes": "string",
        "disclosures": [
          "string",
          "string",
          "string",
          "string",
          "string",
          "string"
        ],
        "attributes": [
          "string",
          "string",
          "string"
        ],
        "createdDate": "string",
        "createdBy": "string",
        "lastUpdate": "string",
        "lastUpdateBy": "string",
        "dateCancelled": "string",
        "cancelledByUserId": 5,
        "auditNote": "string"
      },
      {
        "id": 1,
        "seatNumber": 1,
        "fileName": "string",
        "barCode": "string",
        "inventoryId": 4,
        "invoiceLineId": 7,
        "purchaseLineId": 9,
        "section": "string",
        "row": "string",
        "notes": "string",
        "cost": 3,
        "faceValue": 10,
        "sellPrice": 9,
        "stockType": "FLASH",
        "eventId": 8,
        "accountId": 10,
        "status": "SOLD",
        "base64FileBytes": "string",
        "disclosures": [
          "string",
          "string",
          "string",
          "string",
          "string",
          "string",
          "string",
          "string"
        ],
        "attributes": [
          "string",
          "string",
          "string",
          "string",
          "string",
          "string",
          "string",
          "string"
        ],
        "createdDate": "string",
        "createdBy": "string",
        "lastUpdate": "string",
        "lastUpdateBy": "string",
        "dateCancelled": "string",
        "cancelledByUserId": 4,
        "auditNote": "string"
      }
    ],
    "ticketIds": [
      4,
      9,
      4,
      1,
      5
    ],
    "stockType": "PAPERLESS_CARD",
    "splitType": "ANY",
    "customSplit": "string",
    "listPrice": 9,
    "expectedValue": 2,
    "publicNotes": "string",
    "attributes": [
      "string",
      "string",
      "string",
      "string",
      "string",
      "string",
      "string",
      "string",
      "string"
    ],
    "status": "DEPLETED",
    "inHandDaysBeforeEvent": 3,
    "lastPriceUpdate": "string",
    "createdDate": "string",
    "createdBy": "string",
    "lastUpdate": "string",
    "lastUpdateBy": "string",
    "lastDeltaUpdate": "string",
    "version": 5,
    "tags": "string",
    "seatType": "PIGGYBACK",
    "eventMapping": {
      "eventName": "string",
      "venueName": "string",
      "eventDate": "string",
      "valid": false
    },
    "mappingId": 5,
    "exchangePosId": 10,
    "broadcast": true,
    "zoneSeating": true,
    "electronicTransfer": true,
    "optOutAutoPrice": true,
    "hideSeatNumbers": false,
    "vsrOption": "ALL",
    "replenishmentGroupId": 6,
    "replenishmentGroup": "string",
    "shownQuantity": 5,
    "ticketsMerged": true,
    "ticketsSplit": false,
    "auditNote": "string",
    "filesUploaded": true,
    "barCodesEntered": true,
    "seatNumbers": "string",
    "listed": false,
    "consignmentStatus": "string",
    "cooperative": true,
    "holdId": 3,
    "hold": {
      "id": 4,
      "accountId": 4,
      "inventoryId": 10,
      "user": "string",
      "userId": 9,
      "removedByUserId": 9,
      "createdDate": "string",
      "expiryDate": "string",
      "customerId": 7,
      "removedDate": "string",
      "notes": "string",
      "externalRef": "string",
      "quantity": 5,
      "section": "string",
      "row": "string",
      "seats": "string",
      "cost": 1,
      "listPrice": 8,
      "eventId": 5
    },
    "unitCostAverage": 9,
    "faceValueAverage": 6,
    "currencies": [
      "BRL",
      "JPY"
    ],
    "received": "string",
    "vendorId": [
      4,
      9,
      7,
      8,
      6,
      7
    ],
    "inHand": false,
    "daysOld": 3,
    "ticketIdString": "string",
    "event": {
      "id": 8,
      "name": "string",
      "date": "string",
      "venue": {
        "id": 6,
        "name": "string",
        "address": "string",
        "city": "string",
        "state": "string",
        "country": "string",
        "postalCode": "string",
        "phone": "string",
        "timeZone": {
          "fixed": false,
          "id": "string"
        }
      },
      "performerId": 3,
      "performer": {
        "id": 3,
        "name": "string",
        "eventType": "SPORT",
        "category": {
          "id": 6,
          "name": "string",
          "eventType": "OTHER"
        }
      },
      "keywords": "string",
      "chartUrl": "string",
      "stubhubEventId": 2,
      "stubhubEventUrl": "string",
      "tags": "string",
      "notes": "string",
      "eiEventId": 10,
      "optOutReplenishment": false,
      "ticketCount": 8,
      "mySoldTickets": 2,
      "disabled": false,
      "vividSeatsEventUrl": "string"
    }
  },
  {
    "inHandDate": "string",
    "id": 6,
    "accountId": 7,
    "eventId": 9,
    "quantity": 9,
    "notes": "string",
    "section": "string",
    "row": "string",
    "secondRow": "string",
    "lowSeat": 6,
    "highSeat": 6,
    "cost": 7,
    "faceValue": 3,
    "tickets": [
      {
        "id": 2,
        "seatNumber": 10,
        "fileName": "string",
        "barCode": "string",
        "inventoryId": 5,
        "invoiceLineId": 9,
        "purchaseLineId": 5,
        "section": "string",
        "row": "string",
        "notes": "string",
        "cost": 2,
        "faceValue": 5,
        "sellPrice": 5,
        "stockType": "PAPERLESS_CARD",
        "eventId": 7,
        "accountId": 6,
        "status": "SOLD",
        "base64FileBytes": "string",
        "disclosures": [
          "string",
          "string",
          "string",
          "string",
          "string",
          "string",
          "string",
          "string",
          "string"
        ],
        "attributes": [
          "string"
        ],
        "createdDate": "string",
        "createdBy": "string",
        "lastUpdate": "string",
        "lastUpdateBy": "string",
        "dateCancelled": "string",
        "cancelledByUserId": 8,
        "auditNote": "string"
      },
      {
        "id": 2,
        "seatNumber": 6,
        "fileName": "string",
        "barCode": "string",
        "inventoryId": 2,
        "invoiceLineId": 6,
        "purchaseLineId": 3,
        "section": "string",
        "row": "string",
        "notes": "string",
        "cost": 3,
        "faceValue": 8,
        "sellPrice": 1,
        "stockType": "FLASH",
        "eventId": 6,
        "accountId": 5,
        "status": "SOLD",
        "base64FileBytes": "string",
        "disclosures": [
          "string",
          "string"
        ],
        "attributes": [
          "string",
          "string",
          "string"
        ],
        "createdDate": "string",
        "createdBy": "string",
        "lastUpdate": "string",
        "lastUpdateBy": "string",
        "dateCancelled": "string",
        "cancelledByUserId": 7,
        "auditNote": "string"
      }
    ],
    "ticketIds": [
      6,
      10
    ],
    "stockType": "PAPERLESS_CARD",
    "splitType": "ANY",
    "customSplit": "string",
    "listPrice": 8,
    "expectedValue": 4,
    "publicNotes": "string",
    "attributes": [
      "string",
      "string",
      "string",
      "string",
      "string",
      "string",
      "string",
      "string",
      "string"
    ],
    "status": "ON_HOLD",
    "inHandDaysBeforeEvent": 10,
    "lastPriceUpdate": "string",
    "createdDate": "string",
    "createdBy": "string",
    "lastUpdate": "string",
    "lastUpdateBy": "string",
    "lastDeltaUpdate": "string",
    "version": 2,
    "tags": "string",
    "seatType": "PIGGYBACK",
    "eventMapping": {
      "eventName": "string",
      "venueName": "string",
      "eventDate": "string",
      "valid": false
    },
    "mappingId": 4,
    "exchangePosId": 10,
    "broadcast": true,
    "zoneSeating": true,
    "electronicTransfer": false,
    "optOutAutoPrice": false,
    "hideSeatNumbers": false,
    "vsrOption": "OTHER",
    "replenishmentGroupId": 8,
    "replenishmentGroup": "string",
    "shownQuantity": 9,
    "ticketsMerged": true,
    "ticketsSplit": false,
    "auditNote": "string",
    "filesUploaded": true,
    "barCodesEntered": false,
    "seatNumbers": "string",
    "listed": true,
    "consignmentStatus": "string",
    "cooperative": true,
    "holdId": 10,
    "hold": {
      "id": 9,
      "accountId": 4,
      "inventoryId": 6,
      "user": "string",
      "userId": 4,
      "removedByUserId": 10,
      "createdDate": "string",
      "expiryDate": "string",
      "customerId": 4,
      "removedDate": "string",
      "notes": "string",
      "externalRef": "string",
      "quantity": 5,
      "section": "string",
      "row": "string",
      "seats": "string",
      "cost": 5,
      "listPrice": 8,
      "eventId": 6
    },
    "unitCostAverage": 10,
    "faceValueAverage": 5,
    "currencies": [
      "GBP",
      "JPY",
      "BRL",
      "XBT",
      "XBT",
      "AUD"
    ],
    "received": "string",
    "vendorId": [
      7,
      9,
      8,
      5,
      8,
      4,
      7,
      7
    ],
    "inHand": false,
    "daysOld": 6,
    "ticketIdString": "string",
    "event": {
      "id": 4,
      "name": "string",
      "date": "string",
      "venue": {
        "id": 4,
        "name": "string",
        "address": "string",
        "city": "string",
        "state": "string",
        "country": "string",
        "postalCode": "string",
        "phone": "string",
        "timeZone": {
          "fixed": false,
          "id": "string"
        }
      },
      "performerId": 5,
      "performer": {
        "id": 5,
        "name": "string",
        "eventType": "SPORT",
        "category": {
          "id": 5,
          "name": "string",
          "eventType": "CONCERT"
        }
      },
      "keywords": "string",
      "chartUrl": "string",
      "stubhubEventId": 6,
      "stubhubEventUrl": "string",
      "tags": "string",
      "notes": "string",
      "eiEventId": 10,
      "optOutReplenishment": false,
      "ticketCount": 7,
      "mySoldTickets": 2,
      "disabled": false,
      "vividSeatsEventUrl": "string"
    }
  },
  {
    "inHandDate": "string",
    "id": 6,
    "accountId": 2,
    "eventId": 4,
    "quantity": 8,
    "notes": "string",
    "section": "string",
    "row": "string",
    "secondRow": "string",
    "lowSeat": 7,
    "highSeat": 6,
    "cost": 8,
    "faceValue": 4,
    "tickets": [
      {
        "id": 10,
        "seatNumber": 3,
        "fileName": "string",
        "barCode": "string",
        "inventoryId": 10,
        "invoiceLineId": 8,
        "purchaseLineId": 4,
        "section": "string",
        "row": "string",
        "notes": "string",
        "cost": 9,
        "faceValue": 7,
        "sellPrice": 9,
        "stockType": "FLASH",
        "eventId": 9,
        "accountId": 9,
        "status": "CANCELLED",
        "base64FileBytes": "string",
        "disclosures": [
          "string"
        ],
        "attributes": [
          "string",
          "string",
          "string",
          "string"
        ],
        "createdDate": "string",
        "createdBy": "string",
        "lastUpdate": "string",
        "lastUpdateBy": "string",
        "dateCancelled": "string",
        "cancelledByUserId": 3,
        "auditNote": "string"
      },
      {
        "id": 1,
        "seatNumber": 9,
        "fileName": "string",
        "barCode": "string",
        "inventoryId": 1,
        "invoiceLineId": 10,
        "purchaseLineId": 10,
        "section": "string",
        "row": "string",
        "notes": "string",
        "cost": 6,
        "faceValue": 1,
        "sellPrice": 9,
        "stockType": "MOBILE_SCREENCAP",
        "eventId": 9,
        "accountId": 6,
        "status": "SOLD",
        "base64FileBytes": "string",
        "disclosures": [
          "string",
          "string",
          "string"
        ],
        "attributes": [
          "string",
          "string",
          "string",
          "string",
          "string"
        ],
        "createdDate": "string",
        "createdBy": "string",
        "lastUpdate": "string",
        "lastUpdateBy": "string",
        "dateCancelled": "string",
        "cancelledByUserId": 9,
        "auditNote": "string"
      },
      {
        "id": 7,
        "seatNumber": 4,
        "fileName": "string",
        "barCode": "string",
        "inventoryId": 5,
        "invoiceLineId": 3,
        "purchaseLineId": 5,
        "section": "string",
        "row": "string",
        "notes": "string",
        "cost": 6,
        "faceValue": 7,
        "sellPrice": 7,
        "stockType": "MOBILE_TRANSFER",
        "eventId": 10,
        "accountId": 7,
        "status": "AVAILABLE",
        "base64FileBytes": "string",
        "disclosures": [
          "string",
          "string"
        ],
        "attributes": [
          "string",
          "string",
          "string",
          "string",
          "string",
          "string",
          "string",
          "string",
          "string",
          "string"
        ],
        "createdDate": "string",
        "createdBy": "string",
        "lastUpdate": "string",
        "lastUpdateBy": "string",
        "dateCancelled": "string",
        "cancelledByUserId": 5,
        "auditNote": "string"
      },
      {
        "id": 4,
        "seatNumber": 1,
        "fileName": "string",
        "barCode": "string",
        "inventoryId": 9,
        "invoiceLineId": 10,
        "purchaseLineId": 6,
        "section": "string",
        "row": "string",
        "notes": "string",
        "cost": 6,
        "faceValue": 5,
        "sellPrice": 1,
        "stockType": "PAPERLESS_CARD",
        "eventId": 9,
        "accountId": 3,
        "status": "SOLD",
        "base64FileBytes": "string",
        "disclosures": [
          "string",
          "string",
          "string",
          "string",
          "string",
          "string",
          "string"
        ],
        "attributes": [
          "string",
          "string",
          "string",
          "string"
        ],
        "createdDate": "string",
        "createdBy": "string",
        "lastUpdate": "string",
        "lastUpdateBy": "string",
        "dateCancelled": "string",
        "cancelledByUserId": 3,
        "auditNote": "string"
      },
      {
        "id": 8,
        "seatNumber": 8,
        "fileName": "string",
        "barCode": "string",
        "inventoryId": 5,
        "invoiceLineId": 7,
        "purchaseLineId": 4,
        "section": "string",
        "row": "string",
        "notes": "string",
        "cost": 2,
        "faceValue": 9,
        "sellPrice": 4,
        "stockType": "MOBILE_SCREENCAP",
        "eventId": 9,
        "accountId": 2,
        "status": "CANCELLED",
        "base64FileBytes": "string",
        "disclosures": [
          "string",
          "string",
          "string",
          "string",
          "string",
          "string",
          "string"
        ],
        "attributes": [
          "string",
          "string",
          "string"
        ],
        "createdDate": "string",
        "createdBy": "string",
        "lastUpdate": "string",
        "lastUpdateBy": "string",
        "dateCancelled": "string",
        "cancelledByUserId": 8,
        "auditNote": "string"
      },
      {
        "id": 6,
        "seatNumber": 9,
        "fileName": "string",
        "barCode": "string",
        "inventoryId": 8,
        "invoiceLineId": 6,
        "purchaseLineId": 1,
        "section": "string",
        "row": "string",
        "notes": "string",
        "cost": 6,
        "faceValue": 2,
        "sellPrice": 5,
        "stockType": "FLASH",
        "eventId": 4,
        "accountId": 7,
        "status": "AVAILABLE",
        "base64FileBytes": "string",
        "disclosures": [
          "string",
          "string",
          "string",
          "string",
          "string",
          "string",
          "string",
          "string",
          "string"
        ],
        "attributes": [
          "string",
          "string",
          "string",
          "string"
        ],
        "createdDate": "string",
        "createdBy": "string",
        "lastUpdate": "string",
        "lastUpdateBy": "string",
        "dateCancelled": "string",
        "cancelledByUserId": 4,
        "auditNote": "string"
      },
      {
        "id": 7,
        "seatNumber": 3,
        "fileName": "string",
        "barCode": "string",
        "inventoryId": 5,
        "invoiceLineId": 7,
        "purchaseLineId": 4,
        "section": "string",
        "row": "string",
        "notes": "string",
        "cost": 5,
        "faceValue": 2,
        "sellPrice": 9,
        "stockType": "PAPERLESS_CARD",
        "eventId": 9,
        "accountId": 5,
        "status": "CANCELLED",
        "base64FileBytes": "string",
        "disclosures": [
          "string",
          "string",
          "string",
          "string"
        ],
        "attributes": [
          "string",
          "string",
          "string",
          "string",
          "string"
        ],
        "createdDate": "string",
        "createdBy": "string",
        "lastUpdate": "string",
        "lastUpdateBy": "string",
        "dateCancelled": "string",
        "cancelledByUserId": 9,
        "auditNote": "string"
      }
    ],
    "ticketIds": [
      8,
      5,
      7,
      4,
      5
    ],
    "stockType": "ELECTRONIC",
    "splitType": "ANY",
    "customSplit": "string",
    "listPrice": 4,
    "expectedValue": 5,
    "publicNotes": "string",
    "attributes": [
      "string",
      "string",
      "string",
      "string"
    ],
    "status": "AVAILABLE",
    "inHandDaysBeforeEvent": 1,
    "lastPriceUpdate": "string",
    "createdDate": "string",
    "createdBy": "string",
    "lastUpdate": "string",
    "lastUpdateBy": "string",
    "lastDeltaUpdate": "string",
    "version": 2,
    "tags": "string",
    "seatType": "GA",
    "eventMapping": {
      "eventName": "string",
      "venueName": "string",
      "eventDate": "string",
      "valid": true
    },
    "mappingId": 3,
    "exchangePosId": 1,
    "broadcast": false,
    "zoneSeating": false,
    "electronicTransfer": false,
    "optOutAutoPrice": false,
    "hideSeatNumbers": true,
    "vsrOption": "EVENT_INVENTORY",
    "replenishmentGroupId": 10,
    "replenishmentGroup": "string",
    "shownQuantity": 5,
    "ticketsMerged": false,
    "ticketsSplit": true,
    "auditNote": "string",
    "filesUploaded": false,
    "barCodesEntered": true,
    "seatNumbers": "string",
    "listed": true,
    "consignmentStatus": "string",
    "cooperative": true,
    "holdId": 3,
    "hold": {
      "id": 7,
      "accountId": 3,
      "inventoryId": 6,
      "user": "string",
      "userId": 10,
      "removedByUserId": 9,
      "createdDate": "string",
      "expiryDate": "string",
      "customerId": 7,
      "removedDate": "string",
      "notes": "string",
      "externalRef": "string",
      "quantity": 10,
      "section": "string",
      "row": "string",
      "seats": "string",
      "cost": 10,
      "listPrice": 7,
      "eventId": 5
    },
    "unitCostAverage": 10,
    "faceValueAverage": 8,
    "currencies": [
      "GBP",
      "GBP",
      "GBP",
      "AUD",
      "XBT",
      "BRL"
    ],
    "received": "string",
    "vendorId": [
      9,
      6,
      5,
      9,
      9,
      1
    ],
    "inHand": false,
    "daysOld": 10,
    "ticketIdString": "string",
    "event": {
      "id": 3,
      "name": "string",
      "date": "string",
      "venue": {
        "id": 1,
        "name": "string",
        "address": "string",
        "city": "string",
        "state": "string",
        "country": "string",
        "postalCode": "string",
        "phone": "string",
        "timeZone": {
          "fixed": true,
          "id": "string"
        }
      },
      "performerId": 4,
      "performer": {
        "id": 9,
        "name": "string",
        "eventType": "CONCERT",
        "category": {
          "id": 3,
          "name": "string",
          "eventType": "OTHER"
        }
      },
      "keywords": "string",
      "chartUrl": "string",
      "stubhubEventId": 2,
      "stubhubEventUrl": "string",
      "tags": "string",
      "notes": "string",
      "eiEventId": 9,
      "optOutReplenishment": true,
      "ticketCount": 5,
      "mySoldTickets": 4,
      "disabled": true,
      "vividSeatsEventUrl": "string"
    }
  },
  {
    "inHandDate": "string",
    "id": 10,
    "accountId": 1,
    "eventId": 10,
    "quantity": 5,
    "notes": "string",
    "section": "string",
    "row": "string",
    "secondRow": "string",
    "lowSeat": 8,
    "highSeat": 3,
    "cost": 5,
    "faceValue": 1,
    "tickets": [
      {
        "id": 1,
        "seatNumber": 4,
        "fileName": "string",
        "barCode": "string",
        "inventoryId": 10,
        "invoiceLineId": 1,
        "purchaseLineId": 3,
        "section": "string",
        "row": "string",
        "notes": "string",
        "cost": 2,
        "faceValue": 5,
        "sellPrice": 10,
        "stockType": "FLASH",
        "eventId": 7,
        "accountId": 9,
        "status": "AVAILABLE",
        "base64FileBytes": "string",
        "disclosures": [
          "string",
          "string",
          "string",
          "string",
          "string"
        ],
        "attributes": [
          "string",
          "string",
          "string"
        ],
        "createdDate": "string",
        "createdBy": "string",
        "lastUpdate": "string",
        "lastUpdateBy": "string",
        "dateCancelled": "string",
        "cancelledByUserId": 1,
        "auditNote": "string"
      },
      {
        "id": 8,
        "seatNumber": 6,
        "fileName": "string",
        "barCode": "string",
        "inventoryId": 7,
        "invoiceLineId": 4,
        "purchaseLineId": 9,
        "section": "string",
        "row": "string",
        "notes": "string",
        "cost": 4,
        "faceValue": 1,
        "sellPrice": 6,
        "stockType": "PAPERLESS",
        "eventId": 7,
        "accountId": 6,
        "status": "SOLD",
        "base64FileBytes": "string",
        "disclosures": [
          "string",
          "string",
          "string",
          "string",
          "string",
          "string"
        ],
        "attributes": [
          "string",
          "string",
          "string",
          "string",
          "string",
          "string",
          "string",
          "string",
          "string"
        ],
        "createdDate": "string",
        "createdBy": "string",
        "lastUpdate": "string",
        "lastUpdateBy": "string",
        "dateCancelled": "string",
        "cancelledByUserId": 9,
        "auditNote": "string"
      },
      {
        "id": 6,
        "seatNumber": 5,
        "fileName": "string",
        "barCode": "string",
        "inventoryId": 3,
        "invoiceLineId": 7,
        "purchaseLineId": 5,
        "section": "string",
        "row": "string",
        "notes": "string",
        "cost": 1,
        "faceValue": 1,
        "sellPrice": 1,
        "stockType": "MOBILE_TRANSFER",
        "eventId": 4,
        "accountId": 10,
        "status": "AVAILABLE",
        "base64FileBytes": "string",
        "disclosures": [
          "string",
          "string",
          "string",
          "string",
          "string",
          "string",
          "string",
          "string",
          "string",
          "string"
        ],
        "attributes": [
          "string",
          "string",
          "string",
          "string",
          "string",
          "string",
          "string",
          "string",
          "string"
        ],
        "createdDate": "string",
        "createdBy": "string",
        "lastUpdate": "string",
        "lastUpdateBy": "string",
        "dateCancelled": "string",
        "cancelledByUserId": 3,
        "auditNote": "string"
      },
      {
        "id": 1,
        "seatNumber": 7,
        "fileName": "string",
        "barCode": "string",
        "inventoryId": 10,
        "invoiceLineId": 10,
        "purchaseLineId": 4,
        "section": "string",
        "row": "string",
        "notes": "string",
        "cost": 1,
        "faceValue": 8,
        "sellPrice": 3,
        "stockType": "PAPERLESS",
        "eventId": 7,
        "accountId": 9,
        "status": "CANCELLED",
        "base64FileBytes": "string",
        "disclosures": [
          "string",
          "string",
          "string",
          "string",
          "string"
        ],
        "attributes": [
          "string",
          "string",
          "string",
          "string",
          "string",
          "string",
          "string",
          "string",
          "string"
        ],
        "createdDate": "string",
        "createdBy": "string",
        "lastUpdate": "string",
        "lastUpdateBy": "string",
        "dateCancelled": "string",
        "cancelledByUserId": 3,
        "auditNote": "string"
      },
      {
        "id": 3,
        "seatNumber": 7,
        "fileName": "string",
        "barCode": "string",
        "inventoryId": 2,
        "invoiceLineId": 5,
        "purchaseLineId": 5,
        "section": "string",
        "row": "string",
        "notes": "string",
        "cost": 3,
        "faceValue": 2,
        "sellPrice": 1,
        "stockType": "MOBILE_TRANSFER",
        "eventId": 3,
        "accountId": 3,
        "status": "SOLD",
        "base64FileBytes": "string",
        "disclosures": [
          "string"
        ],
        "attributes": [
          "string",
          "string",
          "string",
          "string",
          "string"
        ],
        "createdDate": "string",
        "createdBy": "string",
        "lastUpdate": "string",
        "lastUpdateBy": "string",
        "dateCancelled": "string",
        "cancelledByUserId": 5,
        "auditNote": "string"
      },
      {
        "id": 7,
        "seatNumber": 5,
        "fileName": "string",
        "barCode": "string",
        "inventoryId": 4,
        "invoiceLineId": 6,
        "purchaseLineId": 9,
        "section": "string",
        "row": "string",
        "notes": "string",
        "cost": 3,
        "faceValue": 4,
        "sellPrice": 3,
        "stockType": "ELECTRONIC",
        "eventId": 8,
        "accountId": 3,
        "status": "CANCELLED",
        "base64FileBytes": "string",
        "disclosures": [
          "string",
          "string",
          "string",
          "string",
          "string",
          "string",
          "string",
          "string",
          "string"
        ],
        "attributes": [
          "string"
        ],
        "createdDate": "string",
        "createdBy": "string",
        "lastUpdate": "string",
        "lastUpdateBy": "string",
        "dateCancelled": "string",
        "cancelledByUserId": 1,
        "auditNote": "string"
      },
      {
        "id": 9,
        "seatNumber": 9,
        "fileName": "string",
        "barCode": "string",
        "inventoryId": 3,
        "invoiceLineId": 8,
        "purchaseLineId": 3,
        "section": "string",
        "row": "string",
        "notes": "string",
        "cost": 9,
        "faceValue": 2,
        "sellPrice": 7,
        "stockType": "HARD",
        "eventId": 1,
        "accountId": 5,
        "status": "AVAILABLE",
        "base64FileBytes": "string",
        "disclosures": [
          "string",
          "string",
          "string",
          "string"
        ],
        "attributes": [
          "string"
        ],
        "createdDate": "string",
        "createdBy": "string",
        "lastUpdate": "string",
        "lastUpdateBy": "string",
        "dateCancelled": "string",
        "cancelledByUserId": 10,
        "auditNote": "string"
      },
      {
        "id": 5,
        "seatNumber": 4,
        "fileName": "string",
        "barCode": "string",
        "inventoryId": 10,
        "invoiceLineId": 7,
        "purchaseLineId": 1,
        "section": "string",
        "row": "string",
        "notes": "string",
        "cost": 10,
        "faceValue": 3,
        "sellPrice": 2,
        "stockType": "PAPERLESS",
        "eventId": 7,
        "accountId": 6,
        "status": "CANCELLED",
        "base64FileBytes": "string",
        "disclosures": [
          "string",
          "string",
          "string",
          "string",
          "string",
          "string",
          "string",
          "string",
          "string"
        ],
        "attributes": [
          "string",
          "string",
          "string",
          "string",
          "string",
          "string"
        ],
        "createdDate": "string",
        "createdBy": "string",
        "lastUpdate": "string",
        "lastUpdateBy": "string",
        "dateCancelled": "string",
        "cancelledByUserId": 3,
        "auditNote": "string"
      },
      {
        "id": 7,
        "seatNumber": 10,
        "fileName": "string",
        "barCode": "string",
        "inventoryId": 4,
        "invoiceLineId": 1,
        "purchaseLineId": 8,
        "section": "string",
        "row": "string",
        "notes": "string",
        "cost": 2,
        "faceValue": 1,
        "sellPrice": 3,
        "stockType": "PAPERLESS",
        "eventId": 7,
        "accountId": 7,
        "status": "AVAILABLE",
        "base64FileBytes": "string",
        "disclosures": [
          "string",
          "string",
          "string",
          "string",
          "string",
          "string",
          "string"
        ],
        "attributes": [
          "string"
        ],
        "createdDate": "string",
        "createdBy": "string",
        "lastUpdate": "string",
        "lastUpdateBy": "string",
        "dateCancelled": "string",
        "cancelledByUserId": 3,
        "auditNote": "string"
      }
    ],
    "ticketIds": [
      6,
      8
    ],
    "stockType": "MOBILE_SCREENCAP",
    "splitType": "ANY",
    "customSplit": "string",
    "listPrice": 8,
    "expectedValue": 10,
    "publicNotes": "string",
    "attributes": [
      "string",
      "string",
      "string"
    ],
    "status": "DEPLETED",
    "inHandDaysBeforeEvent": 3,
    "lastPriceUpdate": "string",
    "createdDate": "string",
    "createdBy": "string",
    "lastUpdate": "string",
    "lastUpdateBy": "string",
    "lastDeltaUpdate": "string",
    "version": 3,
    "tags": "string",
    "seatType": "PIGGYBACK",
    "eventMapping": {
      "eventName": "string",
      "venueName": "string",
      "eventDate": "string",
      "valid": true
    },
    "mappingId": 10,
    "exchangePosId": 4,
    "broadcast": true,
    "zoneSeating": true,
    "electronicTransfer": false,
    "optOutAutoPrice": false,
    "hideSeatNumbers": false,
    "vsrOption": "OTHER",
    "replenishmentGroupId": 8,
    "replenishmentGroup": "string",
    "shownQuantity": 3,
    "ticketsMerged": false,
    "ticketsSplit": false,
    "auditNote": "string",
    "filesUploaded": true,
    "barCodesEntered": true,
    "seatNumbers": "string",
    "listed": true,
    "consignmentStatus": "string",
    "cooperative": false,
    "holdId": 7,
    "hold": {
      "id": 3,
      "accountId": 9,
      "inventoryId": 8,
      "user": "string",
      "userId": 6,
      "removedByUserId": 6,
      "createdDate": "string",
      "expiryDate": "string",
      "customerId": 10,
      "removedDate": "string",
      "notes": "string",
      "externalRef": "string",
      "quantity": 2,
      "section": "string",
      "row": "string",
      "seats": "string",
      "cost": 3,
      "listPrice": 4,
      "eventId": 9
    },
    "unitCostAverage": 4,
    "faceValueAverage": 2,
    "currencies": [
      "BRL",
      "CAD",
      "USD"
    ],
    "received": "string",
    "vendorId": [
      2,
      6,
      10
    ],
    "inHand": false,
    "daysOld": 1,
    "ticketIdString": "string",
    "event": {
      "id": 4,
      "name": "string",
      "date": "string",
      "venue": {
        "id": 7,
        "name": "string",
        "address": "string",
        "city": "string",
        "state": "string",
        "country": "string",
        "postalCode": "string",
        "phone": "string",
        "timeZone": {
          "fixed": true,
          "id": "string"
        }
      },
      "performerId": 8,
      "performer": {
        "id": 8,
        "name": "string",
        "eventType": "OTHER",
        "category": {
          "id": 9,
          "name": "string",
          "eventType": "OTHER"
        }
      },
      "keywords": "string",
      "chartUrl": "string",
      "stubhubEventId": 9,
      "stubhubEventUrl": "string",
      "tags": "string",
      "notes": "string",
      "eiEventId": 10,
      "optOutReplenishment": true,
      "ticketCount": 6,
      "mySoldTickets": 9,
      "disabled": true,
      "vividSeatsEventUrl": "string"
    }
  }
]