{
  "actions": [
    {
      "name": "find",
      "protocol": "REST",
      "method": "GET",
      "entitypath": "{base_path}/{version}/webhooks/{pathv1}?{query}",
      "requestSchema": "schema.json",
      "responseSchema": "schema.json",
      "timeout": 0,
      "sendEmpty": false,
      "sendGetBody": false,
      "requestDatatype": "JSON",
      "responseDatatype": "JSON",
      "headers": {},
      "responseObjects": [
        {
          "type": "default",
          "key": "",
          "mockFile": "mockdatafiles/find-default.json"
        }
      ]
    },
    {
      "name": "update13",
      "protocol": "REST",
      "method": "PUT",
      "entitypath": "{base_path}/{version}/webhooks/{pathv1}?{query}",
      "requestSchema": "schema.json",
      "responseSchema": "schema.json",
      "timeout": 0,
      "sendEmpty": false,
      "sendGetBody": false,
      "requestDatatype": "JSON",
      "responseDatatype": "JSON",
      "headers": {},
      "responseObjects": [
        {
          "type": "default",
          "key": "",
          "mockFile": "mockdatafiles/update13-default.json"
        }
      ]
    },
    {
      "name": "delete10",
      "protocol": "REST",
      "method": "DELETE",
      "entitypath": "{base_path}/{version}/webhooks/{pathv1}?{query}",
      "requestSchema": "schema.json",
      "responseSchema": "schema.json",
      "timeout": 0,
      "sendEmpty": false,
      "sendGetBody": false,
      "requestDatatype": "JSON",
      "responseDatatype": "JSON",
      "headers": {},
      "responseObjects": [
        {
          "type": "default",
          "key": "",
          "mockFile": ""
        }
      ]
    },
    {
      "name": "query1",
      "protocol": "REST",
      "method": "GET",
      "entitypath": "{base_path}/{version}/webhooks?{query}",
      "requestSchema": "schema.json",
      "responseSchema": "schema.json",
      "timeout": 0,
      "sendEmpty": false,
      "sendGetBody": false,
      "requestDatatype": "JSON",
      "responseDatatype": "JSON",
      "headers": {},
      "responseObjects": [
        {
          "type": "default",
          "key": "",
          "mockFile": "mockdatafiles/query1-default.json"
        }
      ]
    },
    {
      "name": "create1",
      "protocol": "REST",
      "method": "POST",
      "entitypath": "{base_path}/{version}/webhooks?{query}",
      "requestSchema": "schema.json",
      "responseSchema": "schema.json",
      "timeout": 0,
      "sendEmpty": false,
      "sendGetBody": false,
      "requestDatatype": "JSON",
      "responseDatatype": "JSON",
      "headers": {},
      "responseObjects": [
        {
          "type": "default",
          "key": "",
          "mockFile": "mockdatafiles/create1-default.json"
        }
      ]
    }
  ]
}