[
  {
    "id": 1,
    "accountId": 4,
    "scheduleId": 7,
    "reportId": 1,
    "filters": [
      {
        "name": "string",
        "label": "string",
        "labelValue": "string",
        "value": {},
        "type": "BOOLEAN",
        "gmt": false
      },
      {
        "name": "string",
        "label": "string",
        "labelValue": "string",
        "value": {},
        "type": "CUSTOMER",
        "gmt": true
      },
      {
        "name": "string",
        "label": "string",
        "labelValue": "string",
        "value": {},
        "type": "CUSTOMER",
        "gmt": true
      },
      {
        "name": "string",
        "label": "string",
        "labelValue": "string",
        "value": {},
        "type": "BOOLEAN",
        "gmt": false
      },
      {
        "name": "string",
        "label": "string",
        "labelValue": "string",
        "value": {},
        "type": "BOOLEAN",
        "gmt": false
      },
      {
        "name": "string",
        "label": "string",
        "labelValue": "string",
        "value": {},
        "type": "DAYOFWEEK",
        "gmt": false
      },
      {
        "name": "string",
        "label": "string",
        "labelValue": "string",
        "value": {},
        "type": "TAGS",
        "gmt": false
      },
      {
        "name": "string",
        "label": "string",
        "labelValue": "string",
        "value": {},
        "type": "TAGS",
        "gmt": false
      }
    ],
    "assetName": "string",
    "createdDate": "string",
    "scheduledDate": "string",
    "number": 10,
    "notes": "string",
    "notificationEmails": [
      "string",
      "string",
      "string",
      "string",
      "string",
      "string",
      "string",
      "string",
      "string"
    ]
  },
  {
    "id": 4,
    "accountId": 9,
    "scheduleId": 1,
    "reportId": 1,
    "filters": [
      {
        "name": "string",
        "label": "string",
        "labelValue": "string",
        "value": {},
        "type": "DATERANGE",
        "gmt": false
      },
      {
        "name": "string",
        "label": "string",
        "labelValue": "string",
        "value": {},
        "type": "CATEGORY",
        "gmt": true
      }
    ],
    "assetName": "string",
    "createdDate": "string",
    "scheduledDate": "string",
    "number": 8,
    "notes": "string",
    "notificationEmails": [
      "string"
    ]
  },
  {
    "id": 9,
    "accountId": 1,
    "scheduleId": 2,
    "reportId": 10,
    "filters": [
      {
        "name": "string",
        "label": "string",
        "labelValue": "string",
        "value": {},
        "type": "BOOLEAN",
        "gmt": true
      },
      {
        "name": "string",
        "label": "string",
        "labelValue": "string",
        "value": {},
        "type": "USER",
        "gmt": true
      },
      {
        "name": "string",
        "label": "string",
        "labelValue": "string",
        "value": {},
        "type": "USER",
        "gmt": true
      },
      {
        "name": "string",
        "label": "string",
        "labelValue": "string",
        "value": {},
        "type": "PERFORMER",
        "gmt": false
      },
      {
        "name": "string",
        "label": "string",
        "labelValue": "string",
        "value": {},
        "type": "USER",
        "gmt": false
      }
    ],
    "assetName": "string",
    "createdDate": "string",
    "scheduledDate": "string",
    "number": 4,
    "notes": "string",
    "notificationEmails": [
      "string",
      "string",
      "string",
      "string",
      "string",
      "string",
      "string"
    ]
  },
  {
    "id": 5,
    "accountId": 3,
    "scheduleId": 10,
    "reportId": 4,
    "filters": [
      {
        "name": "string",
        "label": "string",
        "labelValue": "string",
        "value": {},
        "type": "CATEGORY",
        "gmt": true
      }
    ],
    "assetName": "string",
    "createdDate": "string",
    "scheduledDate": "string",
    "number": 1,
    "notes": "string",
    "notificationEmails": [
      "string",
      "string",
      "string",
      "string"
    ]
  }
]