{
  "id": 3,
  "accountId": 1,
  "cardType": "MASTERCARD",
  "lastFourDigits": 8,
  "externalId": "string",
  "customerExternalId": "string",
  "addressExternalId": "string",
  "cardholderName": "string",
  "expirationMonth": 2,
  "expirationYear": 2,
  "customerId": 4,
  "defaultCard": false,
  "lastDateUsed": "string"
}