{
  "inHandDate": "string",
  "id": 3,
  "accountId": 1,
  "eventId": 9,
  "quantity": 10,
  "notes": "string",
  "section": "string",
  "row": "string",
  "secondRow": "string",
  "lowSeat": 6,
  "highSeat": 1,
  "cost": 6,
  "faceValue": 4,
  "tickets": [
    {
      "id": 8,
      "seatNumber": 7,
      "fileName": "string",
      "barCode": "string",
      "inventoryId": 9,
      "invoiceLineId": 8,
      "purchaseLineId": 9,
      "section": "string",
      "row": "string",
      "notes": "string",
      "cost": 3,
      "faceValue": 9,
      "sellPrice": 3,
      "stockType": "MOBILE_TRANSFER",
      "eventId": 6,
      "accountId": 2,
      "status": "SOLD",
      "base64FileBytes": "string",
      "disclosures": [
        "string",
        "string",
        "string"
      ],
      "attributes": [
        "string",
        "string",
        "string"
      ],
      "createdDate": "string",
      "createdBy": "string",
      "lastUpdate": "string",
      "lastUpdateBy": "string",
      "dateCancelled": "string",
      "cancelledByUserId": 6,
      "auditNote": "string"
    },
    {
      "id": 2,
      "seatNumber": 1,
      "fileName": "string",
      "barCode": "string",
      "inventoryId": 5,
      "invoiceLineId": 3,
      "purchaseLineId": 10,
      "section": "string",
      "row": "string",
      "notes": "string",
      "cost": 6,
      "faceValue": 5,
      "sellPrice": 6,
      "stockType": "HARD",
      "eventId": 2,
      "accountId": 4,
      "status": "AVAILABLE",
      "base64FileBytes": "string",
      "disclosures": [
        "string",
        "string",
        "string",
        "string",
        "string",
        "string",
        "string"
      ],
      "attributes": [
        "string",
        "string"
      ],
      "createdDate": "string",
      "createdBy": "string",
      "lastUpdate": "string",
      "lastUpdateBy": "string",
      "dateCancelled": "string",
      "cancelledByUserId": 6,
      "auditNote": "string"
    },
    {
      "id": 7,
      "seatNumber": 2,
      "fileName": "string",
      "barCode": "string",
      "inventoryId": 8,
      "invoiceLineId": 4,
      "purchaseLineId": 9,
      "section": "string",
      "row": "string",
      "notes": "string",
      "cost": 5,
      "faceValue": 4,
      "sellPrice": 6,
      "stockType": "FLASH",
      "eventId": 9,
      "accountId": 3,
      "status": "AVAILABLE",
      "base64FileBytes": "string",
      "disclosures": [
        "string",
        "string",
        "string",
        "string",
        "string",
        "string",
        "string",
        "string",
        "string"
      ],
      "attributes": [
        "string",
        "string",
        "string",
        "string",
        "string",
        "string",
        "string",
        "string",
        "string",
        "string"
      ],
      "createdDate": "string",
      "createdBy": "string",
      "lastUpdate": "string",
      "lastUpdateBy": "string",
      "dateCancelled": "string",
      "cancelledByUserId": 9,
      "auditNote": "string"
    }
  ],
  "ticketIds": [
    1,
    1,
    3
  ],
  "stockType": "PAPERLESS",
  "splitType": "CUSTOM",
  "customSplit": "string",
  "listPrice": 4,
  "expectedValue": 7,
  "publicNotes": "string",
  "attributes": [
    "string",
    "string"
  ],
  "status": "AVAILABLE",
  "inHandDaysBeforeEvent": 5,
  "lastPriceUpdate": "string",
  "createdDate": "string",
  "createdBy": "string",
  "lastUpdate": "string",
  "lastUpdateBy": "string",
  "lastDeltaUpdate": "string",
  "version": 8,
  "tags": "string",
  "seatType": "PIGGYBACK",
  "eventMapping": {
    "eventName": "string",
    "venueName": "string",
    "eventDate": "string",
    "valid": true
  },
  "mappingId": 5,
  "exchangePosId": 8,
  "broadcast": false,
  "zoneSeating": false,
  "electronicTransfer": true,
  "optOutAutoPrice": false,
  "hideSeatNumbers": false,
  "vsrOption": "NONE",
  "replenishmentGroupId": 1,
  "replenishmentGroup": "string",
  "shownQuantity": 2,
  "ticketsMerged": false,
  "ticketsSplit": true,
  "auditNote": "string",
  "filesUploaded": true,
  "barCodesEntered": false
}