{
  "id": 9,
  "accountId": 5,
  "targetId": 2,
  "quantity": 7,
  "description": "string",
  "amount": 3,
  "lineType": "PURCHASE",
  "lineItemType": "INVENTORY",
  "itemIds": [
    4,
    2,
    6,
    9,
    2,
    9,
    8,
    2,
    5,
    10
  ],
  "inventory": {
    "inHandDate": "string",
    "id": 10,
    "accountId": 3,
    "eventId": 2,
    "quantity": 3,
    "notes": "string",
    "section": "string",
    "row": "string",
    "secondRow": "string",
    "lowSeat": 9,
    "highSeat": 6,
    "cost": 7,
    "faceValue": 5,
    "tickets": [
      {
        "id": 5,
        "seatNumber": 8,
        "fileName": "string",
        "barCode": "string",
        "inventoryId": 8,
        "invoiceLineId": 5,
        "purchaseLineId": 7,
        "section": "string",
        "row": "string",
        "notes": "string",
        "cost": 4,
        "faceValue": 8,
        "sellPrice": 8,
        "stockType": "PAPERLESS_CARD",
        "eventId": 3,
        "accountId": 3,
        "status": "CANCELLED",
        "base64FileBytes": "string",
        "disclosures": [
          "string",
          "string",
          "string",
          "string",
          "string",
          "string",
          "string",
          "string",
          "string"
        ],
        "attributes": [
          "string",
          "string",
          "string",
          "string",
          "string",
          "string",
          "string",
          "string"
        ],
        "createdDate": "string",
        "createdBy": "string",
        "lastUpdate": "string",
        "lastUpdateBy": "string",
        "dateCancelled": "string",
        "cancelledByUserId": 8,
        "auditNote": "string"
      }
    ],
    "ticketIds": [
      10,
      3,
      7,
      3,
      9,
      3,
      1,
      4,
      2
    ],
    "stockType": "HARD",
    "splitType": "ANY",
    "customSplit": "string",
    "listPrice": 7,
    "expectedValue": 1,
    "publicNotes": "string",
    "attributes": [
      "string",
      "string",
      "string",
      "string",
      "string",
      "string"
    ],
    "status": "ON_HOLD",
    "inHandDaysBeforeEvent": 1,
    "lastPriceUpdate": "string",
    "createdDate": "string",
    "createdBy": "string",
    "lastUpdate": "string",
    "lastUpdateBy": "string",
    "lastDeltaUpdate": "string",
    "version": 6,
    "tags": "string",
    "seatType": "GA",
    "eventMapping": {
      "eventName": "string",
      "venueName": "string",
      "eventDate": "string",
      "valid": true
    },
    "mappingId": 2,
    "exchangePosId": 10,
    "broadcast": false,
    "zoneSeating": false,
    "electronicTransfer": true,
    "optOutAutoPrice": true,
    "hideSeatNumbers": false,
    "vsrOption": "NONE",
    "replenishmentGroupId": 9,
    "replenishmentGroup": "string",
    "shownQuantity": 5,
    "ticketsMerged": true,
    "ticketsSplit": false,
    "auditNote": "string",
    "filesUploaded": true,
    "barCodesEntered": false
  },
  "cancelled": false,
  "delete": true,
  "cancel": false,
  "fillLineId": 7,
  "inventoryIds": [
    9,
    10,
    5
  ],
  "createdDate": "string",
  "createdBy": "string",
  "lastUpdate": "string",
  "lastUpdateBy": "string"
}