{
  "$id": "schema.json",
  "type": "object",
  "schema": "http://json-schema.org/draft-07/schema#",
  "translate": true,
  "dynamicfields": true,
  "properties": {
    "ph_request_type": {
      "type": "string",
      "description": "type of request (internal to adapter)",
      "default": "getById3",
      "enum": [
        "getById3",
        "update4",
        "getDefaultsById",
        "update3",
        "removeTag",
        "getCards",
        "removeCard",
        "getCards1",
        "addCard",
        "setDefaultCard",
        "bulkRemoveTags",
        "tag",
        "update2",
        "delete1",
        "search1",
        "insert2"
      ],
      "external_name": "ph_request_type"
    },
    "customerId": {
      "type": "number",
      "description": "The customer Id",
      "parse": false,
      "encode": false,
      "encrypt": {
        "type": "AES",
        "key": ""
      },
      "external_name": "customer-id"
    },
    "cardId": {
      "type": "number",
      "description": "The card id associated to the customer",
      "parse": false,
      "encode": false,
      "encrypt": {
        "type": "AES",
        "key": ""
      },
      "external_name": "card-id"
    }
  },
  "definitions": {}
}