{
  "id": 8,
  "accountId": 10,
  "inventoryId": 1,
  "user": "string",
  "userId": 8,
  "removedByUserId": 8,
  "createdDate": "string",
  "expiryDate": "string",
  "customerId": 5,
  "removedDate": "string",
  "notes": "string",
  "externalRef": "string",
  "quantity": 7,
  "section": "string",
  "row": "string",
  "seats": "string",
  "cost": 5,
  "listPrice": 1,
  "eventId": 2
}