[
  {
    "id": 3,
    "name": "string",
    "address": "string",
    "city": "string",
    "state": "string",
    "country": "string",
    "postalCode": "string",
    "phone": "string",
    "timeZone": {
      "fixed": true,
      "id": "string"
    }
  },
  {
    "id": 7,
    "name": "string",
    "address": "string",
    "city": "string",
    "state": "string",
    "country": "string",
    "postalCode": "string",
    "phone": "string",
    "timeZone": {
      "fixed": false,
      "id": "string"
    }
  },
  {
    "id": 4,
    "name": "string",
    "address": "string",
    "city": "string",
    "state": "string",
    "country": "string",
    "postalCode": "string",
    "phone": "string",
    "timeZone": {
      "fixed": true,
      "id": "string"
    }
  }
]