{
  "inHandDate": "string",
  "id": 5,
  "accountId": 9,
  "eventId": 1,
  "quantity": 10,
  "notes": "string",
  "section": "string",
  "row": "string",
  "secondRow": "string",
  "lowSeat": 5,
  "highSeat": 2,
  "cost": 1,
  "faceValue": 5,
  "tickets": [
    {
      "id": 2,
      "seatNumber": 1,
      "fileName": "string",
      "barCode": "string",
      "inventoryId": 5,
      "invoiceLineId": 10,
      "purchaseLineId": 5,
      "section": "string",
      "row": "string",
      "notes": "string",
      "cost": 2,
      "faceValue": 6,
      "sellPrice": 6,
      "stockType": "FLASH",
      "eventId": 3,
      "accountId": 8,
      "status": "SOLD",
      "base64FileBytes": "string",
      "disclosures": [
        "string",
        "string",
        "string",
        "string",
        "string",
        "string",
        "string",
        "string",
        "string"
      ],
      "attributes": [
        "string",
        "string",
        "string"
      ],
      "createdDate": "string",
      "createdBy": "string",
      "lastUpdate": "string",
      "lastUpdateBy": "string",
      "dateCancelled": "string",
      "cancelledByUserId": 10,
      "auditNote": "string"
    }
  ],
  "ticketIds": [
    7,
    4,
    3,
    1
  ],
  "stockType": "PAPERLESS",
  "splitType": "NEVERLEAVEONE",
  "customSplit": "string",
  "listPrice": 5,
  "expectedValue": 1,
  "publicNotes": "string",
  "attributes": [
    "string",
    "string"
  ],
  "status": "DEPLETED",
  "inHandDaysBeforeEvent": 8,
  "lastPriceUpdate": "string",
  "createdDate": "string",
  "createdBy": "string",
  "lastUpdate": "string",
  "lastUpdateBy": "string",
  "lastDeltaUpdate": "string",
  "version": 2,
  "tags": "string",
  "seatType": "PIGGYBACK",
  "eventMapping": {
    "eventName": "string",
    "venueName": "string",
    "eventDate": "string",
    "valid": true
  },
  "mappingId": 2,
  "exchangePosId": 10,
  "broadcast": true,
  "zoneSeating": true,
  "electronicTransfer": true,
  "optOutAutoPrice": false,
  "hideSeatNumbers": false,
  "vsrOption": "NONE",
  "replenishmentGroupId": 10,
  "replenishmentGroup": "string",
  "shownQuantity": 10,
  "ticketsMerged": false,
  "ticketsSplit": false,
  "auditNote": "string",
  "filesUploaded": false,
  "barCodesEntered": false
}