[
  {
    "email": "string",
    "id": 5,
    "action": "UPDATE",
    "price": 8,
    "dateOfAction": "string"
  },
  {
    "email": "string",
    "id": 2,
    "action": "CANCEL",
    "price": 6,
    "dateOfAction": "string"
  },
  {
    "email": "string",
    "id": 6,
    "action": "CANCEL",
    "price": 3,
    "dateOfAction": "string"
  }
]