[
  {
    "inHandDate": "string",
    "id": 2,
    "accountId": 4,
    "eventId": 7,
    "quantity": 10,
    "notes": "string",
    "section": "string",
    "row": "string",
    "secondRow": "string",
    "lowSeat": 2,
    "highSeat": 4,
    "cost": 5,
    "faceValue": 10,
    "tickets": [
      {
        "id": 8,
        "seatNumber": 5,
        "fileName": "string",
        "barCode": "string",
        "inventoryId": 6,
        "invoiceLineId": 8,
        "purchaseLineId": 5,
        "section": "string",
        "row": "string",
        "notes": "string",
        "cost": 5,
        "faceValue": 7,
        "sellPrice": 10,
        "stockType": "PAPERLESS_CARD",
        "eventId": 9,
        "accountId": 7,
        "status": "CANCELLED",
        "base64FileBytes": "string",
        "disclosures": [
          "string",
          "string",
          "string",
          "string",
          "string"
        ],
        "attributes": [
          "string",
          "string",
          "string",
          "string",
          "string",
          "string",
          "string"
        ],
        "createdDate": "string",
        "createdBy": "string",
        "lastUpdate": "string",
        "lastUpdateBy": "string",
        "dateCancelled": "string",
        "cancelledByUserId": 6,
        "auditNote": "string"
      },
      {
        "id": 1,
        "seatNumber": 1,
        "fileName": "string",
        "barCode": "string",
        "inventoryId": 9,
        "invoiceLineId": 9,
        "purchaseLineId": 8,
        "section": "string",
        "row": "string",
        "notes": "string",
        "cost": 5,
        "faceValue": 1,
        "sellPrice": 9,
        "stockType": "MOBILE_TRANSFER",
        "eventId": 1,
        "accountId": 7,
        "status": "AVAILABLE",
        "base64FileBytes": "string",
        "disclosures": [
          "string",
          "string",
          "string",
          "string",
          "string"
        ],
        "attributes": [
          "string",
          "string",
          "string",
          "string",
          "string",
          "string",
          "string"
        ],
        "createdDate": "string",
        "createdBy": "string",
        "lastUpdate": "string",
        "lastUpdateBy": "string",
        "dateCancelled": "string",
        "cancelledByUserId": 5,
        "auditNote": "string"
      },
      {
        "id": 4,
        "seatNumber": 9,
        "fileName": "string",
        "barCode": "string",
        "inventoryId": 6,
        "invoiceLineId": 9,
        "purchaseLineId": 2,
        "section": "string",
        "row": "string",
        "notes": "string",
        "cost": 4,
        "faceValue": 9,
        "sellPrice": 4,
        "stockType": "ELECTRONIC",
        "eventId": 7,
        "accountId": 10,
        "status": "AVAILABLE",
        "base64FileBytes": "string",
        "disclosures": [
          "string",
          "string",
          "string",
          "string",
          "string",
          "string",
          "string",
          "string",
          "string"
        ],
        "attributes": [
          "string",
          "string",
          "string",
          "string",
          "string"
        ],
        "createdDate": "string",
        "createdBy": "string",
        "lastUpdate": "string",
        "lastUpdateBy": "string",
        "dateCancelled": "string",
        "cancelledByUserId": 4,
        "auditNote": "string"
      },
      {
        "id": 1,
        "seatNumber": 4,
        "fileName": "string",
        "barCode": "string",
        "inventoryId": 8,
        "invoiceLineId": 1,
        "purchaseLineId": 5,
        "section": "string",
        "row": "string",
        "notes": "string",
        "cost": 5,
        "faceValue": 10,
        "sellPrice": 10,
        "stockType": "FLASH",
        "eventId": 4,
        "accountId": 2,
        "status": "AVAILABLE",
        "base64FileBytes": "string",
        "disclosures": [
          "string",
          "string",
          "string",
          "string",
          "string",
          "string",
          "string",
          "string"
        ],
        "attributes": [
          "string"
        ],
        "createdDate": "string",
        "createdBy": "string",
        "lastUpdate": "string",
        "lastUpdateBy": "string",
        "dateCancelled": "string",
        "cancelledByUserId": 7,
        "auditNote": "string"
      }
    ],
    "ticketIds": [
      5,
      9,
      8,
      2,
      8,
      5,
      2,
      2,
      5
    ],
    "stockType": "MOBILE_TRANSFER",
    "splitType": "NEVERLEAVEONE",
    "customSplit": "string",
    "listPrice": 2,
    "expectedValue": 8,
    "publicNotes": "string",
    "attributes": [
      "string",
      "string",
      "string",
      "string",
      "string",
      "string",
      "string",
      "string"
    ],
    "status": "AVAILABLE",
    "inHandDaysBeforeEvent": 10,
    "lastPriceUpdate": "string",
    "createdDate": "string",
    "createdBy": "string",
    "lastUpdate": "string",
    "lastUpdateBy": "string",
    "lastDeltaUpdate": "string",
    "version": 8,
    "tags": "string",
    "seatType": "ALTERNATING",
    "eventMapping": {
      "eventName": "string",
      "venueName": "string",
      "eventDate": "string",
      "valid": false
    },
    "mappingId": 3,
    "exchangePosId": 3,
    "broadcast": false,
    "zoneSeating": false,
    "electronicTransfer": true,
    "optOutAutoPrice": true,
    "hideSeatNumbers": true,
    "vsrOption": "NONE",
    "replenishmentGroupId": 6,
    "replenishmentGroup": "string",
    "shownQuantity": 6,
    "ticketsMerged": true,
    "ticketsSplit": true,
    "auditNote": "string",
    "filesUploaded": false,
    "barCodesEntered": true
  },
  {
    "inHandDate": "string",
    "id": 6,
    "accountId": 3,
    "eventId": 9,
    "quantity": 4,
    "notes": "string",
    "section": "string",
    "row": "string",
    "secondRow": "string",
    "lowSeat": 5,
    "highSeat": 7,
    "cost": 10,
    "faceValue": 9,
    "tickets": [
      {
        "id": 9,
        "seatNumber": 3,
        "fileName": "string",
        "barCode": "string",
        "inventoryId": 6,
        "invoiceLineId": 1,
        "purchaseLineId": 7,
        "section": "string",
        "row": "string",
        "notes": "string",
        "cost": 6,
        "faceValue": 9,
        "sellPrice": 6,
        "stockType": "PAPERLESS",
        "eventId": 10,
        "accountId": 7,
        "status": "CANCELLED",
        "base64FileBytes": "string",
        "disclosures": [
          "string",
          "string",
          "string",
          "string",
          "string"
        ],
        "attributes": [
          "string"
        ],
        "createdDate": "string",
        "createdBy": "string",
        "lastUpdate": "string",
        "lastUpdateBy": "string",
        "dateCancelled": "string",
        "cancelledByUserId": 1,
        "auditNote": "string"
      },
      {
        "id": 10,
        "seatNumber": 2,
        "fileName": "string",
        "barCode": "string",
        "inventoryId": 10,
        "invoiceLineId": 4,
        "purchaseLineId": 3,
        "section": "string",
        "row": "string",
        "notes": "string",
        "cost": 8,
        "faceValue": 8,
        "sellPrice": 8,
        "stockType": "MOBILE_TRANSFER",
        "eventId": 10,
        "accountId": 9,
        "status": "AVAILABLE",
        "base64FileBytes": "string",
        "disclosures": [
          "string",
          "string",
          "string",
          "string",
          "string",
          "string",
          "string",
          "string",
          "string"
        ],
        "attributes": [
          "string"
        ],
        "createdDate": "string",
        "createdBy": "string",
        "lastUpdate": "string",
        "lastUpdateBy": "string",
        "dateCancelled": "string",
        "cancelledByUserId": 3,
        "auditNote": "string"
      }
    ],
    "ticketIds": [
      4,
      6,
      7,
      8,
      3,
      7,
      2,
      6,
      10
    ],
    "stockType": "PAPERLESS",
    "splitType": "ANY",
    "customSplit": "string",
    "listPrice": 5,
    "expectedValue": 8,
    "publicNotes": "string",
    "attributes": [
      "string",
      "string",
      "string",
      "string",
      "string"
    ],
    "status": "AVAILABLE",
    "inHandDaysBeforeEvent": 7,
    "lastPriceUpdate": "string",
    "createdDate": "string",
    "createdBy": "string",
    "lastUpdate": "string",
    "lastUpdateBy": "string",
    "lastDeltaUpdate": "string",
    "version": 7,
    "tags": "string",
    "seatType": "CONSECUTIVE",
    "eventMapping": {
      "eventName": "string",
      "venueName": "string",
      "eventDate": "string",
      "valid": false
    },
    "mappingId": 8,
    "exchangePosId": 2,
    "broadcast": false,
    "zoneSeating": false,
    "electronicTransfer": true,
    "optOutAutoPrice": false,
    "hideSeatNumbers": false,
    "vsrOption": "ALL",
    "replenishmentGroupId": 7,
    "replenishmentGroup": "string",
    "shownQuantity": 2,
    "ticketsMerged": true,
    "ticketsSplit": true,
    "auditNote": "string",
    "filesUploaded": true,
    "barCodesEntered": false
  }
]