{
  "id": 5,
  "accountId": 2,
  "createdDate": "string",
  "lastUpdate": "string",
  "lastInvoiceDate": "string",
  "email": "string",
  "email2": "string",
  "useEmail2": true,
  "company": "string",
  "address": {
    "id": 5,
    "accountId": 5,
    "firstName": "string",
    "lastName": "string",
    "company": "string",
    "address1": "string",
    "address2": "string",
    "city": "string",
    "state": "MP",
    "postalCode": "string",
    "country": "string",
    "phone1": "string",
    "phone2": "string",
    "fax": "string"
  },
  "notes": "string",
  "firstName": "string",
  "lastName": "string",
  "title": "string",
  "outlawedPaymentMethods": [
    "VENMO",
    "CREDITCARD",
    "CREDITCARD"
  ],
  "displayName": "string",
  "customerType": "MARKETPLACE",
  "salesTerm": "NET10",
  "paymentMethod": "ACCRUEDCREDIT",
  "arThreshold": 1,
  "deleted": true,
  "tags": "string",
  "outstandingBalance": 4,
  "defaultDeliveryMethod": "UPS"
}