[
  {
    "id": 5,
    "name": "string",
    "date": "string",
    "venue": {
      "id": 1,
      "name": "string",
      "address": "string",
      "city": "string",
      "state": "string",
      "country": "string",
      "postalCode": "string",
      "phone": "string",
      "timeZone": {
        "fixed": false,
        "id": "string"
      }
    },
    "performerId": 5,
    "performer": {
      "id": 9,
      "name": "string",
      "eventType": "SPORT",
      "category": {
        "id": 7,
        "name": "string",
        "eventType": "CONCERT"
      }
    },
    "keywords": "string",
    "chartUrl": "string",
    "stubhubEventId": 9,
    "stubhubEventUrl": "string",
    "tags": "string",
    "notes": "string",
    "eiEventId": 4,
    "optOutReplenishment": true,
    "ticketCount": 8,
    "mySoldTickets": 8,
    "disabled": false,
    "quantity": 7,
    "cost": 1,
    "lastPriceUpdate": "string",
    "listingCount": 10,
    "vividSeatsEventUrl": "string"
  },
  {
    "id": 3,
    "name": "string",
    "date": "string",
    "venue": {
      "id": 8,
      "name": "string",
      "address": "string",
      "city": "string",
      "state": "string",
      "country": "string",
      "postalCode": "string",
      "phone": "string",
      "timeZone": {
        "fixed": true,
        "id": "string"
      }
    },
    "performerId": 10,
    "performer": {
      "id": 1,
      "name": "string",
      "eventType": "THEATER",
      "category": {
        "id": 8,
        "name": "string",
        "eventType": "OTHER"
      }
    },
    "keywords": "string",
    "chartUrl": "string",
    "stubhubEventId": 4,
    "stubhubEventUrl": "string",
    "tags": "string",
    "notes": "string",
    "eiEventId": 4,
    "optOutReplenishment": true,
    "ticketCount": 10,
    "mySoldTickets": 6,
    "disabled": false,
    "quantity": 7,
    "cost": 5,
    "lastPriceUpdate": "string",
    "listingCount": 4,
    "vividSeatsEventUrl": "string"
  },
  {
    "id": 8,
    "name": "string",
    "date": "string",
    "venue": {
      "id": 9,
      "name": "string",
      "address": "string",
      "city": "string",
      "state": "string",
      "country": "string",
      "postalCode": "string",
      "phone": "string",
      "timeZone": {
        "fixed": true,
        "id": "string"
      }
    },
    "performerId": 4,
    "performer": {
      "id": 10,
      "name": "string",
      "eventType": "OTHER",
      "category": {
        "id": 4,
        "name": "string",
        "eventType": "SPORT"
      }
    },
    "keywords": "string",
    "chartUrl": "string",
    "stubhubEventId": 10,
    "stubhubEventUrl": "string",
    "tags": "string",
    "notes": "string",
    "eiEventId": 8,
    "optOutReplenishment": false,
    "ticketCount": 8,
    "mySoldTickets": 4,
    "disabled": false,
    "quantity": 7,
    "cost": 8,
    "lastPriceUpdate": "string",
    "listingCount": 8,
    "vividSeatsEventUrl": "string"
  },
  {
    "id": 4,
    "name": "string",
    "date": "string",
    "venue": {
      "id": 3,
      "name": "string",
      "address": "string",
      "city": "string",
      "state": "string",
      "country": "string",
      "postalCode": "string",
      "phone": "string",
      "timeZone": {
        "fixed": false,
        "id": "string"
      }
    },
    "performerId": 4,
    "performer": {
      "id": 10,
      "name": "string",
      "eventType": "THEATER",
      "category": {
        "id": 6,
        "name": "string",
        "eventType": "OTHER"
      }
    },
    "keywords": "string",
    "chartUrl": "string",
    "stubhubEventId": 6,
    "stubhubEventUrl": "string",
    "tags": "string",
    "notes": "string",
    "eiEventId": 7,
    "optOutReplenishment": false,
    "ticketCount": 2,
    "mySoldTickets": 10,
    "disabled": false,
    "quantity": 1,
    "cost": 6,
    "lastPriceUpdate": "string",
    "listingCount": 5,
    "vividSeatsEventUrl": "string"
  }
]