{
  "id": 1,
  "name": "string",
  "address": "string",
  "city": "string",
  "state": "string",
  "country": "string",
  "postalCode": "string",
  "phone": "string",
  "timeZone": {
    "fixed": false,
    "id": "string"
  }
}