{
  "id": 3,
  "accountId": 10,
  "displayName": "string",
  "marketplace": "TICKET_CITY",
  "username": "string",
  "password": "string",
  "apiKey": "string",
  "integrationProvider": "NONE",
  "lastSweep": "string",
  "creditCardId": 5,
  "creditCardGroupId": 9,
  "encryptedPassword": "string",
  "customerId": 7,
  "vendorId": 2,
  "markup": 7,
  "fee": 7,
  "autoHideSeatNumbers": true,
  "optInStubhubInhandDateLogic": false,
  "optInStubHubTransferDetailsSweep": false,
  "confirmOrders": false
}