[
  {
    "id": 4,
    "tag": "string",
    "tagType": "string",
    "inventoryCount": 2,
    "invoiceCount": 10,
    "poCount": 9,
    "eventCount": 5,
    "customerCount": 2,
    "vendorCount": 7,
    "totalCount": 7
  },
  {
    "id": 1,
    "tag": "string",
    "tagType": "string",
    "inventoryCount": 10,
    "invoiceCount": 9,
    "poCount": 10,
    "eventCount": 7,
    "customerCount": 7,
    "vendorCount": 7,
    "totalCount": 4
  }
]