{
  "actions": [
    {
      "name": "getById5",
      "protocol": "REST",
      "method": "GET",
      "entitypath": "{base_path}/{version}/holds/{pathv1}?{query}",
      "requestSchema": "schema.json",
      "responseSchema": "schema.json",
      "timeout": 0,
      "sendEmpty": false,
      "sendGetBody": false,
      "requestDatatype": "JSON",
      "responseDatatype": "JSON",
      "headers": {},
      "responseObjects": [
        {
          "type": "default",
          "key": "",
          "mockFile": "mockdatafiles/getById5-default.json"
        }
      ]
    },
    {
      "name": "update6",
      "protocol": "REST",
      "method": "PUT",
      "entitypath": "{base_path}/{version}/holds/{pathv1}?{query}",
      "requestSchema": "schema.json",
      "responseSchema": "schema.json",
      "timeout": 0,
      "sendEmpty": false,
      "sendGetBody": false,
      "requestDatatype": "JSON",
      "responseDatatype": "JSON",
      "headers": {},
      "responseObjects": [
        {
          "type": "default",
          "key": "",
          "mockFile": "mockdatafiles/update6-default.json"
        }
      ]
    },
    {
      "name": "deleteById1",
      "protocol": "REST",
      "method": "DELETE",
      "entitypath": "{base_path}/{version}/holds/{pathv1}?{query}",
      "requestSchema": "schema.json",
      "responseSchema": "schema.json",
      "timeout": 0,
      "sendEmpty": false,
      "sendGetBody": false,
      "requestDatatype": "JSON",
      "responseDatatype": "JSON",
      "headers": {},
      "responseObjects": [
        {
          "type": "default",
          "key": "",
          "mockFile": "mockdatafiles/deleteById1-default.json"
        }
      ]
    },
    {
      "name": "search3",
      "protocol": "REST",
      "method": "GET",
      "entitypath": "{base_path}/{version}/holds?{query}",
      "requestSchema": "schema.json",
      "responseSchema": "schema.json",
      "timeout": 0,
      "sendEmpty": false,
      "sendGetBody": false,
      "requestDatatype": "JSON",
      "responseDatatype": "JSON",
      "headers": {},
      "responseObjects": [
        {
          "type": "default",
          "key": "",
          "mockFile": "mockdatafiles/search3-default.json"
        }
      ]
    },
    {
      "name": "insert3",
      "protocol": "REST",
      "method": "POST",
      "entitypath": "{base_path}/{version}/holds?{query}",
      "requestSchema": "schema.json",
      "responseSchema": "schema.json",
      "timeout": 0,
      "sendEmpty": false,
      "sendGetBody": false,
      "requestDatatype": "JSON",
      "responseDatatype": "JSON",
      "headers": {},
      "responseObjects": [
        {
          "type": "default",
          "key": "",
          "mockFile": "mockdatafiles/insert3-default.json"
        }
      ]
    }
  ]
}