{
  "$id": "schema.json",
  "type": "object",
  "schema": "http://json-schema.org/draft-07/schema#",
  "translate": true,
  "dynamicfields": true,
  "properties": {
    "ph_request_type": {
      "type": "string",
      "description": "type of request (internal to adapter)",
      "default": "bulkDelete",
      "enum": [
        "bulkDelete",
        "findPendingById",
        "delete6",
        "getPendingByAccount",
        "resendMappingRequest"
      ],
      "external_name": "ph_request_type"
    },
    "mappingId": {
      "type": "number",
      "description": "The id of the mapping",
      "parse": false,
      "encode": false,
      "encrypt": {
        "type": "AES",
        "key": ""
      },
      "external_name": "mapping-id"
    }
  },
  "definitions": {}
}