{
  "id": 4,
  "vendorId": 8,
  "accountId": 6,
  "internalId": 2,
  "lines": [
    {
      "id": 2,
      "accountId": 6,
      "targetId": 9,
      "quantity": 6,
      "description": "string",
      "amount": 9,
      "lineType": "INVOICE",
      "lineItemType": "INVENTORY",
      "itemIds": [
        9
      ],
      "inventory": {
        "inHandDate": "string",
        "id": 3,
        "accountId": 5,
        "eventId": 10,
        "quantity": 7,
        "notes": "string",
        "section": "string",
        "row": "string",
        "secondRow": "string",
        "lowSeat": 2,
        "highSeat": 9,
        "cost": 1,
        "faceValue": 9,
        "tickets": [
          {
            "id": 4,
            "seatNumber": 7,
            "fileName": "string",
            "barCode": "string",
            "inventoryId": 9,
            "invoiceLineId": 4,
            "purchaseLineId": 8,
            "section": "string",
            "row": "string",
            "notes": "string",
            "cost": 3,
            "faceValue": 2,
            "sellPrice": 6,
            "stockType": "PAPERLESS_CARD",
            "eventId": 1,
            "accountId": 1,
            "status": "SOLD",
            "base64FileBytes": "string",
            "disclosures": [
              "string",
              "string",
              "string",
              "string",
              "string",
              "string",
              "string"
            ],
            "attributes": [
              "string"
            ],
            "createdDate": "string",
            "createdBy": "string",
            "lastUpdate": "string",
            "lastUpdateBy": "string",
            "dateCancelled": "string",
            "cancelledByUserId": 7,
            "auditNote": "string"
          },
          {
            "id": 4,
            "seatNumber": 1,
            "fileName": "string",
            "barCode": "string",
            "inventoryId": 9,
            "invoiceLineId": 10,
            "purchaseLineId": 4,
            "section": "string",
            "row": "string",
            "notes": "string",
            "cost": 1,
            "faceValue": 3,
            "sellPrice": 1,
            "stockType": "MOBILE_SCREENCAP",
            "eventId": 7,
            "accountId": 1,
            "status": "AVAILABLE",
            "base64FileBytes": "string",
            "disclosures": [
              "string",
              "string",
              "string",
              "string",
              "string",
              "string"
            ],
            "attributes": [
              "string",
              "string",
              "string",
              "string",
              "string",
              "string"
            ],
            "createdDate": "string",
            "createdBy": "string",
            "lastUpdate": "string",
            "lastUpdateBy": "string",
            "dateCancelled": "string",
            "cancelledByUserId": 5,
            "auditNote": "string"
          }
        ],
        "ticketIds": [
          8,
          8,
          8,
          10,
          6
        ],
        "stockType": "MOBILE_SCREENCAP",
        "splitType": "DEFAULT",
        "customSplit": "string",
        "listPrice": 6,
        "expectedValue": 10,
        "publicNotes": "string",
        "attributes": [
          "string",
          "string",
          "string",
          "string",
          "string",
          "string"
        ],
        "status": "AVAILABLE",
        "inHandDaysBeforeEvent": 3,
        "lastPriceUpdate": "string",
        "createdDate": "string",
        "createdBy": "string",
        "lastUpdate": "string",
        "lastUpdateBy": "string",
        "lastDeltaUpdate": "string",
        "version": 2,
        "tags": "string",
        "seatType": "PIGGYBACK",
        "eventMapping": {
          "eventName": "string",
          "venueName": "string",
          "eventDate": "string",
          "valid": false
        },
        "mappingId": 7,
        "exchangePosId": 5,
        "broadcast": false,
        "zoneSeating": true,
        "electronicTransfer": false,
        "optOutAutoPrice": true,
        "hideSeatNumbers": true,
        "vsrOption": "NONE",
        "replenishmentGroupId": 3,
        "replenishmentGroup": "string",
        "shownQuantity": 5,
        "ticketsMerged": true,
        "ticketsSplit": false,
        "auditNote": "string",
        "filesUploaded": true,
        "barCodesEntered": true
      },
      "cancelled": true,
      "delete": true,
      "cancel": false,
      "fillLineId": 6,
      "inventoryIds": [
        3,
        5,
        5,
        9,
        7,
        6
      ],
      "createdDate": "string",
      "createdBy": "string",
      "lastUpdate": "string",
      "lastUpdateBy": "string"
    },
    {
      "id": 5,
      "accountId": 7,
      "targetId": 8,
      "quantity": 4,
      "description": "string",
      "amount": 6,
      "lineType": "PURCHASE",
      "lineItemType": "GENERIC",
      "itemIds": [
        3,
        1
      ],
      "inventory": {
        "inHandDate": "string",
        "id": 7,
        "accountId": 7,
        "eventId": 7,
        "quantity": 4,
        "notes": "string",
        "section": "string",
        "row": "string",
        "secondRow": "string",
        "lowSeat": 4,
        "highSeat": 9,
        "cost": 3,
        "faceValue": 2,
        "tickets": [
          {
            "id": 5,
            "seatNumber": 7,
            "fileName": "string",
            "barCode": "string",
            "inventoryId": 6,
            "invoiceLineId": 5,
            "purchaseLineId": 8,
            "section": "string",
            "row": "string",
            "notes": "string",
            "cost": 2,
            "faceValue": 8,
            "sellPrice": 8,
            "stockType": "ELECTRONIC",
            "eventId": 1,
            "accountId": 9,
            "status": "SOLD",
            "base64FileBytes": "string",
            "disclosures": [
              "string",
              "string",
              "string",
              "string",
              "string"
            ],
            "attributes": [
              "string",
              "string",
              "string",
              "string",
              "string",
              "string",
              "string",
              "string"
            ],
            "createdDate": "string",
            "createdBy": "string",
            "lastUpdate": "string",
            "lastUpdateBy": "string",
            "dateCancelled": "string",
            "cancelledByUserId": 9,
            "auditNote": "string"
          },
          {
            "id": 5,
            "seatNumber": 6,
            "fileName": "string",
            "barCode": "string",
            "inventoryId": 10,
            "invoiceLineId": 4,
            "purchaseLineId": 9,
            "section": "string",
            "row": "string",
            "notes": "string",
            "cost": 1,
            "faceValue": 10,
            "sellPrice": 2,
            "stockType": "HARD",
            "eventId": 8,
            "accountId": 5,
            "status": "AVAILABLE",
            "base64FileBytes": "string",
            "disclosures": [
              "string"
            ],
            "attributes": [
              "string"
            ],
            "createdDate": "string",
            "createdBy": "string",
            "lastUpdate": "string",
            "lastUpdateBy": "string",
            "dateCancelled": "string",
            "cancelledByUserId": 2,
            "auditNote": "string"
          },
          {
            "id": 9,
            "seatNumber": 4,
            "fileName": "string",
            "barCode": "string",
            "inventoryId": 8,
            "invoiceLineId": 3,
            "purchaseLineId": 8,
            "section": "string",
            "row": "string",
            "notes": "string",
            "cost": 5,
            "faceValue": 10,
            "sellPrice": 8,
            "stockType": "FLASH",
            "eventId": 6,
            "accountId": 10,
            "status": "SOLD",
            "base64FileBytes": "string",
            "disclosures": [
              "string",
              "string",
              "string",
              "string",
              "string",
              "string",
              "string",
              "string"
            ],
            "attributes": [
              "string"
            ],
            "createdDate": "string",
            "createdBy": "string",
            "lastUpdate": "string",
            "lastUpdateBy": "string",
            "dateCancelled": "string",
            "cancelledByUserId": 7,
            "auditNote": "string"
          }
        ],
        "ticketIds": [
          6
        ],
        "stockType": "FLASH",
        "splitType": "NEVERLEAVEONE",
        "customSplit": "string",
        "listPrice": 7,
        "expectedValue": 3,
        "publicNotes": "string",
        "attributes": [
          "string",
          "string",
          "string",
          "string",
          "string",
          "string",
          "string",
          "string",
          "string"
        ],
        "status": "DEPLETED",
        "inHandDaysBeforeEvent": 8,
        "lastPriceUpdate": "string",
        "createdDate": "string",
        "createdBy": "string",
        "lastUpdate": "string",
        "lastUpdateBy": "string",
        "lastDeltaUpdate": "string",
        "version": 6,
        "tags": "string",
        "seatType": "PIGGYBACK",
        "eventMapping": {
          "eventName": "string",
          "venueName": "string",
          "eventDate": "string",
          "valid": false
        },
        "mappingId": 4,
        "exchangePosId": 7,
        "broadcast": true,
        "zoneSeating": false,
        "electronicTransfer": false,
        "optOutAutoPrice": false,
        "hideSeatNumbers": false,
        "vsrOption": "EVENT_INVENTORY",
        "replenishmentGroupId": 8,
        "replenishmentGroup": "string",
        "shownQuantity": 1,
        "ticketsMerged": true,
        "ticketsSplit": true,
        "auditNote": "string",
        "filesUploaded": true,
        "barCodesEntered": false
      },
      "cancelled": false,
      "delete": false,
      "cancel": false,
      "fillLineId": 3,
      "inventoryIds": [
        9,
        1,
        5,
        5,
        9,
        6,
        2,
        6,
        5
      ],
      "createdDate": "string",
      "createdBy": "string",
      "lastUpdate": "string",
      "lastUpdateBy": "string"
    },
    {
      "id": 9,
      "accountId": 8,
      "targetId": 7,
      "quantity": 6,
      "description": "string",
      "amount": 5,
      "lineType": "INVOICE",
      "lineItemType": "GENERIC",
      "itemIds": [
        9,
        1,
        4,
        3,
        4,
        6,
        4,
        4,
        10,
        1
      ],
      "inventory": {
        "inHandDate": "string",
        "id": 6,
        "accountId": 10,
        "eventId": 1,
        "quantity": 6,
        "notes": "string",
        "section": "string",
        "row": "string",
        "secondRow": "string",
        "lowSeat": 8,
        "highSeat": 9,
        "cost": 7,
        "faceValue": 4,
        "tickets": [
          {
            "id": 5,
            "seatNumber": 9,
            "fileName": "string",
            "barCode": "string",
            "inventoryId": 10,
            "invoiceLineId": 5,
            "purchaseLineId": 6,
            "section": "string",
            "row": "string",
            "notes": "string",
            "cost": 2,
            "faceValue": 1,
            "sellPrice": 7,
            "stockType": "FLASH",
            "eventId": 2,
            "accountId": 10,
            "status": "CANCELLED",
            "base64FileBytes": "string",
            "disclosures": [
              "string"
            ],
            "attributes": [
              "string",
              "string",
              "string",
              "string",
              "string",
              "string",
              "string",
              "string",
              "string"
            ],
            "createdDate": "string",
            "createdBy": "string",
            "lastUpdate": "string",
            "lastUpdateBy": "string",
            "dateCancelled": "string",
            "cancelledByUserId": 9,
            "auditNote": "string"
          },
          {
            "id": 9,
            "seatNumber": 8,
            "fileName": "string",
            "barCode": "string",
            "inventoryId": 1,
            "invoiceLineId": 10,
            "purchaseLineId": 9,
            "section": "string",
            "row": "string",
            "notes": "string",
            "cost": 9,
            "faceValue": 4,
            "sellPrice": 7,
            "stockType": "ELECTRONIC",
            "eventId": 3,
            "accountId": 7,
            "status": "CANCELLED",
            "base64FileBytes": "string",
            "disclosures": [
              "string",
              "string",
              "string",
              "string"
            ],
            "attributes": [
              "string",
              "string",
              "string",
              "string",
              "string",
              "string"
            ],
            "createdDate": "string",
            "createdBy": "string",
            "lastUpdate": "string",
            "lastUpdateBy": "string",
            "dateCancelled": "string",
            "cancelledByUserId": 7,
            "auditNote": "string"
          },
          {
            "id": 5,
            "seatNumber": 3,
            "fileName": "string",
            "barCode": "string",
            "inventoryId": 9,
            "invoiceLineId": 8,
            "purchaseLineId": 9,
            "section": "string",
            "row": "string",
            "notes": "string",
            "cost": 4,
            "faceValue": 4,
            "sellPrice": 2,
            "stockType": "MOBILE_TRANSFER",
            "eventId": 10,
            "accountId": 3,
            "status": "CANCELLED",
            "base64FileBytes": "string",
            "disclosures": [
              "string",
              "string",
              "string",
              "string"
            ],
            "attributes": [
              "string",
              "string"
            ],
            "createdDate": "string",
            "createdBy": "string",
            "lastUpdate": "string",
            "lastUpdateBy": "string",
            "dateCancelled": "string",
            "cancelledByUserId": 4,
            "auditNote": "string"
          },
          {
            "id": 1,
            "seatNumber": 3,
            "fileName": "string",
            "barCode": "string",
            "inventoryId": 10,
            "invoiceLineId": 3,
            "purchaseLineId": 1,
            "section": "string",
            "row": "string",
            "notes": "string",
            "cost": 1,
            "faceValue": 5,
            "sellPrice": 6,
            "stockType": "PAPERLESS_CARD",
            "eventId": 6,
            "accountId": 6,
            "status": "AVAILABLE",
            "base64FileBytes": "string",
            "disclosures": [
              "string",
              "string",
              "string",
              "string",
              "string",
              "string",
              "string",
              "string",
              "string",
              "string"
            ],
            "attributes": [
              "string",
              "string",
              "string",
              "string",
              "string",
              "string",
              "string",
              "string",
              "string"
            ],
            "createdDate": "string",
            "createdBy": "string",
            "lastUpdate": "string",
            "lastUpdateBy": "string",
            "dateCancelled": "string",
            "cancelledByUserId": 3,
            "auditNote": "string"
          },
          {
            "id": 6,
            "seatNumber": 7,
            "fileName": "string",
            "barCode": "string",
            "inventoryId": 10,
            "invoiceLineId": 9,
            "purchaseLineId": 10,
            "section": "string",
            "row": "string",
            "notes": "string",
            "cost": 10,
            "faceValue": 5,
            "sellPrice": 3,
            "stockType": "PAPERLESS",
            "eventId": 10,
            "accountId": 5,
            "status": "CANCELLED",
            "base64FileBytes": "string",
            "disclosures": [
              "string",
              "string",
              "string",
              "string",
              "string"
            ],
            "attributes": [
              "string",
              "string",
              "string",
              "string",
              "string"
            ],
            "createdDate": "string",
            "createdBy": "string",
            "lastUpdate": "string",
            "lastUpdateBy": "string",
            "dateCancelled": "string",
            "cancelledByUserId": 8,
            "auditNote": "string"
          }
        ],
        "ticketIds": [
          2,
          2,
          1,
          5,
          9,
          7,
          5,
          3,
          6,
          6
        ],
        "stockType": "MOBILE_TRANSFER",
        "splitType": "CUSTOM",
        "customSplit": "string",
        "listPrice": 7,
        "expectedValue": 4,
        "publicNotes": "string",
        "attributes": [
          "string",
          "string",
          "string",
          "string",
          "string",
          "string",
          "string",
          "string",
          "string",
          "string"
        ],
        "status": "AVAILABLE",
        "inHandDaysBeforeEvent": 6,
        "lastPriceUpdate": "string",
        "createdDate": "string",
        "createdBy": "string",
        "lastUpdate": "string",
        "lastUpdateBy": "string",
        "lastDeltaUpdate": "string",
        "version": 9,
        "tags": "string",
        "seatType": "ALTERNATING",
        "eventMapping": {
          "eventName": "string",
          "venueName": "string",
          "eventDate": "string",
          "valid": false
        },
        "mappingId": 3,
        "exchangePosId": 1,
        "broadcast": false,
        "zoneSeating": false,
        "electronicTransfer": false,
        "optOutAutoPrice": true,
        "hideSeatNumbers": true,
        "vsrOption": "NONE",
        "replenishmentGroupId": 10,
        "replenishmentGroup": "string",
        "shownQuantity": 2,
        "ticketsMerged": false,
        "ticketsSplit": false,
        "auditNote": "string",
        "filesUploaded": true,
        "barCodesEntered": true
      },
      "cancelled": true,
      "delete": true,
      "cancel": false,
      "fillLineId": 6,
      "inventoryIds": [
        6,
        3
      ],
      "createdDate": "string",
      "createdBy": "string",
      "lastUpdate": "string",
      "lastUpdateBy": "string"
    },
    {
      "id": 9,
      "accountId": 10,
      "targetId": 2,
      "quantity": 4,
      "description": "string",
      "amount": 6,
      "lineType": "INVOICE",
      "lineItemType": "INVENTORY",
      "itemIds": [
        7
      ],
      "inventory": {
        "inHandDate": "string",
        "id": 10,
        "accountId": 5,
        "eventId": 5,
        "quantity": 5,
        "notes": "string",
        "section": "string",
        "row": "string",
        "secondRow": "string",
        "lowSeat": 8,
        "highSeat": 3,
        "cost": 9,
        "faceValue": 8,
        "tickets": [
          {
            "id": 1,
            "seatNumber": 7,
            "fileName": "string",
            "barCode": "string",
            "inventoryId": 6,
            "invoiceLineId": 7,
            "purchaseLineId": 8,
            "section": "string",
            "row": "string",
            "notes": "string",
            "cost": 10,
            "faceValue": 3,
            "sellPrice": 2,
            "stockType": "MOBILE_SCREENCAP",
            "eventId": 9,
            "accountId": 2,
            "status": "AVAILABLE",
            "base64FileBytes": "string",
            "disclosures": [
              "string",
              "string",
              "string",
              "string",
              "string",
              "string",
              "string",
              "string",
              "string"
            ],
            "attributes": [
              "string",
              "string",
              "string",
              "string",
              "string"
            ],
            "createdDate": "string",
            "createdBy": "string",
            "lastUpdate": "string",
            "lastUpdateBy": "string",
            "dateCancelled": "string",
            "cancelledByUserId": 5,
            "auditNote": "string"
          },
          {
            "id": 8,
            "seatNumber": 4,
            "fileName": "string",
            "barCode": "string",
            "inventoryId": 10,
            "invoiceLineId": 3,
            "purchaseLineId": 4,
            "section": "string",
            "row": "string",
            "notes": "string",
            "cost": 7,
            "faceValue": 2,
            "sellPrice": 9,
            "stockType": "HARD",
            "eventId": 2,
            "accountId": 6,
            "status": "SOLD",
            "base64FileBytes": "string",
            "disclosures": [
              "string",
              "string",
              "string",
              "string"
            ],
            "attributes": [
              "string",
              "string",
              "string",
              "string",
              "string",
              "string"
            ],
            "createdDate": "string",
            "createdBy": "string",
            "lastUpdate": "string",
            "lastUpdateBy": "string",
            "dateCancelled": "string",
            "cancelledByUserId": 3,
            "auditNote": "string"
          },
          {
            "id": 5,
            "seatNumber": 1,
            "fileName": "string",
            "barCode": "string",
            "inventoryId": 4,
            "invoiceLineId": 5,
            "purchaseLineId": 10,
            "section": "string",
            "row": "string",
            "notes": "string",
            "cost": 5,
            "faceValue": 5,
            "sellPrice": 4,
            "stockType": "MOBILE_SCREENCAP",
            "eventId": 9,
            "accountId": 1,
            "status": "CANCELLED",
            "base64FileBytes": "string",
            "disclosures": [
              "string",
              "string",
              "string"
            ],
            "attributes": [
              "string",
              "string"
            ],
            "createdDate": "string",
            "createdBy": "string",
            "lastUpdate": "string",
            "lastUpdateBy": "string",
            "dateCancelled": "string",
            "cancelledByUserId": 1,
            "auditNote": "string"
          },
          {
            "id": 4,
            "seatNumber": 8,
            "fileName": "string",
            "barCode": "string",
            "inventoryId": 3,
            "invoiceLineId": 4,
            "purchaseLineId": 10,
            "section": "string",
            "row": "string",
            "notes": "string",
            "cost": 2,
            "faceValue": 4,
            "sellPrice": 8,
            "stockType": "ELECTRONIC",
            "eventId": 3,
            "accountId": 3,
            "status": "AVAILABLE",
            "base64FileBytes": "string",
            "disclosures": [
              "string",
              "string",
              "string",
              "string",
              "string",
              "string",
              "string",
              "string",
              "string"
            ],
            "attributes": [
              "string",
              "string",
              "string",
              "string",
              "string",
              "string",
              "string"
            ],
            "createdDate": "string",
            "createdBy": "string",
            "lastUpdate": "string",
            "lastUpdateBy": "string",
            "dateCancelled": "string",
            "cancelledByUserId": 10,
            "auditNote": "string"
          },
          {
            "id": 6,
            "seatNumber": 8,
            "fileName": "string",
            "barCode": "string",
            "inventoryId": 3,
            "invoiceLineId": 10,
            "purchaseLineId": 3,
            "section": "string",
            "row": "string",
            "notes": "string",
            "cost": 9,
            "faceValue": 7,
            "sellPrice": 1,
            "stockType": "HARD",
            "eventId": 6,
            "accountId": 1,
            "status": "SOLD",
            "base64FileBytes": "string",
            "disclosures": [
              "string",
              "string",
              "string",
              "string"
            ],
            "attributes": [
              "string",
              "string",
              "string",
              "string",
              "string",
              "string"
            ],
            "createdDate": "string",
            "createdBy": "string",
            "lastUpdate": "string",
            "lastUpdateBy": "string",
            "dateCancelled": "string",
            "cancelledByUserId": 2,
            "auditNote": "string"
          },
          {
            "id": 7,
            "seatNumber": 5,
            "fileName": "string",
            "barCode": "string",
            "inventoryId": 1,
            "invoiceLineId": 3,
            "purchaseLineId": 4,
            "section": "string",
            "row": "string",
            "notes": "string",
            "cost": 3,
            "faceValue": 6,
            "sellPrice": 5,
            "stockType": "FLASH",
            "eventId": 6,
            "accountId": 6,
            "status": "CANCELLED",
            "base64FileBytes": "string",
            "disclosures": [
              "string",
              "string"
            ],
            "attributes": [
              "string",
              "string",
              "string"
            ],
            "createdDate": "string",
            "createdBy": "string",
            "lastUpdate": "string",
            "lastUpdateBy": "string",
            "dateCancelled": "string",
            "cancelledByUserId": 2,
            "auditNote": "string"
          },
          {
            "id": 3,
            "seatNumber": 6,
            "fileName": "string",
            "barCode": "string",
            "inventoryId": 7,
            "invoiceLineId": 6,
            "purchaseLineId": 5,
            "section": "string",
            "row": "string",
            "notes": "string",
            "cost": 6,
            "faceValue": 10,
            "sellPrice": 7,
            "stockType": "ELECTRONIC",
            "eventId": 10,
            "accountId": 3,
            "status": "CANCELLED",
            "base64FileBytes": "string",
            "disclosures": [
              "string",
              "string",
              "string",
              "string",
              "string",
              "string",
              "string",
              "string",
              "string"
            ],
            "attributes": [
              "string",
              "string",
              "string",
              "string",
              "string",
              "string",
              "string",
              "string",
              "string",
              "string"
            ],
            "createdDate": "string",
            "createdBy": "string",
            "lastUpdate": "string",
            "lastUpdateBy": "string",
            "dateCancelled": "string",
            "cancelledByUserId": 8,
            "auditNote": "string"
          },
          {
            "id": 5,
            "seatNumber": 10,
            "fileName": "string",
            "barCode": "string",
            "inventoryId": 6,
            "invoiceLineId": 9,
            "purchaseLineId": 2,
            "section": "string",
            "row": "string",
            "notes": "string",
            "cost": 1,
            "faceValue": 5,
            "sellPrice": 8,
            "stockType": "PAPERLESS_CARD",
            "eventId": 2,
            "accountId": 10,
            "status": "AVAILABLE",
            "base64FileBytes": "string",
            "disclosures": [
              "string",
              "string",
              "string",
              "string"
            ],
            "attributes": [
              "string",
              "string",
              "string",
              "string",
              "string",
              "string",
              "string",
              "string",
              "string",
              "string"
            ],
            "createdDate": "string",
            "createdBy": "string",
            "lastUpdate": "string",
            "lastUpdateBy": "string",
            "dateCancelled": "string",
            "cancelledByUserId": 9,
            "auditNote": "string"
          },
          {
            "id": 9,
            "seatNumber": 4,
            "fileName": "string",
            "barCode": "string",
            "inventoryId": 4,
            "invoiceLineId": 6,
            "purchaseLineId": 5,
            "section": "string",
            "row": "string",
            "notes": "string",
            "cost": 8,
            "faceValue": 5,
            "sellPrice": 10,
            "stockType": "MOBILE_TRANSFER",
            "eventId": 8,
            "accountId": 3,
            "status": "SOLD",
            "base64FileBytes": "string",
            "disclosures": [
              "string",
              "string",
              "string",
              "string",
              "string",
              "string",
              "string",
              "string",
              "string"
            ],
            "attributes": [
              "string"
            ],
            "createdDate": "string",
            "createdBy": "string",
            "lastUpdate": "string",
            "lastUpdateBy": "string",
            "dateCancelled": "string",
            "cancelledByUserId": 1,
            "auditNote": "string"
          }
        ],
        "ticketIds": [
          2,
          10,
          5,
          3
        ],
        "stockType": "PAPERLESS",
        "splitType": "ANY",
        "customSplit": "string",
        "listPrice": 7,
        "expectedValue": 5,
        "publicNotes": "string",
        "attributes": [
          "string",
          "string",
          "string",
          "string",
          "string",
          "string",
          "string",
          "string",
          "string"
        ],
        "status": "ON_HOLD",
        "inHandDaysBeforeEvent": 3,
        "lastPriceUpdate": "string",
        "createdDate": "string",
        "createdBy": "string",
        "lastUpdate": "string",
        "lastUpdateBy": "string",
        "lastDeltaUpdate": "string",
        "version": 5,
        "tags": "string",
        "seatType": "PIGGYBACK",
        "eventMapping": {
          "eventName": "string",
          "venueName": "string",
          "eventDate": "string",
          "valid": false
        },
        "mappingId": 5,
        "exchangePosId": 6,
        "broadcast": true,
        "zoneSeating": true,
        "electronicTransfer": false,
        "optOutAutoPrice": true,
        "hideSeatNumbers": false,
        "vsrOption": "ALL",
        "replenishmentGroupId": 4,
        "replenishmentGroup": "string",
        "shownQuantity": 7,
        "ticketsMerged": true,
        "ticketsSplit": false,
        "auditNote": "string",
        "filesUploaded": false,
        "barCodesEntered": true
      },
      "cancelled": false,
      "delete": false,
      "cancel": false,
      "fillLineId": 9,
      "inventoryIds": [
        7
      ],
      "createdDate": "string",
      "createdBy": "string",
      "lastUpdate": "string",
      "lastUpdateBy": "string"
    }
  ],
  "purchaseTerm": "NET25",
  "paymentMethod": "COMPLIMENTARY",
  "paymentRef": "string",
  "deliveryMethod": "UPS",
  "shippingAddressId": 6,
  "billingAddressId": 6,
  "taxAmount": 7,
  "shippingAmount": 10,
  "otherAmount": 10,
  "internalNotes": "string",
  "publicNotes": "string",
  "createdDate": "string",
  "lastUpdate": "string",
  "dueDate": "string",
  "tags": "string",
  "createdBy": "string",
  "lastUpdateBy": "string",
  "externalRef": "string",
  "paymentStatus": "PAID",
  "creditCardId": 9,
  "creditCardGroupId": 7,
  "currencyCode": "EUR",
  "payments": [
    {
      "id": 1,
      "accountId": 9,
      "referenceNumber": "string",
      "amount": 1,
      "paymentDate": "string",
      "userId": 2,
      "entityId": 3,
      "paymentType": "INVOICE",
      "paymentMethod": "CASH",
      "purchaseId": 3
    },
    {
      "id": 10,
      "accountId": 7,
      "referenceNumber": "string",
      "amount": 3,
      "paymentDate": "string",
      "userId": 4,
      "entityId": 8,
      "paymentType": "PURCHASE",
      "paymentMethod": "OTHER",
      "purchaseId": 4
    },
    {
      "id": 6,
      "accountId": 10,
      "referenceNumber": "string",
      "amount": 2,
      "paymentDate": "string",
      "userId": 2,
      "entityId": 9,
      "paymentType": "INVOICE",
      "paymentMethod": "MULTIPLE",
      "purchaseId": 3
    },
    {
      "id": 10,
      "accountId": 8,
      "referenceNumber": "string",
      "amount": 1,
      "paymentDate": "string",
      "userId": 2,
      "entityId": 4,
      "paymentType": "INVOICE",
      "paymentMethod": "AP",
      "purchaseId": 9
    },
    {
      "id": 3,
      "accountId": 10,
      "referenceNumber": "string",
      "amount": 2,
      "paymentDate": "string",
      "userId": 8,
      "entityId": 10,
      "paymentType": "INVOICE",
      "paymentMethod": "EVOPAY",
      "purchaseId": 8
    },
    {
      "id": 6,
      "accountId": 4,
      "referenceNumber": "string",
      "amount": 10,
      "paymentDate": "string",
      "userId": 1,
      "entityId": 10,
      "paymentType": "PURCHASE",
      "paymentMethod": "TRADE",
      "purchaseId": 9
    },
    {
      "id": 6,
      "accountId": 2,
      "referenceNumber": "string",
      "amount": 10,
      "paymentDate": "string",
      "userId": 8,
      "entityId": 9,
      "paymentType": "PURCHASE",
      "paymentMethod": "VENMO",
      "purchaseId": 4
    },
    {
      "id": 5,
      "accountId": 2,
      "referenceNumber": "string",
      "amount": 3,
      "paymentDate": "string",
      "userId": 10,
      "entityId": 2,
      "paymentType": "INVOICE",
      "paymentMethod": "EVOPAY",
      "purchaseId": 6
    }
  ],
  "notes": [
    {
      "id": 5,
      "userId": 5,
      "accountId": 2,
      "purchaseId": 1,
      "date": "string",
      "text": "string",
      "author": "string"
    },
    {
      "id": 1,
      "userId": 7,
      "accountId": 1,
      "purchaseId": 8,
      "date": "string",
      "text": "string",
      "author": "string"
    },
    {
      "id": 8,
      "userId": 10,
      "accountId": 10,
      "purchaseId": 3,
      "date": "string",
      "text": "string",
      "author": "string"
    },
    {
      "id": 6,
      "userId": 4,
      "accountId": 5,
      "purchaseId": 4,
      "date": "string",
      "text": "string",
      "author": "string"
    },
    {
      "id": 6,
      "userId": 10,
      "accountId": 1,
      "purchaseId": 1,
      "date": "string",
      "text": "string",
      "author": "string"
    },
    {
      "id": 2,
      "userId": 10,
      "accountId": 9,
      "purchaseId": 8,
      "date": "string",
      "text": "string",
      "author": "string"
    },
    {
      "id": 3,
      "userId": 7,
      "accountId": 1,
      "purchaseId": 9,
      "date": "string",
      "text": "string",
      "author": "string"
    },
    {
      "id": 6,
      "userId": 6,
      "accountId": 5,
      "purchaseId": 3,
      "date": "string",
      "text": "string",
      "author": "string"
    },
    {
      "id": 3,
      "userId": 9,
      "accountId": 7,
      "purchaseId": 10,
      "date": "string",
      "text": "string",
      "author": "string"
    },
    {
      "id": 6,
      "userId": 9,
      "accountId": 1,
      "purchaseId": 1,
      "date": "string",
      "text": "string",
      "author": "string"
    }
  ],
  "received": false,
  "consignment": {
    "id": 10,
    "accountId": 10,
    "purchaseId": 8,
    "amount": 5,
    "mode": "FIXED",
    "completed": true,
    "created": "string",
    "lines": [
      {
        "id": 7,
        "consignmentId": 9,
        "accountId": 2,
        "invoiceLineId": 9,
        "open": false,
        "originalUnitCost": 5,
        "mode": "FIXED",
        "consignmentValue": 2
      },
      {
        "id": 3,
        "consignmentId": 10,
        "accountId": 6,
        "invoiceLineId": 1,
        "open": false,
        "originalUnitCost": 9,
        "mode": "FIXED",
        "consignmentValue": 4
      },
      {
        "id": 5,
        "consignmentId": 8,
        "accountId": 5,
        "invoiceLineId": 7,
        "open": true,
        "originalUnitCost": 5,
        "mode": "PERCENT",
        "consignmentValue": 5
      },
      {
        "id": 2,
        "consignmentId": 3,
        "accountId": 6,
        "invoiceLineId": 7,
        "open": false,
        "originalUnitCost": 8,
        "mode": "FIXED",
        "consignmentValue": 3
      },
      {
        "id": 10,
        "consignmentId": 9,
        "accountId": 2,
        "invoiceLineId": 6,
        "open": true,
        "originalUnitCost": 1,
        "mode": "PERCENT",
        "consignmentValue": 6
      },
      {
        "id": 10,
        "consignmentId": 1,
        "accountId": 3,
        "invoiceLineId": 1,
        "open": true,
        "originalUnitCost": 5,
        "mode": "FIXED",
        "consignmentValue": 2
      },
      {
        "id": 9,
        "consignmentId": 8,
        "accountId": 9,
        "invoiceLineId": 8,
        "open": true,
        "originalUnitCost": 9,
        "mode": "PERCENT",
        "consignmentValue": 3
      },
      {
        "id": 4,
        "consignmentId": 10,
        "accountId": 9,
        "invoiceLineId": 8,
        "open": true,
        "originalUnitCost": 4,
        "mode": "FIXED",
        "consignmentValue": 9
      }
    ]
  },
  "cooperative": false,
  "status": "INVESTIGATION_CLOSED",
  "airbill": "string",
  "outstandingBalance": 3,
  "autoPo": true
}