{
  "id": 9,
  "accountId": 6,
  "firstName": "string",
  "lastName": "string",
  "company": "string",
  "address1": "string",
  "address2": "string",
  "city": "string",
  "state": "TX",
  "postalCode": "string",
  "country": "string",
  "phone1": "string",
  "phone2": "string",
  "fax": "string"
}