{
  "id": 3,
  "accountId": 4,
  "firstName": "string",
  "lastName": "string",
  "company": "string",
  "address1": "string",
  "address2": "string",
  "city": "string",
  "state": "MD",
  "postalCode": "string",
  "country": "string",
  "phone1": "string",
  "phone2": "string",
  "fax": "string"
}