[
  {
    "inHandDate": "string",
    "id": 8,
    "accountId": 1,
    "eventId": 5,
    "quantity": 2,
    "notes": "string",
    "section": "string",
    "row": "string",
    "secondRow": "string",
    "lowSeat": 4,
    "highSeat": 9,
    "cost": 10,
    "faceValue": 2,
    "tickets": [
      {
        "id": 6,
        "seatNumber": 5,
        "fileName": "string",
        "barCode": "string",
        "inventoryId": 4,
        "invoiceLineId": 4,
        "purchaseLineId": 9,
        "section": "string",
        "row": "string",
        "notes": "string",
        "cost": 3,
        "faceValue": 6,
        "sellPrice": 5,
        "stockType": "MOBILE_TRANSFER",
        "eventId": 5,
        "accountId": 3,
        "status": "AVAILABLE",
        "base64FileBytes": "string",
        "disclosures": [
          "string",
          "string",
          "string",
          "string",
          "string",
          "string",
          "string",
          "string"
        ],
        "attributes": [
          "string"
        ],
        "createdDate": "string",
        "createdBy": "string",
        "lastUpdate": "string",
        "lastUpdateBy": "string",
        "dateCancelled": "string",
        "cancelledByUserId": 1,
        "auditNote": "string"
      }
    ],
    "ticketIds": [
      8,
      3,
      4,
      4,
      7,
      10
    ],
    "stockType": "MOBILE_SCREENCAP",
    "splitType": "DEFAULT",
    "customSplit": "string",
    "listPrice": 10,
    "expectedValue": 6,
    "publicNotes": "string",
    "attributes": [
      "string",
      "string",
      "string",
      "string",
      "string"
    ],
    "status": "AVAILABLE",
    "inHandDaysBeforeEvent": 10,
    "lastPriceUpdate": "string",
    "createdDate": "string",
    "createdBy": "string",
    "lastUpdate": "string",
    "lastUpdateBy": "string",
    "lastDeltaUpdate": "string",
    "version": 5,
    "tags": "string",
    "seatType": "PIGGYBACK",
    "eventMapping": {
      "eventName": "string",
      "venueName": "string",
      "eventDate": "string",
      "valid": true
    },
    "mappingId": 6,
    "exchangePosId": 7,
    "broadcast": true,
    "zoneSeating": true,
    "electronicTransfer": false,
    "optOutAutoPrice": true,
    "hideSeatNumbers": true,
    "vsrOption": "OTHER",
    "replenishmentGroupId": 8,
    "replenishmentGroup": "string",
    "shownQuantity": 8,
    "ticketsMerged": false,
    "ticketsSplit": false,
    "auditNote": "string",
    "filesUploaded": false,
    "barCodesEntered": false,
    "seatNumbers": "string",
    "listed": true,
    "consignmentStatus": "string",
    "cooperative": true,
    "holdId": 4,
    "hold": {
      "id": 4,
      "accountId": 2,
      "inventoryId": 7,
      "user": "string",
      "userId": 4,
      "removedByUserId": 3,
      "createdDate": "string",
      "expiryDate": "string",
      "customerId": 1,
      "removedDate": "string",
      "notes": "string",
      "externalRef": "string",
      "quantity": 1,
      "section": "string",
      "row": "string",
      "seats": "string",
      "cost": 4,
      "listPrice": 3,
      "eventId": 3
    },
    "unitCostAverage": 9,
    "faceValueAverage": 8,
    "currencies": [
      "JPY",
      "CAD"
    ],
    "received": "string",
    "vendorId": [
      4
    ],
    "inHand": true,
    "daysOld": 7,
    "invoiceId": 7,
    "invoiceLineId": 9,
    "invoiceDate": "string",
    "daysListed": 10,
    "purchaseDate": "string",
    "customerDisplayName": "string",
    "customerId": 6,
    "deliveryMethod": "USPS",
    "total": 3,
    "invoiceExternalRef": "string",
    "purchaseExternalRef": "string",
    "fulfillmentStatus": "PENDING",
    "paymentStatus": "PAID",
    "profit": 4,
    "profitMargin": 7,
    "roi": 9,
    "pdfsOrBarcodesAttached": false,
    "lastInvoiceNotes": "string",
    "lastInvoiceNotesDate": "string",
    "invoiceAirbill": "string",
    "vendor": "string",
    "currencyCode": "JPY",
    "purchaseIds": [
      2
    ],
    "fulfillmentDate": "string",
    "unitTicketSales": 8,
    "invoiceCreatedBy": "string",
    "invoiceTags": "string",
    "purchaseTags": "string",
    "outstandingBalance": 6,
    "eventDayOfWeek": "string",
    "invoiceStatus": "INVESTIGATION_CLOSED",
    "lastInvoiceNotesUser": "string",
    "poCreatedBy": "string",
    "customerType": "RETAIL",
    "ticketIdString": "string",
    "event": {
      "id": 1,
      "name": "string",
      "date": "string",
      "venue": {
        "id": 7,
        "name": "string",
        "address": "string",
        "city": "string",
        "state": "string",
        "country": "string",
        "postalCode": "string",
        "phone": "string",
        "timeZone": {
          "fixed": true,
          "id": "string"
        }
      },
      "performerId": 8,
      "performer": {
        "id": 9,
        "name": "string",
        "eventType": "SPORT",
        "category": {
          "id": 2,
          "name": "string",
          "eventType": "OTHER"
        }
      },
      "keywords": "string",
      "chartUrl": "string",
      "stubhubEventId": 1,
      "stubhubEventUrl": "string",
      "tags": "string",
      "notes": "string",
      "eiEventId": 6,
      "optOutReplenishment": false,
      "ticketCount": 10,
      "mySoldTickets": 8,
      "disabled": true,
      "vividSeatsEventUrl": "string"
    }
  },
  {
    "inHandDate": "string",
    "id": 4,
    "accountId": 2,
    "eventId": 10,
    "quantity": 5,
    "notes": "string",
    "section": "string",
    "row": "string",
    "secondRow": "string",
    "lowSeat": 7,
    "highSeat": 2,
    "cost": 7,
    "faceValue": 10,
    "tickets": [
      {
        "id": 7,
        "seatNumber": 3,
        "fileName": "string",
        "barCode": "string",
        "inventoryId": 2,
        "invoiceLineId": 7,
        "purchaseLineId": 10,
        "section": "string",
        "row": "string",
        "notes": "string",
        "cost": 2,
        "faceValue": 9,
        "sellPrice": 3,
        "stockType": "PAPERLESS",
        "eventId": 3,
        "accountId": 3,
        "status": "SOLD",
        "base64FileBytes": "string",
        "disclosures": [
          "string",
          "string",
          "string",
          "string",
          "string",
          "string",
          "string",
          "string"
        ],
        "attributes": [
          "string",
          "string",
          "string",
          "string",
          "string"
        ],
        "createdDate": "string",
        "createdBy": "string",
        "lastUpdate": "string",
        "lastUpdateBy": "string",
        "dateCancelled": "string",
        "cancelledByUserId": 2,
        "auditNote": "string"
      },
      {
        "id": 2,
        "seatNumber": 9,
        "fileName": "string",
        "barCode": "string",
        "inventoryId": 10,
        "invoiceLineId": 10,
        "purchaseLineId": 10,
        "section": "string",
        "row": "string",
        "notes": "string",
        "cost": 3,
        "faceValue": 6,
        "sellPrice": 10,
        "stockType": "ELECTRONIC",
        "eventId": 2,
        "accountId": 10,
        "status": "CANCELLED",
        "base64FileBytes": "string",
        "disclosures": [
          "string",
          "string",
          "string",
          "string",
          "string"
        ],
        "attributes": [
          "string",
          "string",
          "string",
          "string",
          "string"
        ],
        "createdDate": "string",
        "createdBy": "string",
        "lastUpdate": "string",
        "lastUpdateBy": "string",
        "dateCancelled": "string",
        "cancelledByUserId": 6,
        "auditNote": "string"
      },
      {
        "id": 4,
        "seatNumber": 5,
        "fileName": "string",
        "barCode": "string",
        "inventoryId": 4,
        "invoiceLineId": 5,
        "purchaseLineId": 5,
        "section": "string",
        "row": "string",
        "notes": "string",
        "cost": 1,
        "faceValue": 2,
        "sellPrice": 7,
        "stockType": "MOBILE_SCREENCAP",
        "eventId": 3,
        "accountId": 1,
        "status": "AVAILABLE",
        "base64FileBytes": "string",
        "disclosures": [
          "string",
          "string",
          "string",
          "string",
          "string",
          "string",
          "string",
          "string"
        ],
        "attributes": [
          "string",
          "string"
        ],
        "createdDate": "string",
        "createdBy": "string",
        "lastUpdate": "string",
        "lastUpdateBy": "string",
        "dateCancelled": "string",
        "cancelledByUserId": 6,
        "auditNote": "string"
      },
      {
        "id": 8,
        "seatNumber": 5,
        "fileName": "string",
        "barCode": "string",
        "inventoryId": 3,
        "invoiceLineId": 4,
        "purchaseLineId": 6,
        "section": "string",
        "row": "string",
        "notes": "string",
        "cost": 5,
        "faceValue": 7,
        "sellPrice": 1,
        "stockType": "PAPERLESS",
        "eventId": 8,
        "accountId": 6,
        "status": "CANCELLED",
        "base64FileBytes": "string",
        "disclosures": [
          "string",
          "string",
          "string",
          "string"
        ],
        "attributes": [
          "string",
          "string",
          "string",
          "string",
          "string",
          "string",
          "string"
        ],
        "createdDate": "string",
        "createdBy": "string",
        "lastUpdate": "string",
        "lastUpdateBy": "string",
        "dateCancelled": "string",
        "cancelledByUserId": 4,
        "auditNote": "string"
      }
    ],
    "ticketIds": [
      5,
      1,
      6,
      9,
      5,
      1,
      2,
      9,
      7,
      5
    ],
    "stockType": "HARD",
    "splitType": "DEFAULT",
    "customSplit": "string",
    "listPrice": 9,
    "expectedValue": 1,
    "publicNotes": "string",
    "attributes": [
      "string",
      "string",
      "string",
      "string",
      "string",
      "string"
    ],
    "status": "AVAILABLE",
    "inHandDaysBeforeEvent": 5,
    "lastPriceUpdate": "string",
    "createdDate": "string",
    "createdBy": "string",
    "lastUpdate": "string",
    "lastUpdateBy": "string",
    "lastDeltaUpdate": "string",
    "version": 10,
    "tags": "string",
    "seatType": "CONSECUTIVE",
    "eventMapping": {
      "eventName": "string",
      "venueName": "string",
      "eventDate": "string",
      "valid": true
    },
    "mappingId": 4,
    "exchangePosId": 7,
    "broadcast": true,
    "zoneSeating": false,
    "electronicTransfer": true,
    "optOutAutoPrice": true,
    "hideSeatNumbers": false,
    "vsrOption": "NONE",
    "replenishmentGroupId": 2,
    "replenishmentGroup": "string",
    "shownQuantity": 8,
    "ticketsMerged": true,
    "ticketsSplit": false,
    "auditNote": "string",
    "filesUploaded": false,
    "barCodesEntered": false,
    "seatNumbers": "string",
    "listed": false,
    "consignmentStatus": "string",
    "cooperative": false,
    "holdId": 8,
    "hold": {
      "id": 5,
      "accountId": 3,
      "inventoryId": 7,
      "user": "string",
      "userId": 10,
      "removedByUserId": 7,
      "createdDate": "string",
      "expiryDate": "string",
      "customerId": 6,
      "removedDate": "string",
      "notes": "string",
      "externalRef": "string",
      "quantity": 7,
      "section": "string",
      "row": "string",
      "seats": "string",
      "cost": 1,
      "listPrice": 8,
      "eventId": 10
    },
    "unitCostAverage": 8,
    "faceValueAverage": 2,
    "currencies": [
      "BRL",
      "XBT"
    ],
    "received": "string",
    "vendorId": [
      6,
      1,
      2,
      5,
      8,
      4,
      2,
      5
    ],
    "inHand": true,
    "daysOld": 9,
    "invoiceId": 4,
    "invoiceLineId": 4,
    "invoiceDate": "string",
    "daysListed": 8,
    "purchaseDate": "string",
    "customerDisplayName": "string",
    "customerId": 6,
    "deliveryMethod": "PAPERLESS",
    "total": 1,
    "invoiceExternalRef": "string",
    "purchaseExternalRef": "string",
    "fulfillmentStatus": "COMPLETE",
    "paymentStatus": "VOID",
    "profit": 3,
    "profitMargin": 7,
    "roi": 2,
    "pdfsOrBarcodesAttached": false,
    "lastInvoiceNotes": "string",
    "lastInvoiceNotesDate": "string",
    "invoiceAirbill": "string",
    "vendor": "string",
    "currencyCode": "GBP",
    "purchaseIds": [
      2,
      3,
      4,
      1,
      9,
      6,
      1,
      2,
      8
    ],
    "fulfillmentDate": "string",
    "unitTicketSales": 8,
    "invoiceCreatedBy": "string",
    "invoiceTags": "string",
    "purchaseTags": "string",
    "outstandingBalance": 6,
    "eventDayOfWeek": "string",
    "invoiceStatus": "WAITING_FOR_RESPONSE",
    "lastInvoiceNotesUser": "string",
    "poCreatedBy": "string",
    "customerType": "RETAIL",
    "ticketIdString": "string",
    "event": {
      "id": 1,
      "name": "string",
      "date": "string",
      "venue": {
        "id": 5,
        "name": "string",
        "address": "string",
        "city": "string",
        "state": "string",
        "country": "string",
        "postalCode": "string",
        "phone": "string",
        "timeZone": {
          "fixed": false,
          "id": "string"
        }
      },
      "performerId": 3,
      "performer": {
        "id": 2,
        "name": "string",
        "eventType": "OTHER",
        "category": {
          "id": 1,
          "name": "string",
          "eventType": "SPORT"
        }
      },
      "keywords": "string",
      "chartUrl": "string",
      "stubhubEventId": 2,
      "stubhubEventUrl": "string",
      "tags": "string",
      "notes": "string",
      "eiEventId": 4,
      "optOutReplenishment": true,
      "ticketCount": 4,
      "mySoldTickets": 5,
      "disabled": false,
      "vividSeatsEventUrl": "string"
    }
  },
  {
    "inHandDate": "string",
    "id": 1,
    "accountId": 3,
    "eventId": 8,
    "quantity": 6,
    "notes": "string",
    "section": "string",
    "row": "string",
    "secondRow": "string",
    "lowSeat": 7,
    "highSeat": 5,
    "cost": 10,
    "faceValue": 4,
    "tickets": [
      {
        "id": 4,
        "seatNumber": 7,
        "fileName": "string",
        "barCode": "string",
        "inventoryId": 9,
        "invoiceLineId": 5,
        "purchaseLineId": 9,
        "section": "string",
        "row": "string",
        "notes": "string",
        "cost": 8,
        "faceValue": 5,
        "sellPrice": 7,
        "stockType": "ELECTRONIC",
        "eventId": 9,
        "accountId": 1,
        "status": "SOLD",
        "base64FileBytes": "string",
        "disclosures": [
          "string",
          "string",
          "string",
          "string",
          "string",
          "string",
          "string",
          "string",
          "string"
        ],
        "attributes": [
          "string",
          "string",
          "string",
          "string",
          "string",
          "string",
          "string",
          "string"
        ],
        "createdDate": "string",
        "createdBy": "string",
        "lastUpdate": "string",
        "lastUpdateBy": "string",
        "dateCancelled": "string",
        "cancelledByUserId": 6,
        "auditNote": "string"
      },
      {
        "id": 9,
        "seatNumber": 4,
        "fileName": "string",
        "barCode": "string",
        "inventoryId": 5,
        "invoiceLineId": 3,
        "purchaseLineId": 8,
        "section": "string",
        "row": "string",
        "notes": "string",
        "cost": 10,
        "faceValue": 8,
        "sellPrice": 4,
        "stockType": "FLASH",
        "eventId": 6,
        "accountId": 1,
        "status": "CANCELLED",
        "base64FileBytes": "string",
        "disclosures": [
          "string",
          "string"
        ],
        "attributes": [
          "string",
          "string",
          "string",
          "string",
          "string"
        ],
        "createdDate": "string",
        "createdBy": "string",
        "lastUpdate": "string",
        "lastUpdateBy": "string",
        "dateCancelled": "string",
        "cancelledByUserId": 8,
        "auditNote": "string"
      },
      {
        "id": 7,
        "seatNumber": 7,
        "fileName": "string",
        "barCode": "string",
        "inventoryId": 1,
        "invoiceLineId": 8,
        "purchaseLineId": 3,
        "section": "string",
        "row": "string",
        "notes": "string",
        "cost": 8,
        "faceValue": 8,
        "sellPrice": 7,
        "stockType": "PAPERLESS",
        "eventId": 4,
        "accountId": 3,
        "status": "SOLD",
        "base64FileBytes": "string",
        "disclosures": [
          "string",
          "string"
        ],
        "attributes": [
          "string",
          "string"
        ],
        "createdDate": "string",
        "createdBy": "string",
        "lastUpdate": "string",
        "lastUpdateBy": "string",
        "dateCancelled": "string",
        "cancelledByUserId": 2,
        "auditNote": "string"
      },
      {
        "id": 3,
        "seatNumber": 6,
        "fileName": "string",
        "barCode": "string",
        "inventoryId": 3,
        "invoiceLineId": 9,
        "purchaseLineId": 8,
        "section": "string",
        "row": "string",
        "notes": "string",
        "cost": 7,
        "faceValue": 4,
        "sellPrice": 7,
        "stockType": "HARD",
        "eventId": 7,
        "accountId": 6,
        "status": "AVAILABLE",
        "base64FileBytes": "string",
        "disclosures": [
          "string",
          "string",
          "string",
          "string",
          "string",
          "string",
          "string",
          "string",
          "string",
          "string"
        ],
        "attributes": [
          "string",
          "string",
          "string",
          "string",
          "string",
          "string"
        ],
        "createdDate": "string",
        "createdBy": "string",
        "lastUpdate": "string",
        "lastUpdateBy": "string",
        "dateCancelled": "string",
        "cancelledByUserId": 8,
        "auditNote": "string"
      },
      {
        "id": 5,
        "seatNumber": 7,
        "fileName": "string",
        "barCode": "string",
        "inventoryId": 10,
        "invoiceLineId": 1,
        "purchaseLineId": 2,
        "section": "string",
        "row": "string",
        "notes": "string",
        "cost": 3,
        "faceValue": 10,
        "sellPrice": 10,
        "stockType": "HARD",
        "eventId": 4,
        "accountId": 7,
        "status": "SOLD",
        "base64FileBytes": "string",
        "disclosures": [
          "string",
          "string",
          "string",
          "string",
          "string",
          "string",
          "string",
          "string",
          "string"
        ],
        "attributes": [
          "string",
          "string",
          "string",
          "string",
          "string",
          "string",
          "string",
          "string"
        ],
        "createdDate": "string",
        "createdBy": "string",
        "lastUpdate": "string",
        "lastUpdateBy": "string",
        "dateCancelled": "string",
        "cancelledByUserId": 6,
        "auditNote": "string"
      },
      {
        "id": 6,
        "seatNumber": 6,
        "fileName": "string",
        "barCode": "string",
        "inventoryId": 4,
        "invoiceLineId": 5,
        "purchaseLineId": 2,
        "section": "string",
        "row": "string",
        "notes": "string",
        "cost": 3,
        "faceValue": 8,
        "sellPrice": 3,
        "stockType": "HARD",
        "eventId": 7,
        "accountId": 8,
        "status": "AVAILABLE",
        "base64FileBytes": "string",
        "disclosures": [
          "string",
          "string",
          "string",
          "string",
          "string",
          "string",
          "string",
          "string",
          "string"
        ],
        "attributes": [
          "string",
          "string"
        ],
        "createdDate": "string",
        "createdBy": "string",
        "lastUpdate": "string",
        "lastUpdateBy": "string",
        "dateCancelled": "string",
        "cancelledByUserId": 6,
        "auditNote": "string"
      }
    ],
    "ticketIds": [
      8,
      5,
      6,
      4,
      5,
      3,
      8
    ],
    "stockType": "PAPERLESS",
    "splitType": "ANY",
    "customSplit": "string",
    "listPrice": 6,
    "expectedValue": 10,
    "publicNotes": "string",
    "attributes": [
      "string",
      "string",
      "string",
      "string",
      "string",
      "string"
    ],
    "status": "AVAILABLE",
    "inHandDaysBeforeEvent": 2,
    "lastPriceUpdate": "string",
    "createdDate": "string",
    "createdBy": "string",
    "lastUpdate": "string",
    "lastUpdateBy": "string",
    "lastDeltaUpdate": "string",
    "version": 9,
    "tags": "string",
    "seatType": "GA",
    "eventMapping": {
      "eventName": "string",
      "venueName": "string",
      "eventDate": "string",
      "valid": false
    },
    "mappingId": 2,
    "exchangePosId": 7,
    "broadcast": true,
    "zoneSeating": true,
    "electronicTransfer": true,
    "optOutAutoPrice": true,
    "hideSeatNumbers": true,
    "vsrOption": "ALL",
    "replenishmentGroupId": 2,
    "replenishmentGroup": "string",
    "shownQuantity": 8,
    "ticketsMerged": false,
    "ticketsSplit": false,
    "auditNote": "string",
    "filesUploaded": false,
    "barCodesEntered": false,
    "seatNumbers": "string",
    "listed": true,
    "consignmentStatus": "string",
    "cooperative": false,
    "holdId": 6,
    "hold": {
      "id": 10,
      "accountId": 4,
      "inventoryId": 10,
      "user": "string",
      "userId": 10,
      "removedByUserId": 4,
      "createdDate": "string",
      "expiryDate": "string",
      "customerId": 9,
      "removedDate": "string",
      "notes": "string",
      "externalRef": "string",
      "quantity": 8,
      "section": "string",
      "row": "string",
      "seats": "string",
      "cost": 10,
      "listPrice": 5,
      "eventId": 4
    },
    "unitCostAverage": 7,
    "faceValueAverage": 5,
    "currencies": [
      "XBT",
      "CAD",
      "EUR",
      "GBP",
      "BRL"
    ],
    "received": "string",
    "vendorId": [
      8,
      9,
      2
    ],
    "inHand": false,
    "daysOld": 6,
    "invoiceId": 6,
    "invoiceLineId": 9,
    "invoiceDate": "string",
    "daysListed": 8,
    "purchaseDate": "string",
    "customerDisplayName": "string",
    "customerId": 8,
    "deliveryMethod": "OTHER",
    "total": 9,
    "invoiceExternalRef": "string",
    "purchaseExternalRef": "string",
    "fulfillmentStatus": "PENDING",
    "paymentStatus": "PARTIAL",
    "profit": 10,
    "profitMargin": 9,
    "roi": 7,
    "pdfsOrBarcodesAttached": true,
    "lastInvoiceNotes": "string",
    "lastInvoiceNotesDate": "string",
    "invoiceAirbill": "string",
    "vendor": "string",
    "currencyCode": "AUD",
    "purchaseIds": [
      9
    ],
    "fulfillmentDate": "string",
    "unitTicketSales": 9,
    "invoiceCreatedBy": "string",
    "invoiceTags": "string",
    "purchaseTags": "string",
    "outstandingBalance": 8,
    "eventDayOfWeek": "string",
    "invoiceStatus": "DELIVERY_FAILURE",
    "lastInvoiceNotesUser": "string",
    "poCreatedBy": "string",
    "customerType": "MARKETPLACE",
    "ticketIdString": "string",
    "event": {
      "id": 1,
      "name": "string",
      "date": "string",
      "venue": {
        "id": 2,
        "name": "string",
        "address": "string",
        "city": "string",
        "state": "string",
        "country": "string",
        "postalCode": "string",
        "phone": "string",
        "timeZone": {
          "fixed": true,
          "id": "string"
        }
      },
      "performerId": 4,
      "performer": {
        "id": 3,
        "name": "string",
        "eventType": "OTHER",
        "category": {
          "id": 3,
          "name": "string",
          "eventType": "CONCERT"
        }
      },
      "keywords": "string",
      "chartUrl": "string",
      "stubhubEventId": 8,
      "stubhubEventUrl": "string",
      "tags": "string",
      "notes": "string",
      "eiEventId": 1,
      "optOutReplenishment": false,
      "ticketCount": 3,
      "mySoldTickets": 10,
      "disabled": false,
      "vividSeatsEventUrl": "string"
    }
  }
]