[
  {
    "id": 9,
    "accountId": 5,
    "displayName": "string",
    "marketplace": "FANXCHANGE",
    "username": "string",
    "password": "string",
    "apiKey": "string",
    "integrationProvider": "NATIVE",
    "lastSweep": "string",
    "creditCardId": 10,
    "creditCardGroupId": 9,
    "encryptedPassword": "string",
    "customerId": 6,
    "vendorId": 8,
    "markup": 5,
    "fee": 9,
    "autoHideSeatNumbers": false,
    "optInStubhubInhandDateLogic": true,
    "optInStubHubTransferDetailsSweep": true,
    "confirmOrders": false
  },
  {
    "id": 8,
    "accountId": 7,
    "displayName": "string",
    "marketplace": "EVENT_INVENTORY",
    "username": "string",
    "password": "string",
    "apiKey": "string",
    "integrationProvider": "NATIVE",
    "lastSweep": "string",
    "creditCardId": 1,
    "creditCardGroupId": 6,
    "encryptedPassword": "string",
    "customerId": 8,
    "vendorId": 7,
    "markup": 3,
    "fee": 6,
    "autoHideSeatNumbers": false,
    "optInStubhubInhandDateLogic": false,
    "optInStubHubTransferDetailsSweep": false,
    "confirmOrders": false
  },
  {
    "id": 6,
    "accountId": 5,
    "displayName": "string",
    "marketplace": "EVENT_INVENTORY",
    "username": "string",
    "password": "string",
    "apiKey": "string",
    "integrationProvider": "NONE",
    "lastSweep": "string",
    "creditCardId": 10,
    "creditCardGroupId": 9,
    "encryptedPassword": "string",
    "customerId": 6,
    "vendorId": 3,
    "markup": 7,
    "fee": 4,
    "autoHideSeatNumbers": false,
    "optInStubhubInhandDateLogic": true,
    "optInStubHubTransferDetailsSweep": true,
    "confirmOrders": true
  }
]