[
  {
    "invoiceId": 3,
    "ticketId": 9,
    "section": "string",
    "row": "string",
    "seatNumber": 2,
    "barCode": "string"
  },
  {
    "invoiceId": 8,
    "ticketId": 10,
    "section": "string",
    "row": "string",
    "seatNumber": 6,
    "barCode": "string"
  },
  {
    "invoiceId": 8,
    "ticketId": 5,
    "section": "string",
    "row": "string",
    "seatNumber": 5,
    "barCode": "string"
  },
  {
    "invoiceId": 8,
    "ticketId": 4,
    "section": "string",
    "row": "string",
    "seatNumber": 7,
    "barCode": "string"
  }
]