{
  "id": 2,
  "accountId": 7,
  "inventoryId": 3,
  "user": "string",
  "userId": 3,
  "removedByUserId": 5,
  "createdDate": "string",
  "expiryDate": "string",
  "customerId": 3,
  "removedDate": "string",
  "notes": "string",
  "externalRef": "string",
  "quantity": 3,
  "section": "string",
  "row": "string",
  "seats": "string",
  "cost": 8,
  "listPrice": 2,
  "eventId": 10
}