{
  "id": 8,
  "accountId": 1,
  "createdDate": "string",
  "lastUpdate": "string",
  "lastInvoiceDate": "string",
  "email": "string",
  "email2": "string",
  "useEmail2": false,
  "company": "string",
  "address": {
    "id": 2,
    "accountId": 5,
    "firstName": "string",
    "lastName": "string",
    "company": "string",
    "address1": "string",
    "address2": "string",
    "city": "string",
    "state": "AS",
    "postalCode": "string",
    "country": "string",
    "phone1": "string",
    "phone2": "string",
    "fax": "string"
  },
  "notes": "string",
  "firstName": "string",
  "lastName": "string",
  "title": "string",
  "outlawedPaymentMethods": [
    "COMPLIMENTARY",
    "COMPLIMENTARY",
    "VENMO"
  ],
  "displayName": "string",
  "customerType": "PERFORMER",
  "salesTerm": "NET15",
  "paymentMethod": "VENMO",
  "arThreshold": 4,
  "deleted": false,
  "tags": "string",
  "outstandingBalance": 2,
  "defaultDeliveryMethod": "COURIER"
}