{
  "inHandDate": "string",
  "id": 7,
  "accountId": 1,
  "eventId": 7,
  "quantity": 9,
  "notes": "string",
  "section": "string",
  "row": "string",
  "secondRow": "string",
  "lowSeat": 10,
  "highSeat": 8,
  "cost": 10,
  "faceValue": 10,
  "tickets": [
    {
      "id": 4,
      "seatNumber": 9,
      "fileName": "string",
      "barCode": "string",
      "inventoryId": 4,
      "invoiceLineId": 5,
      "purchaseLineId": 10,
      "section": "string",
      "row": "string",
      "notes": "string",
      "cost": 3,
      "faceValue": 4,
      "sellPrice": 10,
      "stockType": "MOBILE_TRANSFER",
      "eventId": 7,
      "accountId": 2,
      "status": "SOLD",
      "base64FileBytes": "string",
      "disclosures": [
        "string",
        "string",
        "string"
      ],
      "attributes": [
        "string",
        "string",
        "string",
        "string",
        "string",
        "string",
        "string",
        "string",
        "string"
      ],
      "createdDate": "string",
      "createdBy": "string",
      "lastUpdate": "string",
      "lastUpdateBy": "string",
      "dateCancelled": "string",
      "cancelledByUserId": 4,
      "auditNote": "string"
    },
    {
      "id": 8,
      "seatNumber": 9,
      "fileName": "string",
      "barCode": "string",
      "inventoryId": 7,
      "invoiceLineId": 3,
      "purchaseLineId": 10,
      "section": "string",
      "row": "string",
      "notes": "string",
      "cost": 6,
      "faceValue": 5,
      "sellPrice": 4,
      "stockType": "ELECTRONIC",
      "eventId": 2,
      "accountId": 7,
      "status": "SOLD",
      "base64FileBytes": "string",
      "disclosures": [
        "string",
        "string"
      ],
      "attributes": [
        "string",
        "string",
        "string",
        "string",
        "string",
        "string"
      ],
      "createdDate": "string",
      "createdBy": "string",
      "lastUpdate": "string",
      "lastUpdateBy": "string",
      "dateCancelled": "string",
      "cancelledByUserId": 1,
      "auditNote": "string"
    },
    {
      "id": 9,
      "seatNumber": 3,
      "fileName": "string",
      "barCode": "string",
      "inventoryId": 2,
      "invoiceLineId": 6,
      "purchaseLineId": 4,
      "section": "string",
      "row": "string",
      "notes": "string",
      "cost": 8,
      "faceValue": 1,
      "sellPrice": 5,
      "stockType": "HARD",
      "eventId": 7,
      "accountId": 2,
      "status": "CANCELLED",
      "base64FileBytes": "string",
      "disclosures": [
        "string",
        "string",
        "string",
        "string",
        "string",
        "string",
        "string",
        "string"
      ],
      "attributes": [
        "string",
        "string",
        "string"
      ],
      "createdDate": "string",
      "createdBy": "string",
      "lastUpdate": "string",
      "lastUpdateBy": "string",
      "dateCancelled": "string",
      "cancelledByUserId": 10,
      "auditNote": "string"
    },
    {
      "id": 3,
      "seatNumber": 3,
      "fileName": "string",
      "barCode": "string",
      "inventoryId": 1,
      "invoiceLineId": 2,
      "purchaseLineId": 7,
      "section": "string",
      "row": "string",
      "notes": "string",
      "cost": 7,
      "faceValue": 10,
      "sellPrice": 4,
      "stockType": "HARD",
      "eventId": 5,
      "accountId": 5,
      "status": "CANCELLED",
      "base64FileBytes": "string",
      "disclosures": [
        "string",
        "string",
        "string",
        "string",
        "string",
        "string"
      ],
      "attributes": [
        "string",
        "string",
        "string",
        "string",
        "string",
        "string",
        "string"
      ],
      "createdDate": "string",
      "createdBy": "string",
      "lastUpdate": "string",
      "lastUpdateBy": "string",
      "dateCancelled": "string",
      "cancelledByUserId": 9,
      "auditNote": "string"
    },
    {
      "id": 2,
      "seatNumber": 2,
      "fileName": "string",
      "barCode": "string",
      "inventoryId": 4,
      "invoiceLineId": 4,
      "purchaseLineId": 2,
      "section": "string",
      "row": "string",
      "notes": "string",
      "cost": 10,
      "faceValue": 6,
      "sellPrice": 5,
      "stockType": "FLASH",
      "eventId": 1,
      "accountId": 9,
      "status": "SOLD",
      "base64FileBytes": "string",
      "disclosures": [
        "string",
        "string",
        "string",
        "string",
        "string"
      ],
      "attributes": [
        "string",
        "string",
        "string",
        "string",
        "string",
        "string"
      ],
      "createdDate": "string",
      "createdBy": "string",
      "lastUpdate": "string",
      "lastUpdateBy": "string",
      "dateCancelled": "string",
      "cancelledByUserId": 2,
      "auditNote": "string"
    },
    {
      "id": 5,
      "seatNumber": 8,
      "fileName": "string",
      "barCode": "string",
      "inventoryId": 5,
      "invoiceLineId": 6,
      "purchaseLineId": 6,
      "section": "string",
      "row": "string",
      "notes": "string",
      "cost": 3,
      "faceValue": 10,
      "sellPrice": 7,
      "stockType": "MOBILE_TRANSFER",
      "eventId": 7,
      "accountId": 10,
      "status": "CANCELLED",
      "base64FileBytes": "string",
      "disclosures": [
        "string"
      ],
      "attributes": [
        "string",
        "string",
        "string",
        "string",
        "string",
        "string"
      ],
      "createdDate": "string",
      "createdBy": "string",
      "lastUpdate": "string",
      "lastUpdateBy": "string",
      "dateCancelled": "string",
      "cancelledByUserId": 9,
      "auditNote": "string"
    }
  ],
  "ticketIds": [
    1,
    8,
    10,
    9,
    1,
    4,
    6,
    5,
    5,
    2
  ],
  "stockType": "PAPERLESS",
  "splitType": "CUSTOM",
  "customSplit": "string",
  "listPrice": 4,
  "expectedValue": 10,
  "publicNotes": "string",
  "attributes": [
    "string",
    "string",
    "string",
    "string"
  ],
  "status": "ON_HOLD",
  "inHandDaysBeforeEvent": 9,
  "lastPriceUpdate": "string",
  "createdDate": "string",
  "createdBy": "string",
  "lastUpdate": "string",
  "lastUpdateBy": "string",
  "lastDeltaUpdate": "string",
  "version": 7,
  "tags": "string",
  "seatType": "ALTERNATING",
  "eventMapping": {
    "eventName": "string",
    "venueName": "string",
    "eventDate": "string",
    "valid": false
  },
  "mappingId": 2,
  "exchangePosId": 6,
  "broadcast": true,
  "zoneSeating": true,
  "electronicTransfer": true,
  "optOutAutoPrice": false,
  "hideSeatNumbers": true,
  "vsrOption": "NONE",
  "replenishmentGroupId": 1,
  "replenishmentGroup": "string",
  "shownQuantity": 9,
  "ticketsMerged": false,
  "ticketsSplit": true,
  "auditNote": "string",
  "filesUploaded": false,
  "barCodesEntered": true
}