[
  {
    "id": 5,
    "vendorId": 9,
    "accountId": 2,
    "internalId": 2,
    "lines": [
      {
        "id": 1,
        "accountId": 7,
        "targetId": 9,
        "quantity": 7,
        "description": "string",
        "amount": 7,
        "lineType": "PURCHASE",
        "lineItemType": "GENERIC",
        "itemIds": [
          4,
          2,
          7,
          4,
          4,
          8,
          10,
          6
        ],
        "inventory": {
          "inHandDate": "string",
          "id": 2,
          "accountId": 4,
          "eventId": 2,
          "quantity": 10,
          "notes": "string",
          "section": "string",
          "row": "string",
          "secondRow": "string",
          "lowSeat": 8,
          "highSeat": 5,
          "cost": 9,
          "faceValue": 3,
          "tickets": [
            {
              "id": 9,
              "seatNumber": 6,
              "fileName": "string",
              "barCode": "string",
              "inventoryId": 2,
              "invoiceLineId": 10,
              "purchaseLineId": 9,
              "section": "string",
              "row": "string",
              "notes": "string",
              "cost": 10,
              "faceValue": 6,
              "sellPrice": 4,
              "stockType": "MOBILE_SCREENCAP",
              "eventId": 5,
              "accountId": 4,
              "status": "AVAILABLE",
              "base64FileBytes": "string",
              "disclosures": [
                "string",
                "string",
                "string",
                "string",
                "string",
                "string",
                "string",
                "string",
                "string"
              ],
              "attributes": [
                "string",
                "string",
                "string"
              ],
              "createdDate": "string",
              "createdBy": "string",
              "lastUpdate": "string",
              "lastUpdateBy": "string",
              "dateCancelled": "string",
              "cancelledByUserId": 3,
              "auditNote": "string"
            },
            {
              "id": 7,
              "seatNumber": 8,
              "fileName": "string",
              "barCode": "string",
              "inventoryId": 5,
              "invoiceLineId": 9,
              "purchaseLineId": 4,
              "section": "string",
              "row": "string",
              "notes": "string",
              "cost": 2,
              "faceValue": 1,
              "sellPrice": 10,
              "stockType": "PAPERLESS",
              "eventId": 4,
              "accountId": 6,
              "status": "SOLD",
              "base64FileBytes": "string",
              "disclosures": [
                "string",
                "string"
              ],
              "attributes": [
                "string",
                "string",
                "string"
              ],
              "createdDate": "string",
              "createdBy": "string",
              "lastUpdate": "string",
              "lastUpdateBy": "string",
              "dateCancelled": "string",
              "cancelledByUserId": 6,
              "auditNote": "string"
            },
            {
              "id": 2,
              "seatNumber": 9,
              "fileName": "string",
              "barCode": "string",
              "inventoryId": 8,
              "invoiceLineId": 2,
              "purchaseLineId": 2,
              "section": "string",
              "row": "string",
              "notes": "string",
              "cost": 4,
              "faceValue": 9,
              "sellPrice": 2,
              "stockType": "MOBILE_SCREENCAP",
              "eventId": 3,
              "accountId": 9,
              "status": "SOLD",
              "base64FileBytes": "string",
              "disclosures": [
                "string",
                "string",
                "string",
                "string",
                "string",
                "string",
                "string",
                "string",
                "string",
                "string"
              ],
              "attributes": [
                "string",
                "string",
                "string",
                "string",
                "string",
                "string",
                "string"
              ],
              "createdDate": "string",
              "createdBy": "string",
              "lastUpdate": "string",
              "lastUpdateBy": "string",
              "dateCancelled": "string",
              "cancelledByUserId": 7,
              "auditNote": "string"
            }
          ],
          "ticketIds": [
            4,
            4,
            10,
            10,
            1
          ],
          "stockType": "ELECTRONIC",
          "splitType": "ANY",
          "customSplit": "string",
          "listPrice": 2,
          "expectedValue": 8,
          "publicNotes": "string",
          "attributes": [
            "string",
            "string"
          ],
          "status": "AVAILABLE",
          "inHandDaysBeforeEvent": 9,
          "lastPriceUpdate": "string",
          "createdDate": "string",
          "createdBy": "string",
          "lastUpdate": "string",
          "lastUpdateBy": "string",
          "lastDeltaUpdate": "string",
          "version": 2,
          "tags": "string",
          "seatType": "PIGGYBACK",
          "eventMapping": {
            "eventName": "string",
            "venueName": "string",
            "eventDate": "string",
            "valid": true
          },
          "mappingId": 4,
          "exchangePosId": 9,
          "broadcast": true,
          "zoneSeating": true,
          "electronicTransfer": false,
          "optOutAutoPrice": true,
          "hideSeatNumbers": true,
          "vsrOption": "EVENT_INVENTORY",
          "replenishmentGroupId": 6,
          "replenishmentGroup": "string",
          "shownQuantity": 1,
          "ticketsMerged": true,
          "ticketsSplit": true,
          "auditNote": "string",
          "filesUploaded": false,
          "barCodesEntered": true
        },
        "cancelled": true,
        "delete": false,
        "cancel": true,
        "fillLineId": 10,
        "inventoryIds": [
          1
        ],
        "createdDate": "string",
        "createdBy": "string",
        "lastUpdate": "string",
        "lastUpdateBy": "string"
      },
      {
        "id": 3,
        "accountId": 4,
        "targetId": 1,
        "quantity": 5,
        "description": "string",
        "amount": 6,
        "lineType": "INVOICE",
        "lineItemType": "GENERIC",
        "itemIds": [
          9,
          5,
          3,
          1,
          10,
          3
        ],
        "inventory": {
          "inHandDate": "string",
          "id": 7,
          "accountId": 5,
          "eventId": 3,
          "quantity": 5,
          "notes": "string",
          "section": "string",
          "row": "string",
          "secondRow": "string",
          "lowSeat": 6,
          "highSeat": 8,
          "cost": 8,
          "faceValue": 9,
          "tickets": [
            {
              "id": 4,
              "seatNumber": 7,
              "fileName": "string",
              "barCode": "string",
              "inventoryId": 4,
              "invoiceLineId": 5,
              "purchaseLineId": 5,
              "section": "string",
              "row": "string",
              "notes": "string",
              "cost": 7,
              "faceValue": 6,
              "sellPrice": 9,
              "stockType": "MOBILE_TRANSFER",
              "eventId": 10,
              "accountId": 8,
              "status": "SOLD",
              "base64FileBytes": "string",
              "disclosures": [
                "string",
                "string",
                "string",
                "string",
                "string",
                "string",
                "string",
                "string",
                "string"
              ],
              "attributes": [
                "string",
                "string",
                "string",
                "string",
                "string",
                "string"
              ],
              "createdDate": "string",
              "createdBy": "string",
              "lastUpdate": "string",
              "lastUpdateBy": "string",
              "dateCancelled": "string",
              "cancelledByUserId": 2,
              "auditNote": "string"
            },
            {
              "id": 6,
              "seatNumber": 7,
              "fileName": "string",
              "barCode": "string",
              "inventoryId": 3,
              "invoiceLineId": 7,
              "purchaseLineId": 1,
              "section": "string",
              "row": "string",
              "notes": "string",
              "cost": 10,
              "faceValue": 3,
              "sellPrice": 5,
              "stockType": "PAPERLESS",
              "eventId": 2,
              "accountId": 5,
              "status": "CANCELLED",
              "base64FileBytes": "string",
              "disclosures": [
                "string"
              ],
              "attributes": [
                "string",
                "string",
                "string",
                "string",
                "string",
                "string",
                "string",
                "string"
              ],
              "createdDate": "string",
              "createdBy": "string",
              "lastUpdate": "string",
              "lastUpdateBy": "string",
              "dateCancelled": "string",
              "cancelledByUserId": 2,
              "auditNote": "string"
            },
            {
              "id": 3,
              "seatNumber": 9,
              "fileName": "string",
              "barCode": "string",
              "inventoryId": 7,
              "invoiceLineId": 7,
              "purchaseLineId": 5,
              "section": "string",
              "row": "string",
              "notes": "string",
              "cost": 8,
              "faceValue": 8,
              "sellPrice": 6,
              "stockType": "PAPERLESS",
              "eventId": 6,
              "accountId": 8,
              "status": "CANCELLED",
              "base64FileBytes": "string",
              "disclosures": [
                "string",
                "string",
                "string",
                "string",
                "string",
                "string"
              ],
              "attributes": [
                "string",
                "string"
              ],
              "createdDate": "string",
              "createdBy": "string",
              "lastUpdate": "string",
              "lastUpdateBy": "string",
              "dateCancelled": "string",
              "cancelledByUserId": 5,
              "auditNote": "string"
            },
            {
              "id": 5,
              "seatNumber": 5,
              "fileName": "string",
              "barCode": "string",
              "inventoryId": 2,
              "invoiceLineId": 4,
              "purchaseLineId": 4,
              "section": "string",
              "row": "string",
              "notes": "string",
              "cost": 6,
              "faceValue": 3,
              "sellPrice": 3,
              "stockType": "PAPERLESS_CARD",
              "eventId": 3,
              "accountId": 4,
              "status": "CANCELLED",
              "base64FileBytes": "string",
              "disclosures": [
                "string",
                "string",
                "string",
                "string",
                "string",
                "string",
                "string",
                "string",
                "string",
                "string"
              ],
              "attributes": [
                "string",
                "string"
              ],
              "createdDate": "string",
              "createdBy": "string",
              "lastUpdate": "string",
              "lastUpdateBy": "string",
              "dateCancelled": "string",
              "cancelledByUserId": 7,
              "auditNote": "string"
            },
            {
              "id": 10,
              "seatNumber": 6,
              "fileName": "string",
              "barCode": "string",
              "inventoryId": 2,
              "invoiceLineId": 6,
              "purchaseLineId": 5,
              "section": "string",
              "row": "string",
              "notes": "string",
              "cost": 4,
              "faceValue": 4,
              "sellPrice": 9,
              "stockType": "HARD",
              "eventId": 8,
              "accountId": 5,
              "status": "SOLD",
              "base64FileBytes": "string",
              "disclosures": [
                "string",
                "string",
                "string",
                "string",
                "string",
                "string",
                "string"
              ],
              "attributes": [
                "string",
                "string",
                "string",
                "string",
                "string",
                "string",
                "string",
                "string"
              ],
              "createdDate": "string",
              "createdBy": "string",
              "lastUpdate": "string",
              "lastUpdateBy": "string",
              "dateCancelled": "string",
              "cancelledByUserId": 8,
              "auditNote": "string"
            },
            {
              "id": 6,
              "seatNumber": 10,
              "fileName": "string",
              "barCode": "string",
              "inventoryId": 7,
              "invoiceLineId": 1,
              "purchaseLineId": 9,
              "section": "string",
              "row": "string",
              "notes": "string",
              "cost": 1,
              "faceValue": 1,
              "sellPrice": 4,
              "stockType": "ELECTRONIC",
              "eventId": 10,
              "accountId": 1,
              "status": "CANCELLED",
              "base64FileBytes": "string",
              "disclosures": [
                "string",
                "string",
                "string"
              ],
              "attributes": [
                "string",
                "string",
                "string",
                "string",
                "string",
                "string",
                "string"
              ],
              "createdDate": "string",
              "createdBy": "string",
              "lastUpdate": "string",
              "lastUpdateBy": "string",
              "dateCancelled": "string",
              "cancelledByUserId": 8,
              "auditNote": "string"
            },
            {
              "id": 2,
              "seatNumber": 6,
              "fileName": "string",
              "barCode": "string",
              "inventoryId": 8,
              "invoiceLineId": 2,
              "purchaseLineId": 4,
              "section": "string",
              "row": "string",
              "notes": "string",
              "cost": 10,
              "faceValue": 1,
              "sellPrice": 10,
              "stockType": "MOBILE_SCREENCAP",
              "eventId": 3,
              "accountId": 2,
              "status": "CANCELLED",
              "base64FileBytes": "string",
              "disclosures": [
                "string",
                "string",
                "string",
                "string",
                "string",
                "string"
              ],
              "attributes": [
                "string",
                "string"
              ],
              "createdDate": "string",
              "createdBy": "string",
              "lastUpdate": "string",
              "lastUpdateBy": "string",
              "dateCancelled": "string",
              "cancelledByUserId": 3,
              "auditNote": "string"
            },
            {
              "id": 10,
              "seatNumber": 2,
              "fileName": "string",
              "barCode": "string",
              "inventoryId": 3,
              "invoiceLineId": 9,
              "purchaseLineId": 6,
              "section": "string",
              "row": "string",
              "notes": "string",
              "cost": 10,
              "faceValue": 2,
              "sellPrice": 5,
              "stockType": "HARD",
              "eventId": 8,
              "accountId": 3,
              "status": "SOLD",
              "base64FileBytes": "string",
              "disclosures": [
                "string",
                "string",
                "string",
                "string"
              ],
              "attributes": [
                "string",
                "string",
                "string",
                "string",
                "string",
                "string",
                "string",
                "string",
                "string"
              ],
              "createdDate": "string",
              "createdBy": "string",
              "lastUpdate": "string",
              "lastUpdateBy": "string",
              "dateCancelled": "string",
              "cancelledByUserId": 10,
              "auditNote": "string"
            }
          ],
          "ticketIds": [
            9,
            1,
            10,
            6
          ],
          "stockType": "PAPERLESS",
          "splitType": "DEFAULT",
          "customSplit": "string",
          "listPrice": 1,
          "expectedValue": 4,
          "publicNotes": "string",
          "attributes": [
            "string",
            "string",
            "string"
          ],
          "status": "AVAILABLE",
          "inHandDaysBeforeEvent": 7,
          "lastPriceUpdate": "string",
          "createdDate": "string",
          "createdBy": "string",
          "lastUpdate": "string",
          "lastUpdateBy": "string",
          "lastDeltaUpdate": "string",
          "version": 3,
          "tags": "string",
          "seatType": "PIGGYBACK",
          "eventMapping": {
            "eventName": "string",
            "venueName": "string",
            "eventDate": "string",
            "valid": true
          },
          "mappingId": 1,
          "exchangePosId": 5,
          "broadcast": true,
          "zoneSeating": false,
          "electronicTransfer": true,
          "optOutAutoPrice": true,
          "hideSeatNumbers": false,
          "vsrOption": "OTHER",
          "replenishmentGroupId": 8,
          "replenishmentGroup": "string",
          "shownQuantity": 7,
          "ticketsMerged": true,
          "ticketsSplit": true,
          "auditNote": "string",
          "filesUploaded": false,
          "barCodesEntered": true
        },
        "cancelled": true,
        "delete": false,
        "cancel": false,
        "fillLineId": 3,
        "inventoryIds": [
          1,
          1,
          8,
          3,
          3,
          7,
          6,
          4,
          8
        ],
        "createdDate": "string",
        "createdBy": "string",
        "lastUpdate": "string",
        "lastUpdateBy": "string"
      },
      {
        "id": 3,
        "accountId": 1,
        "targetId": 8,
        "quantity": 5,
        "description": "string",
        "amount": 10,
        "lineType": "PURCHASE",
        "lineItemType": "GENERIC",
        "itemIds": [
          2,
          2,
          4,
          6,
          8,
          1,
          4,
          6,
          1,
          9
        ],
        "inventory": {
          "inHandDate": "string",
          "id": 8,
          "accountId": 4,
          "eventId": 4,
          "quantity": 6,
          "notes": "string",
          "section": "string",
          "row": "string",
          "secondRow": "string",
          "lowSeat": 5,
          "highSeat": 2,
          "cost": 5,
          "faceValue": 3,
          "tickets": [
            {
              "id": 3,
              "seatNumber": 4,
              "fileName": "string",
              "barCode": "string",
              "inventoryId": 8,
              "invoiceLineId": 5,
              "purchaseLineId": 6,
              "section": "string",
              "row": "string",
              "notes": "string",
              "cost": 6,
              "faceValue": 9,
              "sellPrice": 10,
              "stockType": "MOBILE_TRANSFER",
              "eventId": 1,
              "accountId": 10,
              "status": "SOLD",
              "base64FileBytes": "string",
              "disclosures": [
                "string",
                "string",
                "string",
                "string",
                "string",
                "string",
                "string",
                "string"
              ],
              "attributes": [
                "string",
                "string",
                "string",
                "string",
                "string"
              ],
              "createdDate": "string",
              "createdBy": "string",
              "lastUpdate": "string",
              "lastUpdateBy": "string",
              "dateCancelled": "string",
              "cancelledByUserId": 5,
              "auditNote": "string"
            }
          ],
          "ticketIds": [
            5,
            5,
            4,
            3
          ],
          "stockType": "PAPERLESS_CARD",
          "splitType": "NEVERLEAVEONE",
          "customSplit": "string",
          "listPrice": 3,
          "expectedValue": 4,
          "publicNotes": "string",
          "attributes": [
            "string",
            "string",
            "string",
            "string",
            "string",
            "string",
            "string",
            "string",
            "string"
          ],
          "status": "DEPLETED",
          "inHandDaysBeforeEvent": 2,
          "lastPriceUpdate": "string",
          "createdDate": "string",
          "createdBy": "string",
          "lastUpdate": "string",
          "lastUpdateBy": "string",
          "lastDeltaUpdate": "string",
          "version": 7,
          "tags": "string",
          "seatType": "GA",
          "eventMapping": {
            "eventName": "string",
            "venueName": "string",
            "eventDate": "string",
            "valid": true
          },
          "mappingId": 5,
          "exchangePosId": 2,
          "broadcast": true,
          "zoneSeating": true,
          "electronicTransfer": false,
          "optOutAutoPrice": false,
          "hideSeatNumbers": true,
          "vsrOption": "NONE",
          "replenishmentGroupId": 1,
          "replenishmentGroup": "string",
          "shownQuantity": 3,
          "ticketsMerged": false,
          "ticketsSplit": false,
          "auditNote": "string",
          "filesUploaded": false,
          "barCodesEntered": true
        },
        "cancelled": false,
        "delete": true,
        "cancel": true,
        "fillLineId": 10,
        "inventoryIds": [
          3,
          4,
          4,
          2,
          3
        ],
        "createdDate": "string",
        "createdBy": "string",
        "lastUpdate": "string",
        "lastUpdateBy": "string"
      },
      {
        "id": 3,
        "accountId": 4,
        "targetId": 1,
        "quantity": 3,
        "description": "string",
        "amount": 4,
        "lineType": "PURCHASE",
        "lineItemType": "INVENTORY",
        "itemIds": [
          8,
          6,
          2,
          6,
          6
        ],
        "inventory": {
          "inHandDate": "string",
          "id": 1,
          "accountId": 9,
          "eventId": 10,
          "quantity": 10,
          "notes": "string",
          "section": "string",
          "row": "string",
          "secondRow": "string",
          "lowSeat": 10,
          "highSeat": 7,
          "cost": 5,
          "faceValue": 8,
          "tickets": [
            {
              "id": 9,
              "seatNumber": 3,
              "fileName": "string",
              "barCode": "string",
              "inventoryId": 5,
              "invoiceLineId": 4,
              "purchaseLineId": 5,
              "section": "string",
              "row": "string",
              "notes": "string",
              "cost": 6,
              "faceValue": 4,
              "sellPrice": 8,
              "stockType": "HARD",
              "eventId": 1,
              "accountId": 3,
              "status": "CANCELLED",
              "base64FileBytes": "string",
              "disclosures": [
                "string",
                "string",
                "string"
              ],
              "attributes": [
                "string",
                "string",
                "string",
                "string",
                "string",
                "string",
                "string",
                "string"
              ],
              "createdDate": "string",
              "createdBy": "string",
              "lastUpdate": "string",
              "lastUpdateBy": "string",
              "dateCancelled": "string",
              "cancelledByUserId": 6,
              "auditNote": "string"
            },
            {
              "id": 9,
              "seatNumber": 2,
              "fileName": "string",
              "barCode": "string",
              "inventoryId": 1,
              "invoiceLineId": 5,
              "purchaseLineId": 8,
              "section": "string",
              "row": "string",
              "notes": "string",
              "cost": 4,
              "faceValue": 10,
              "sellPrice": 5,
              "stockType": "HARD",
              "eventId": 2,
              "accountId": 4,
              "status": "AVAILABLE",
              "base64FileBytes": "string",
              "disclosures": [
                "string",
                "string",
                "string",
                "string"
              ],
              "attributes": [
                "string",
                "string",
                "string",
                "string",
                "string",
                "string"
              ],
              "createdDate": "string",
              "createdBy": "string",
              "lastUpdate": "string",
              "lastUpdateBy": "string",
              "dateCancelled": "string",
              "cancelledByUserId": 9,
              "auditNote": "string"
            },
            {
              "id": 2,
              "seatNumber": 1,
              "fileName": "string",
              "barCode": "string",
              "inventoryId": 2,
              "invoiceLineId": 2,
              "purchaseLineId": 8,
              "section": "string",
              "row": "string",
              "notes": "string",
              "cost": 2,
              "faceValue": 5,
              "sellPrice": 4,
              "stockType": "MOBILE_SCREENCAP",
              "eventId": 10,
              "accountId": 1,
              "status": "AVAILABLE",
              "base64FileBytes": "string",
              "disclosures": [
                "string",
                "string",
                "string",
                "string",
                "string",
                "string",
                "string",
                "string"
              ],
              "attributes": [
                "string"
              ],
              "createdDate": "string",
              "createdBy": "string",
              "lastUpdate": "string",
              "lastUpdateBy": "string",
              "dateCancelled": "string",
              "cancelledByUserId": 4,
              "auditNote": "string"
            },
            {
              "id": 9,
              "seatNumber": 1,
              "fileName": "string",
              "barCode": "string",
              "inventoryId": 8,
              "invoiceLineId": 5,
              "purchaseLineId": 6,
              "section": "string",
              "row": "string",
              "notes": "string",
              "cost": 2,
              "faceValue": 8,
              "sellPrice": 1,
              "stockType": "MOBILE_SCREENCAP",
              "eventId": 8,
              "accountId": 9,
              "status": "SOLD",
              "base64FileBytes": "string",
              "disclosures": [
                "string",
                "string",
                "string",
                "string",
                "string",
                "string",
                "string",
                "string",
                "string"
              ],
              "attributes": [
                "string",
                "string",
                "string",
                "string",
                "string",
                "string"
              ],
              "createdDate": "string",
              "createdBy": "string",
              "lastUpdate": "string",
              "lastUpdateBy": "string",
              "dateCancelled": "string",
              "cancelledByUserId": 9,
              "auditNote": "string"
            },
            {
              "id": 10,
              "seatNumber": 9,
              "fileName": "string",
              "barCode": "string",
              "inventoryId": 5,
              "invoiceLineId": 3,
              "purchaseLineId": 4,
              "section": "string",
              "row": "string",
              "notes": "string",
              "cost": 2,
              "faceValue": 4,
              "sellPrice": 1,
              "stockType": "FLASH",
              "eventId": 6,
              "accountId": 7,
              "status": "AVAILABLE",
              "base64FileBytes": "string",
              "disclosures": [
                "string",
                "string",
                "string"
              ],
              "attributes": [
                "string",
                "string",
                "string"
              ],
              "createdDate": "string",
              "createdBy": "string",
              "lastUpdate": "string",
              "lastUpdateBy": "string",
              "dateCancelled": "string",
              "cancelledByUserId": 2,
              "auditNote": "string"
            },
            {
              "id": 4,
              "seatNumber": 7,
              "fileName": "string",
              "barCode": "string",
              "inventoryId": 10,
              "invoiceLineId": 10,
              "purchaseLineId": 8,
              "section": "string",
              "row": "string",
              "notes": "string",
              "cost": 7,
              "faceValue": 9,
              "sellPrice": 6,
              "stockType": "FLASH",
              "eventId": 9,
              "accountId": 1,
              "status": "SOLD",
              "base64FileBytes": "string",
              "disclosures": [
                "string"
              ],
              "attributes": [
                "string",
                "string",
                "string",
                "string",
                "string",
                "string",
                "string",
                "string",
                "string"
              ],
              "createdDate": "string",
              "createdBy": "string",
              "lastUpdate": "string",
              "lastUpdateBy": "string",
              "dateCancelled": "string",
              "cancelledByUserId": 9,
              "auditNote": "string"
            },
            {
              "id": 10,
              "seatNumber": 2,
              "fileName": "string",
              "barCode": "string",
              "inventoryId": 5,
              "invoiceLineId": 5,
              "purchaseLineId": 8,
              "section": "string",
              "row": "string",
              "notes": "string",
              "cost": 1,
              "faceValue": 2,
              "sellPrice": 3,
              "stockType": "FLASH",
              "eventId": 3,
              "accountId": 4,
              "status": "SOLD",
              "base64FileBytes": "string",
              "disclosures": [
                "string",
                "string",
                "string",
                "string"
              ],
              "attributes": [
                "string",
                "string",
                "string",
                "string"
              ],
              "createdDate": "string",
              "createdBy": "string",
              "lastUpdate": "string",
              "lastUpdateBy": "string",
              "dateCancelled": "string",
              "cancelledByUserId": 1,
              "auditNote": "string"
            },
            {
              "id": 2,
              "seatNumber": 2,
              "fileName": "string",
              "barCode": "string",
              "inventoryId": 1,
              "invoiceLineId": 10,
              "purchaseLineId": 5,
              "section": "string",
              "row": "string",
              "notes": "string",
              "cost": 7,
              "faceValue": 10,
              "sellPrice": 9,
              "stockType": "ELECTRONIC",
              "eventId": 7,
              "accountId": 6,
              "status": "AVAILABLE",
              "base64FileBytes": "string",
              "disclosures": [
                "string",
                "string",
                "string",
                "string",
                "string",
                "string"
              ],
              "attributes": [
                "string",
                "string",
                "string",
                "string",
                "string",
                "string",
                "string",
                "string"
              ],
              "createdDate": "string",
              "createdBy": "string",
              "lastUpdate": "string",
              "lastUpdateBy": "string",
              "dateCancelled": "string",
              "cancelledByUserId": 8,
              "auditNote": "string"
            }
          ],
          "ticketIds": [
            4
          ],
          "stockType": "MOBILE_TRANSFER",
          "splitType": "DEFAULT",
          "customSplit": "string",
          "listPrice": 8,
          "expectedValue": 1,
          "publicNotes": "string",
          "attributes": [
            "string",
            "string",
            "string",
            "string"
          ],
          "status": "AVAILABLE",
          "inHandDaysBeforeEvent": 4,
          "lastPriceUpdate": "string",
          "createdDate": "string",
          "createdBy": "string",
          "lastUpdate": "string",
          "lastUpdateBy": "string",
          "lastDeltaUpdate": "string",
          "version": 5,
          "tags": "string",
          "seatType": "ALTERNATING",
          "eventMapping": {
            "eventName": "string",
            "venueName": "string",
            "eventDate": "string",
            "valid": true
          },
          "mappingId": 4,
          "exchangePosId": 7,
          "broadcast": false,
          "zoneSeating": false,
          "electronicTransfer": false,
          "optOutAutoPrice": false,
          "hideSeatNumbers": false,
          "vsrOption": "OTHER",
          "replenishmentGroupId": 8,
          "replenishmentGroup": "string",
          "shownQuantity": 8,
          "ticketsMerged": false,
          "ticketsSplit": false,
          "auditNote": "string",
          "filesUploaded": false,
          "barCodesEntered": false
        },
        "cancelled": true,
        "delete": true,
        "cancel": true,
        "fillLineId": 3,
        "inventoryIds": [
          4,
          2,
          7,
          9,
          4,
          10,
          2
        ],
        "createdDate": "string",
        "createdBy": "string",
        "lastUpdate": "string",
        "lastUpdateBy": "string"
      },
      {
        "id": 3,
        "accountId": 3,
        "targetId": 8,
        "quantity": 10,
        "description": "string",
        "amount": 10,
        "lineType": "PURCHASE",
        "lineItemType": "INVENTORY",
        "itemIds": [
          8,
          4,
          6,
          2,
          4,
          6,
          8,
          10,
          10,
          5
        ],
        "inventory": {
          "inHandDate": "string",
          "id": 5,
          "accountId": 8,
          "eventId": 5,
          "quantity": 3,
          "notes": "string",
          "section": "string",
          "row": "string",
          "secondRow": "string",
          "lowSeat": 7,
          "highSeat": 3,
          "cost": 2,
          "faceValue": 6,
          "tickets": [
            {
              "id": 1,
              "seatNumber": 9,
              "fileName": "string",
              "barCode": "string",
              "inventoryId": 5,
              "invoiceLineId": 3,
              "purchaseLineId": 10,
              "section": "string",
              "row": "string",
              "notes": "string",
              "cost": 9,
              "faceValue": 5,
              "sellPrice": 8,
              "stockType": "ELECTRONIC",
              "eventId": 1,
              "accountId": 1,
              "status": "SOLD",
              "base64FileBytes": "string",
              "disclosures": [
                "string",
                "string",
                "string",
                "string"
              ],
              "attributes": [
                "string",
                "string",
                "string",
                "string",
                "string",
                "string",
                "string",
                "string",
                "string"
              ],
              "createdDate": "string",
              "createdBy": "string",
              "lastUpdate": "string",
              "lastUpdateBy": "string",
              "dateCancelled": "string",
              "cancelledByUserId": 2,
              "auditNote": "string"
            },
            {
              "id": 1,
              "seatNumber": 2,
              "fileName": "string",
              "barCode": "string",
              "inventoryId": 9,
              "invoiceLineId": 7,
              "purchaseLineId": 10,
              "section": "string",
              "row": "string",
              "notes": "string",
              "cost": 5,
              "faceValue": 1,
              "sellPrice": 1,
              "stockType": "ELECTRONIC",
              "eventId": 2,
              "accountId": 10,
              "status": "CANCELLED",
              "base64FileBytes": "string",
              "disclosures": [
                "string",
                "string",
                "string",
                "string",
                "string",
                "string"
              ],
              "attributes": [
                "string",
                "string",
                "string",
                "string",
                "string",
                "string",
                "string",
                "string",
                "string",
                "string"
              ],
              "createdDate": "string",
              "createdBy": "string",
              "lastUpdate": "string",
              "lastUpdateBy": "string",
              "dateCancelled": "string",
              "cancelledByUserId": 8,
              "auditNote": "string"
            },
            {
              "id": 8,
              "seatNumber": 1,
              "fileName": "string",
              "barCode": "string",
              "inventoryId": 7,
              "invoiceLineId": 3,
              "purchaseLineId": 3,
              "section": "string",
              "row": "string",
              "notes": "string",
              "cost": 2,
              "faceValue": 9,
              "sellPrice": 3,
              "stockType": "PAPERLESS_CARD",
              "eventId": 4,
              "accountId": 4,
              "status": "SOLD",
              "base64FileBytes": "string",
              "disclosures": [
                "string",
                "string"
              ],
              "attributes": [
                "string",
                "string",
                "string",
                "string",
                "string",
                "string",
                "string",
                "string",
                "string",
                "string"
              ],
              "createdDate": "string",
              "createdBy": "string",
              "lastUpdate": "string",
              "lastUpdateBy": "string",
              "dateCancelled": "string",
              "cancelledByUserId": 5,
              "auditNote": "string"
            },
            {
              "id": 8,
              "seatNumber": 7,
              "fileName": "string",
              "barCode": "string",
              "inventoryId": 6,
              "invoiceLineId": 4,
              "purchaseLineId": 5,
              "section": "string",
              "row": "string",
              "notes": "string",
              "cost": 2,
              "faceValue": 10,
              "sellPrice": 1,
              "stockType": "MOBILE_SCREENCAP",
              "eventId": 8,
              "accountId": 8,
              "status": "CANCELLED",
              "base64FileBytes": "string",
              "disclosures": [
                "string",
                "string",
                "string",
                "string",
                "string",
                "string",
                "string",
                "string"
              ],
              "attributes": [
                "string",
                "string",
                "string",
                "string"
              ],
              "createdDate": "string",
              "createdBy": "string",
              "lastUpdate": "string",
              "lastUpdateBy": "string",
              "dateCancelled": "string",
              "cancelledByUserId": 9,
              "auditNote": "string"
            },
            {
              "id": 4,
              "seatNumber": 10,
              "fileName": "string",
              "barCode": "string",
              "inventoryId": 6,
              "invoiceLineId": 5,
              "purchaseLineId": 8,
              "section": "string",
              "row": "string",
              "notes": "string",
              "cost": 7,
              "faceValue": 5,
              "sellPrice": 5,
              "stockType": "PAPERLESS_CARD",
              "eventId": 6,
              "accountId": 5,
              "status": "AVAILABLE",
              "base64FileBytes": "string",
              "disclosures": [
                "string",
                "string",
                "string",
                "string",
                "string",
                "string",
                "string",
                "string",
                "string"
              ],
              "attributes": [
                "string",
                "string",
                "string",
                "string",
                "string",
                "string",
                "string",
                "string",
                "string"
              ],
              "createdDate": "string",
              "createdBy": "string",
              "lastUpdate": "string",
              "lastUpdateBy": "string",
              "dateCancelled": "string",
              "cancelledByUserId": 8,
              "auditNote": "string"
            },
            {
              "id": 5,
              "seatNumber": 6,
              "fileName": "string",
              "barCode": "string",
              "inventoryId": 2,
              "invoiceLineId": 5,
              "purchaseLineId": 2,
              "section": "string",
              "row": "string",
              "notes": "string",
              "cost": 10,
              "faceValue": 4,
              "sellPrice": 10,
              "stockType": "FLASH",
              "eventId": 8,
              "accountId": 4,
              "status": "AVAILABLE",
              "base64FileBytes": "string",
              "disclosures": [
                "string",
                "string",
                "string",
                "string",
                "string"
              ],
              "attributes": [
                "string",
                "string",
                "string",
                "string"
              ],
              "createdDate": "string",
              "createdBy": "string",
              "lastUpdate": "string",
              "lastUpdateBy": "string",
              "dateCancelled": "string",
              "cancelledByUserId": 5,
              "auditNote": "string"
            },
            {
              "id": 1,
              "seatNumber": 8,
              "fileName": "string",
              "barCode": "string",
              "inventoryId": 6,
              "invoiceLineId": 9,
              "purchaseLineId": 9,
              "section": "string",
              "row": "string",
              "notes": "string",
              "cost": 8,
              "faceValue": 10,
              "sellPrice": 7,
              "stockType": "MOBILE_SCREENCAP",
              "eventId": 8,
              "accountId": 7,
              "status": "CANCELLED",
              "base64FileBytes": "string",
              "disclosures": [
                "string",
                "string",
                "string",
                "string"
              ],
              "attributes": [
                "string",
                "string",
                "string",
                "string",
                "string",
                "string",
                "string",
                "string"
              ],
              "createdDate": "string",
              "createdBy": "string",
              "lastUpdate": "string",
              "lastUpdateBy": "string",
              "dateCancelled": "string",
              "cancelledByUserId": 6,
              "auditNote": "string"
            },
            {
              "id": 9,
              "seatNumber": 5,
              "fileName": "string",
              "barCode": "string",
              "inventoryId": 1,
              "invoiceLineId": 4,
              "purchaseLineId": 8,
              "section": "string",
              "row": "string",
              "notes": "string",
              "cost": 7,
              "faceValue": 2,
              "sellPrice": 1,
              "stockType": "PAPERLESS",
              "eventId": 9,
              "accountId": 7,
              "status": "CANCELLED",
              "base64FileBytes": "string",
              "disclosures": [
                "string",
                "string",
                "string",
                "string",
                "string",
                "string",
                "string"
              ],
              "attributes": [
                "string",
                "string",
                "string",
                "string"
              ],
              "createdDate": "string",
              "createdBy": "string",
              "lastUpdate": "string",
              "lastUpdateBy": "string",
              "dateCancelled": "string",
              "cancelledByUserId": 9,
              "auditNote": "string"
            }
          ],
          "ticketIds": [
            4,
            9,
            2,
            10,
            6,
            5,
            7
          ],
          "stockType": "ELECTRONIC",
          "splitType": "ANY",
          "customSplit": "string",
          "listPrice": 9,
          "expectedValue": 3,
          "publicNotes": "string",
          "attributes": [
            "string",
            "string",
            "string",
            "string"
          ],
          "status": "ON_HOLD",
          "inHandDaysBeforeEvent": 9,
          "lastPriceUpdate": "string",
          "createdDate": "string",
          "createdBy": "string",
          "lastUpdate": "string",
          "lastUpdateBy": "string",
          "lastDeltaUpdate": "string",
          "version": 2,
          "tags": "string",
          "seatType": "PIGGYBACK",
          "eventMapping": {
            "eventName": "string",
            "venueName": "string",
            "eventDate": "string",
            "valid": true
          },
          "mappingId": 5,
          "exchangePosId": 9,
          "broadcast": true,
          "zoneSeating": true,
          "electronicTransfer": true,
          "optOutAutoPrice": false,
          "hideSeatNumbers": true,
          "vsrOption": "NONE",
          "replenishmentGroupId": 2,
          "replenishmentGroup": "string",
          "shownQuantity": 2,
          "ticketsMerged": true,
          "ticketsSplit": false,
          "auditNote": "string",
          "filesUploaded": true,
          "barCodesEntered": true
        },
        "cancelled": true,
        "delete": false,
        "cancel": false,
        "fillLineId": 5,
        "inventoryIds": [
          7,
          5,
          9,
          10,
          1,
          4,
          8,
          9
        ],
        "createdDate": "string",
        "createdBy": "string",
        "lastUpdate": "string",
        "lastUpdateBy": "string"
      },
      {
        "id": 6,
        "accountId": 5,
        "targetId": 5,
        "quantity": 7,
        "description": "string",
        "amount": 8,
        "lineType": "PURCHASE",
        "lineItemType": "INVENTORY",
        "itemIds": [
          4
        ],
        "inventory": {
          "inHandDate": "string",
          "id": 9,
          "accountId": 9,
          "eventId": 6,
          "quantity": 3,
          "notes": "string",
          "section": "string",
          "row": "string",
          "secondRow": "string",
          "lowSeat": 2,
          "highSeat": 9,
          "cost": 1,
          "faceValue": 1,
          "tickets": [
            {
              "id": 6,
              "seatNumber": 9,
              "fileName": "string",
              "barCode": "string",
              "inventoryId": 2,
              "invoiceLineId": 10,
              "purchaseLineId": 3,
              "section": "string",
              "row": "string",
              "notes": "string",
              "cost": 4,
              "faceValue": 10,
              "sellPrice": 10,
              "stockType": "PAPERLESS",
              "eventId": 7,
              "accountId": 8,
              "status": "AVAILABLE",
              "base64FileBytes": "string",
              "disclosures": [
                "string",
                "string",
                "string",
                "string",
                "string",
                "string",
                "string",
                "string",
                "string",
                "string"
              ],
              "attributes": [
                "string",
                "string",
                "string"
              ],
              "createdDate": "string",
              "createdBy": "string",
              "lastUpdate": "string",
              "lastUpdateBy": "string",
              "dateCancelled": "string",
              "cancelledByUserId": 2,
              "auditNote": "string"
            },
            {
              "id": 10,
              "seatNumber": 8,
              "fileName": "string",
              "barCode": "string",
              "inventoryId": 5,
              "invoiceLineId": 1,
              "purchaseLineId": 2,
              "section": "string",
              "row": "string",
              "notes": "string",
              "cost": 4,
              "faceValue": 6,
              "sellPrice": 9,
              "stockType": "FLASH",
              "eventId": 9,
              "accountId": 9,
              "status": "CANCELLED",
              "base64FileBytes": "string",
              "disclosures": [
                "string",
                "string",
                "string",
                "string",
                "string"
              ],
              "attributes": [
                "string",
                "string",
                "string",
                "string",
                "string",
                "string",
                "string",
                "string",
                "string"
              ],
              "createdDate": "string",
              "createdBy": "string",
              "lastUpdate": "string",
              "lastUpdateBy": "string",
              "dateCancelled": "string",
              "cancelledByUserId": 8,
              "auditNote": "string"
            },
            {
              "id": 1,
              "seatNumber": 7,
              "fileName": "string",
              "barCode": "string",
              "inventoryId": 3,
              "invoiceLineId": 4,
              "purchaseLineId": 3,
              "section": "string",
              "row": "string",
              "notes": "string",
              "cost": 3,
              "faceValue": 8,
              "sellPrice": 10,
              "stockType": "PAPERLESS",
              "eventId": 9,
              "accountId": 2,
              "status": "SOLD",
              "base64FileBytes": "string",
              "disclosures": [
                "string",
                "string",
                "string",
                "string",
                "string",
                "string",
                "string",
                "string",
                "string"
              ],
              "attributes": [
                "string",
                "string",
                "string",
                "string",
                "string"
              ],
              "createdDate": "string",
              "createdBy": "string",
              "lastUpdate": "string",
              "lastUpdateBy": "string",
              "dateCancelled": "string",
              "cancelledByUserId": 1,
              "auditNote": "string"
            },
            {
              "id": 10,
              "seatNumber": 3,
              "fileName": "string",
              "barCode": "string",
              "inventoryId": 8,
              "invoiceLineId": 9,
              "purchaseLineId": 2,
              "section": "string",
              "row": "string",
              "notes": "string",
              "cost": 4,
              "faceValue": 3,
              "sellPrice": 5,
              "stockType": "FLASH",
              "eventId": 6,
              "accountId": 6,
              "status": "CANCELLED",
              "base64FileBytes": "string",
              "disclosures": [
                "string"
              ],
              "attributes": [
                "string",
                "string",
                "string",
                "string",
                "string",
                "string",
                "string"
              ],
              "createdDate": "string",
              "createdBy": "string",
              "lastUpdate": "string",
              "lastUpdateBy": "string",
              "dateCancelled": "string",
              "cancelledByUserId": 5,
              "auditNote": "string"
            }
          ],
          "ticketIds": [
            6,
            5,
            1,
            10,
            5,
            8,
            7
          ],
          "stockType": "ELECTRONIC",
          "splitType": "NEVERLEAVEONE",
          "customSplit": "string",
          "listPrice": 5,
          "expectedValue": 5,
          "publicNotes": "string",
          "attributes": [
            "string",
            "string",
            "string",
            "string",
            "string"
          ],
          "status": "DEPLETED",
          "inHandDaysBeforeEvent": 10,
          "lastPriceUpdate": "string",
          "createdDate": "string",
          "createdBy": "string",
          "lastUpdate": "string",
          "lastUpdateBy": "string",
          "lastDeltaUpdate": "string",
          "version": 9,
          "tags": "string",
          "seatType": "ALTERNATING",
          "eventMapping": {
            "eventName": "string",
            "venueName": "string",
            "eventDate": "string",
            "valid": true
          },
          "mappingId": 8,
          "exchangePosId": 6,
          "broadcast": false,
          "zoneSeating": false,
          "electronicTransfer": true,
          "optOutAutoPrice": true,
          "hideSeatNumbers": false,
          "vsrOption": "EVENT_INVENTORY",
          "replenishmentGroupId": 7,
          "replenishmentGroup": "string",
          "shownQuantity": 10,
          "ticketsMerged": false,
          "ticketsSplit": true,
          "auditNote": "string",
          "filesUploaded": true,
          "barCodesEntered": true
        },
        "cancelled": true,
        "delete": false,
        "cancel": true,
        "fillLineId": 4,
        "inventoryIds": [
          2,
          4,
          5,
          9,
          9,
          3
        ],
        "createdDate": "string",
        "createdBy": "string",
        "lastUpdate": "string",
        "lastUpdateBy": "string"
      }
    ],
    "purchaseTerm": "NET30",
    "paymentMethod": "VENMO",
    "paymentRef": "string",
    "deliveryMethod": "WILLCALL",
    "shippingAddressId": 8,
    "billingAddressId": 9,
    "taxAmount": 10,
    "shippingAmount": 7,
    "otherAmount": 1,
    "internalNotes": "string",
    "publicNotes": "string",
    "createdDate": "string",
    "lastUpdate": "string",
    "dueDate": "string",
    "tags": "string",
    "createdBy": "string",
    "lastUpdateBy": "string",
    "externalRef": "string",
    "paymentStatus": "PARTIAL",
    "creditCardId": 4,
    "creditCardGroupId": 9,
    "currencyCode": "CAD",
    "payments": [
      {
        "id": 2,
        "accountId": 3,
        "referenceNumber": "string",
        "amount": 2,
        "paymentDate": "string",
        "userId": 4,
        "entityId": 8,
        "paymentType": "INVOICE",
        "paymentMethod": "PAYPAL",
        "purchaseId": 7
      },
      {
        "id": 5,
        "accountId": 2,
        "referenceNumber": "string",
        "amount": 5,
        "paymentDate": "string",
        "userId": 4,
        "entityId": 3,
        "paymentType": "PURCHASE",
        "paymentMethod": "AR",
        "purchaseId": 8
      }
    ],
    "notes": [
      {
        "id": 9,
        "userId": 9,
        "accountId": 6,
        "purchaseId": 5,
        "date": "string",
        "text": "string",
        "author": "string"
      },
      {
        "id": 6,
        "userId": 3,
        "accountId": 6,
        "purchaseId": 5,
        "date": "string",
        "text": "string",
        "author": "string"
      },
      {
        "id": 6,
        "userId": 9,
        "accountId": 6,
        "purchaseId": 3,
        "date": "string",
        "text": "string",
        "author": "string"
      },
      {
        "id": 10,
        "userId": 9,
        "accountId": 1,
        "purchaseId": 10,
        "date": "string",
        "text": "string",
        "author": "string"
      },
      {
        "id": 6,
        "userId": 9,
        "accountId": 4,
        "purchaseId": 6,
        "date": "string",
        "text": "string",
        "author": "string"
      },
      {
        "id": 5,
        "userId": 3,
        "accountId": 1,
        "purchaseId": 8,
        "date": "string",
        "text": "string",
        "author": "string"
      }
    ],
    "received": true,
    "consignment": {
      "id": 7,
      "accountId": 6,
      "purchaseId": 9,
      "amount": 6,
      "mode": "FIXED",
      "completed": true,
      "created": "string",
      "lines": [
        {
          "id": 7,
          "consignmentId": 1,
          "accountId": 6,
          "invoiceLineId": 9,
          "open": false,
          "originalUnitCost": 8,
          "mode": "FIXED",
          "consignmentValue": 8
        },
        {
          "id": 4,
          "consignmentId": 10,
          "accountId": 9,
          "invoiceLineId": 7,
          "open": false,
          "originalUnitCost": 6,
          "mode": "PERCENT",
          "consignmentValue": 5
        },
        {
          "id": 8,
          "consignmentId": 3,
          "accountId": 7,
          "invoiceLineId": 3,
          "open": false,
          "originalUnitCost": 9,
          "mode": "PERCENT",
          "consignmentValue": 7
        },
        {
          "id": 10,
          "consignmentId": 3,
          "accountId": 7,
          "invoiceLineId": 9,
          "open": false,
          "originalUnitCost": 4,
          "mode": "PERCENT",
          "consignmentValue": 9
        },
        {
          "id": 2,
          "consignmentId": 9,
          "accountId": 8,
          "invoiceLineId": 7,
          "open": false,
          "originalUnitCost": 5,
          "mode": "PERCENT",
          "consignmentValue": 9
        },
        {
          "id": 6,
          "consignmentId": 8,
          "accountId": 6,
          "invoiceLineId": 2,
          "open": true,
          "originalUnitCost": 6,
          "mode": "FIXED",
          "consignmentValue": 9
        },
        {
          "id": 6,
          "consignmentId": 7,
          "accountId": 9,
          "invoiceLineId": 2,
          "open": true,
          "originalUnitCost": 5,
          "mode": "PERCENT",
          "consignmentValue": 5
        },
        {
          "id": 1,
          "consignmentId": 7,
          "accountId": 7,
          "invoiceLineId": 9,
          "open": true,
          "originalUnitCost": 7,
          "mode": "PERCENT",
          "consignmentValue": 10
        }
      ]
    },
    "cooperative": true,
    "status": "DELIVERY_FAILURE",
    "airbill": "string",
    "outstandingBalance": 7,
    "autoPo": true,
    "displayName": "string",
    "consignmentStatus": "string",
    "eventName": "string",
    "quantity": 5,
    "section": "string",
    "row": "string",
    "lineCount": 5,
    "lineTotal": 2,
    "total": 6,
    "totalPayments": 4,
    "lastPurchasePaymentNote": "string",
    "hasZoneSeatingInventory": true
  }
]