{
  "actions": [
    {
      "name": "getPerformers1",
      "protocol": "REST",
      "method": "GET",
      "entitypath": "{base_path}/{version}/event_positions/performers?{query}",
      "requestSchema": "schema.json",
      "responseSchema": "schema.json",
      "timeout": 0,
      "sendEmpty": false,
      "sendGetBody": false,
      "requestDatatype": "JSON",
      "responseDatatype": "JSON",
      "headers": {},
      "responseObjects": [
        {
          "type": "default",
          "key": "",
          "mockFile": "mockdatafiles/getPerformers1-default.json"
        }
      ]
    },
    {
      "name": "getCategories1",
      "protocol": "REST",
      "method": "GET",
      "entitypath": "{base_path}/{version}/event_positions/categories?{query}",
      "requestSchema": "schema.json",
      "responseSchema": "schema.json",
      "timeout": 0,
      "sendEmpty": false,
      "sendGetBody": false,
      "requestDatatype": "JSON",
      "responseDatatype": "JSON",
      "headers": {},
      "responseObjects": [
        {
          "type": "default",
          "key": "",
          "mockFile": "mockdatafiles/getCategories1-default.json"
        }
      ]
    },
    {
      "name": "index1",
      "protocol": "REST",
      "method": "GET",
      "entitypath": "{base_path}/{version}/event_positions?{query}",
      "requestSchema": "schema.json",
      "responseSchema": "schema.json",
      "timeout": 0,
      "sendEmpty": false,
      "sendGetBody": false,
      "requestDatatype": "JSON",
      "responseDatatype": "JSON",
      "headers": {},
      "responseObjects": [
        {
          "type": "default",
          "key": "",
          "mockFile": "mockdatafiles/index1-default.json"
        }
      ]
    }
  ]
}