{
  "actions": [
    {
      "name": "postAssetSearchbycriteria",
      "protocol": "REST",
      "method": "POST",
      "entitypath": "{base_path}/{version}/qps/rest/2.0/search/am/asset?{query}",
      "requestSchema": "schema.json",
      "responseSchema": "schema.json",
      "timeout": 0,
      "sendEmpty": false,
      "requestDatatype": "XML",
      "responseDatatype": "JSON",
      "headers": {},
      "responseObjects": [
        {
          "type": "default",
          "key": "",
          "mockFile": ""
        }
      ]
    },
    {
      "name": "searchtofindtag",
      "protocol": "REST",
      "method": "POST",
      "entitypath": "{base_path}/{version}/qps/rest/2.0/search/am/tag?{query}",
      "requestSchema": "schema.json",
      "responseSchema": "schema.json",
      "timeout": 0,
      "sendEmpty": false,
      "requestDatatype": "XML",
      "responseDatatype": "JSON",
      "headers": {},
      "responseObjects": [
        {
          "type": "default",
          "key": "",
          "mockFile": ""
        }
      ]
    }
  ]
}