{
  "actions": [
    {
      "name": "step1LaunchReportthatSupportRequested",
      "protocol": "REST",
      "method": "POST",
      "entitypath": "{base_path}/{version}/api/2.0/fo/report?{query}",
      "requestSchema": "schema.json",
      "responseSchema": "schema.json",
      "timeout": 0,
      "sendEmpty": false,
      "requestDatatype": "URLENCODE",
      "responseDatatype": "JSON",
      "headers": {},
      "responseObjects": [
        {
          "type": "default",
          "key": "",
          "mockFile": ""
        }
      ]
    }
  ]
}