{
  "openapi": "3.0.0",
  "info": {
    "title": "Your Title Here",
    "description": "This is a sample description. You can find out more about the OpenAPI Specification at http://spec.openapis.org/oas/v3.0.3.",
    "contact": {
      "email": "apiteam@swagger.io"
    },
    "version": "1.0.0"
  },
  "servers": [
    {
      "url": "https://{defaultHost}",
      "variables": {
        "defaultHost": {
          "default": "www.example.com"
        }
      }
    }
  ],
  "paths": {
    "/restapi/v10.1/Policies/SecurityPreRules": {
      "get": {
        "tags": [
          "Security"
        ],
        "summary": "Get Security PreRules",
        "description": "Get Security PreRules",
        "operationId": "getSecurityPreRules",
        "parameters": [
          {
            "name": "query",
            "in": "query",
            "description": "The query object",
            "required": true,
            "style": "form",
            "explode": true,
            "schema": {
              "type": "object"
            }
          }
        ],
        "responses": {
          "200": {
            "description": "successful operation",
            "headers": {}
          }
        },
        "deprecated": false
      },
      "post": {
        "tags": [
          "Security"
        ],
        "summary": "Create Security PreRules",
        "description": "Create Security PreRules",
        "operationId": "createSecurityPreRules",
        "parameters": [
          {
            "name": "query",
            "in": "query",
            "description": "The query object",
            "required": true,
            "style": "form",
            "explode": true,
            "schema": {
              "type": "object"
            }
          }
        ],
        "requestBody": {
          "description": "The payload object",
          "content": {
            "text/plain": {
              "schema": {
                "type": "object",
                "description": "The payload object"
              }
            }
          },
          "required": true
        },
        "responses": {
          "200": {
            "description": "successful operation",
            "headers": {}
          }
        },
        "deprecated": false
      },
      "put": {
        "tags": [
          "Security"
        ],
        "summary": "Update Security PreRules",
        "description": "Update Security PreRules",
        "operationId": "updateSecurityPreRules",
        "parameters": [
          {
            "name": "query",
            "in": "query",
            "description": "The query object",
            "required": true,
            "style": "form",
            "explode": true,
            "schema": {
              "type": "object"
            }
          }
        ],
        "requestBody": {
          "description": "The payload object",
          "content": {
            "text/plain": {
              "schema": {
                "type": "object",
                "description": "The payload object"
              }
            }
          },
          "required": true
        },
        "responses": {
          "200": {
            "description": "successful operation",
            "headers": {}
          }
        },
        "deprecated": false
      },
      "delete": {
        "tags": [
          "Security"
        ],
        "summary": "Delete Security PreRules",
        "description": "Delete Security PreRules",
        "operationId": "deleteSecurityPreRules",
        "parameters": [
          {
            "name": "query",
            "in": "query",
            "description": "The query object",
            "required": true,
            "style": "form",
            "explode": true,
            "schema": {
              "type": "object"
            }
          }
        ],
        "responses": {
          "200": {
            "description": "successful operation",
            "headers": {}
          }
        },
        "deprecated": false
      }
    },
    "/restapi/v10.1/Policies/SecurityPostRules": {
      "get": {
        "tags": [
          "Security"
        ],
        "summary": "Get Security PostRules",
        "description": "Get Security PostRules",
        "operationId": "getSecurityPostRules",
        "parameters": [
          {
            "name": "query",
            "in": "query",
            "description": "The query object",
            "required": true,
            "style": "form",
            "explode": true,
            "schema": {
              "type": "object"
            }
          }
        ],
        "responses": {
          "200": {
            "description": "successful operation",
            "headers": {}
          }
        },
        "deprecated": false
      },
      "post": {
        "tags": [
          "Security"
        ],
        "summary": "Create Security PostRules",
        "description": "Create Security PostRules",
        "operationId": "createSecurityPostRules",
        "parameters": [
          {
            "name": "query",
            "in": "query",
            "description": "The query object",
            "required": true,
            "style": "form",
            "explode": true,
            "schema": {
              "type": "object"
            }
          }
        ],
        "requestBody": {
          "description": "The payload object",
          "content": {
            "text/plain": {
              "schema": {
                "type": "object",
                "description": "The payload object"
              }
            }
          },
          "required": true
        },
        "responses": {
          "200": {
            "description": "successful operation",
            "headers": {}
          }
        },
        "deprecated": false
      },
      "put": {
        "tags": [
          "Security"
        ],
        "summary": "Update Security PostRules",
        "description": "Update Security PostRules",
        "operationId": "updateSecurityPostRules",
        "parameters": [
          {
            "name": "query",
            "in": "query",
            "description": "The query object",
            "required": true,
            "style": "form",
            "explode": true,
            "schema": {
              "type": "object"
            }
          }
        ],
        "requestBody": {
          "description": "The payload object",
          "content": {
            "text/plain": {
              "schema": {
                "type": "object",
                "description": "The payload object"
              }
            }
          },
          "required": true
        },
        "responses": {
          "200": {
            "description": "successful operation",
            "headers": {}
          }
        },
        "deprecated": false
      },
      "delete": {
        "tags": [
          "Security"
        ],
        "summary": "Delete Security PostRules",
        "description": "Delete Security PostRules",
        "operationId": "deleteSecurityPostRules",
        "parameters": [
          {
            "name": "query",
            "in": "query",
            "description": "The query object",
            "required": true,
            "style": "form",
            "explode": true,
            "schema": {
              "type": "object"
            }
          }
        ],
        "responses": {
          "200": {
            "description": "successful operation",
            "headers": {}
          }
        },
        "deprecated": false
      }
    },
    "/restapi/v10.1/Policies/NATPreRules": {
      "get": {
        "tags": [
          "Rules"
        ],
        "summary": "Get NAT PreRules",
        "description": "Get NAT PreRules",
        "operationId": "getNATPreRules",
        "parameters": [
          {
            "name": "query",
            "in": "query",
            "description": "The query object",
            "required": true,
            "style": "form",
            "explode": true,
            "schema": {
              "type": "object"
            }
          }
        ],
        "responses": {
          "200": {
            "description": "successful operation",
            "headers": {}
          }
        },
        "deprecated": false
      },
      "post": {
        "tags": [
          "Rules"
        ],
        "summary": "Create NAT PreRules",
        "description": "Create NAT PreRules",
        "operationId": "createNATPreRules",
        "parameters": [
          {
            "name": "query",
            "in": "query",
            "description": "The query object",
            "required": true,
            "style": "form",
            "explode": true,
            "schema": {
              "type": "object"
            }
          }
        ],
        "requestBody": {
          "description": "The payload object",
          "content": {
            "text/plain": {
              "schema": {
                "type": "object",
                "description": "The payload object"
              }
            }
          },
          "required": true
        },
        "responses": {
          "200": {
            "description": "successful operation",
            "headers": {}
          }
        },
        "deprecated": false
      },
      "put": {
        "tags": [
          "Rules"
        ],
        "summary": "Update NAT PreRules",
        "description": "Update NAT PreRules",
        "operationId": "updateNATPreRules",
        "parameters": [
          {
            "name": "query",
            "in": "query",
            "description": "The query object",
            "required": true,
            "style": "form",
            "explode": true,
            "schema": {
              "type": "object"
            }
          }
        ],
        "requestBody": {
          "description": "The payload object",
          "content": {
            "text/plain": {
              "schema": {
                "type": "object",
                "description": "The payload object"
              }
            }
          },
          "required": true
        },
        "responses": {
          "200": {
            "description": "successful operation",
            "headers": {}
          }
        },
        "deprecated": false
      },
      "delete": {
        "tags": [
          "Rules"
        ],
        "summary": "Delete NAT PreRules",
        "description": "Delete NAT PreRules",
        "operationId": "deleteNATPreRules",
        "parameters": [
          {
            "name": "query",
            "in": "query",
            "description": "The query object",
            "required": true,
            "style": "form",
            "explode": true,
            "schema": {
              "type": "object"
            }
          }
        ],
        "responses": {
          "200": {
            "description": "successful operation",
            "headers": {}
          }
        },
        "deprecated": false
      }
    },
    "/restapi/v10.1/Policies/NATPostRules": {
      "get": {
        "tags": [
          "Rules"
        ],
        "summary": "Get NAT PostRules",
        "description": "Get NAT PostRules",
        "operationId": "getNATPostRules",
        "parameters": [
          {
            "name": "query",
            "in": "query",
            "description": "The query object",
            "required": true,
            "style": "form",
            "explode": true,
            "schema": {
              "type": "object"
            }
          }
        ],
        "responses": {
          "200": {
            "description": "successful operation",
            "headers": {}
          }
        },
        "deprecated": false
      },
      "post": {
        "tags": [
          "Rules"
        ],
        "summary": "Create NAT PostRules",
        "description": "Create NAT PostRules",
        "operationId": "createNATPostRules",
        "parameters": [
          {
            "name": "query",
            "in": "query",
            "description": "The query object",
            "required": true,
            "style": "form",
            "explode": true,
            "schema": {
              "type": "object"
            }
          }
        ],
        "requestBody": {
          "description": "The payload object",
          "content": {
            "text/plain": {
              "schema": {
                "type": "object",
                "description": "The payload object"
              }
            }
          },
          "required": true
        },
        "responses": {
          "200": {
            "description": "successful operation",
            "headers": {}
          }
        },
        "deprecated": false
      },
      "put": {
        "tags": [
          "Rules"
        ],
        "summary": "Update NAT PostRules",
        "description": "Update NAT PostRules",
        "operationId": "updateNATPostRules",
        "parameters": [
          {
            "name": "query",
            "in": "query",
            "description": "The query object",
            "required": true,
            "style": "form",
            "explode": true,
            "schema": {
              "type": "object"
            }
          }
        ],
        "requestBody": {
          "description": "The payload object",
          "content": {
            "text/plain": {
              "schema": {
                "type": "object",
                "description": "The payload object"
              }
            }
          },
          "required": true
        },
        "responses": {
          "200": {
            "description": "successful operation",
            "headers": {}
          }
        },
        "deprecated": false
      },
      "delete": {
        "tags": [
          "Rules"
        ],
        "summary": "Delete NAT PostRules",
        "description": "Delete NAT PostRules",
        "operationId": "deleteNATPostRules",
        "parameters": [
          {
            "name": "query",
            "in": "query",
            "description": "The query object",
            "required": true,
            "style": "form",
            "explode": true,
            "schema": {
              "type": "object"
            }
          }
        ],
        "responses": {
          "200": {
            "description": "successful operation",
            "headers": {}
          }
        },
        "deprecated": false
      }
    },
    "/restapi/v10.1/Policies/QoSPreRules": {
      "get": {
        "tags": [
          "Rules"
        ],
        "summary": "Get QoS PreRules",
        "description": "Get QoS PreRules",
        "operationId": "getQoSPreRules",
        "parameters": [
          {
            "name": "query",
            "in": "query",
            "description": "The query object",
            "required": true,
            "style": "form",
            "explode": true,
            "schema": {
              "type": "object"
            }
          }
        ],
        "responses": {
          "200": {
            "description": "successful operation",
            "headers": {}
          }
        },
        "deprecated": false
      },
      "post": {
        "tags": [
          "Rules"
        ],
        "summary": "Create QoS PreRules",
        "description": "Create QoS PreRules",
        "operationId": "createQoSPreRules",
        "parameters": [
          {
            "name": "query",
            "in": "query",
            "description": "The query object",
            "required": true,
            "style": "form",
            "explode": true,
            "schema": {
              "type": "object"
            }
          }
        ],
        "requestBody": {
          "description": "The payload object",
          "content": {
            "text/plain": {
              "schema": {
                "type": "object",
                "description": "The payload object"
              }
            }
          },
          "required": true
        },
        "responses": {
          "200": {
            "description": "successful operation",
            "headers": {}
          }
        },
        "deprecated": false
      },
      "put": {
        "tags": [
          "Rules"
        ],
        "summary": "Update QoS PreRules",
        "description": "Update QoS PreRules",
        "operationId": "updateQoSPreRules",
        "parameters": [
          {
            "name": "query",
            "in": "query",
            "description": "The query object",
            "required": true,
            "style": "form",
            "explode": true,
            "schema": {
              "type": "object"
            }
          }
        ],
        "requestBody": {
          "description": "The payload object",
          "content": {
            "text/plain": {
              "schema": {
                "type": "object",
                "description": "The payload object"
              }
            }
          },
          "required": true
        },
        "responses": {
          "200": {
            "description": "successful operation",
            "headers": {}
          }
        },
        "deprecated": false
      },
      "delete": {
        "tags": [
          "Rules"
        ],
        "summary": "Delete QoS PreRules",
        "description": "Delete QoS PreRules",
        "operationId": "deleteQoSPreRules",
        "parameters": [
          {
            "name": "query",
            "in": "query",
            "description": "The query object",
            "required": true,
            "style": "form",
            "explode": true,
            "schema": {
              "type": "object"
            }
          }
        ],
        "responses": {
          "200": {
            "description": "successful operation",
            "headers": {}
          }
        },
        "deprecated": false
      }
    },
    "/restapi/v10.1/Policies/QoSPostRules": {
      "get": {
        "tags": [
          "Rules"
        ],
        "summary": "Get QoS PostRules",
        "description": "Get QoS PostRules",
        "operationId": "getQoSPostRules",
        "parameters": [
          {
            "name": "query",
            "in": "query",
            "description": "The query object",
            "required": true,
            "style": "form",
            "explode": true,
            "schema": {
              "type": "object"
            }
          }
        ],
        "responses": {
          "200": {
            "description": "successful operation",
            "headers": {}
          }
        },
        "deprecated": false
      },
      "post": {
        "tags": [
          "Rules"
        ],
        "summary": "Create QoS PostRules",
        "description": "Create QoS PostRules",
        "operationId": "createQoSPostRules",
        "parameters": [
          {
            "name": "query",
            "in": "query",
            "description": "The query object",
            "required": true,
            "style": "form",
            "explode": true,
            "schema": {
              "type": "object"
            }
          }
        ],
        "requestBody": {
          "description": "The payload object",
          "content": {
            "text/plain": {
              "schema": {
                "type": "object",
                "description": "The payload object"
              }
            }
          },
          "required": true
        },
        "responses": {
          "200": {
            "description": "successful operation",
            "headers": {}
          }
        },
        "deprecated": false
      },
      "put": {
        "tags": [
          "Rules"
        ],
        "summary": "Update QoS PostRules",
        "description": "Update QoS PostRules",
        "operationId": "updateQoSPostRules",
        "parameters": [
          {
            "name": "query",
            "in": "query",
            "description": "The query object",
            "required": true,
            "style": "form",
            "explode": true,
            "schema": {
              "type": "object"
            }
          }
        ],
        "requestBody": {
          "description": "The payload object",
          "content": {
            "text/plain": {
              "schema": {
                "type": "object",
                "description": "The payload object"
              }
            }
          },
          "required": true
        },
        "responses": {
          "200": {
            "description": "successful operation",
            "headers": {}
          }
        },
        "deprecated": false
      },
      "delete": {
        "tags": [
          "Rules"
        ],
        "summary": "Delete QoS PostRules",
        "description": "Delete QoS PostRules",
        "operationId": "deleteQoSPostRules",
        "parameters": [
          {
            "name": "query",
            "in": "query",
            "description": "The query object",
            "required": true,
            "style": "form",
            "explode": true,
            "schema": {
              "type": "object"
            }
          }
        ],
        "responses": {
          "200": {
            "description": "successful operation",
            "headers": {}
          }
        },
        "deprecated": false
      }
    },
    "/restapi/v10.1/Policies/PolicyBasedForwardingPreRules": {
      "get": {
        "tags": [
          "Rules"
        ],
        "summary": "Get Policy Based Forwarding PreRules",
        "description": "Get Policy Based Forwarding PreRules",
        "operationId": "getPolicyBasedForwardingPreRules",
        "parameters": [
          {
            "name": "query",
            "in": "query",
            "description": "The query object",
            "required": true,
            "style": "form",
            "explode": true,
            "schema": {
              "type": "object"
            }
          }
        ],
        "responses": {
          "200": {
            "description": "successful operation",
            "headers": {}
          }
        },
        "deprecated": false
      },
      "post": {
        "tags": [
          "Rules"
        ],
        "summary": "Create Policy Based Forwarding PreRules",
        "description": "Create Policy Based Forwarding PreRules",
        "operationId": "createPolicyBasedForwardingPreRules",
        "parameters": [
          {
            "name": "query",
            "in": "query",
            "description": "The query object",
            "required": true,
            "style": "form",
            "explode": true,
            "schema": {
              "type": "object"
            }
          }
        ],
        "requestBody": {
          "description": "The payload object",
          "content": {
            "text/plain": {
              "schema": {
                "type": "object",
                "description": "The payload object"
              }
            }
          },
          "required": true
        },
        "responses": {
          "200": {
            "description": "successful operation",
            "headers": {}
          }
        },
        "deprecated": false
      },
      "put": {
        "tags": [
          "Rules"
        ],
        "summary": "Update Policy Based Forwarding PreRules",
        "description": "Update Policy Based Forwarding PreRules",
        "operationId": "updatePolicyBasedForwardingPreRules",
        "parameters": [
          {
            "name": "query",
            "in": "query",
            "description": "The query object",
            "required": true,
            "style": "form",
            "explode": true,
            "schema": {
              "type": "object"
            }
          }
        ],
        "requestBody": {
          "description": "The payload object",
          "content": {
            "text/plain": {
              "schema": {
                "type": "object",
                "description": "The payload object"
              }
            }
          },
          "required": true
        },
        "responses": {
          "200": {
            "description": "successful operation",
            "headers": {}
          }
        },
        "deprecated": false
      },
      "delete": {
        "tags": [
          "Rules"
        ],
        "summary": "Delete Policy Based Forwarding PreRules",
        "description": "Delete Policy Based Forwarding PreRules",
        "operationId": "deletePolicyBasedForwardingPreRules",
        "parameters": [
          {
            "name": "query",
            "in": "query",
            "description": "The query object",
            "required": true,
            "style": "form",
            "explode": true,
            "schema": {
              "type": "object"
            }
          }
        ],
        "responses": {
          "200": {
            "description": "successful operation",
            "headers": {}
          }
        },
        "deprecated": false
      }
    },
    "/restapi/v10.1/Policies/PolicyBasedForwardingPostRules": {
      "get": {
        "tags": [
          "Rules"
        ],
        "summary": "Get Policy Based Forwarding PostRules",
        "description": "Get Policy Based Forwarding PostRules",
        "operationId": "getPolicyBasedForwardingPostRules",
        "parameters": [
          {
            "name": "query",
            "in": "query",
            "description": "The query object",
            "required": true,
            "style": "form",
            "explode": true,
            "schema": {
              "type": "object"
            }
          }
        ],
        "responses": {
          "200": {
            "description": "successful operation",
            "headers": {}
          }
        },
        "deprecated": false
      },
      "post": {
        "tags": [
          "Rules"
        ],
        "summary": "Create Policy Based Forwarding PostRules",
        "description": "Create Policy Based Forwarding PostRules",
        "operationId": "createPolicyBasedForwardingPostRules",
        "parameters": [
          {
            "name": "query",
            "in": "query",
            "description": "The query object",
            "required": true,
            "style": "form",
            "explode": true,
            "schema": {
              "type": "object"
            }
          }
        ],
        "requestBody": {
          "description": "The payload object",
          "content": {
            "text/plain": {
              "schema": {
                "type": "object",
                "description": "The payload object"
              }
            }
          },
          "required": true
        },
        "responses": {
          "200": {
            "description": "successful operation",
            "headers": {}
          }
        },
        "deprecated": false
      },
      "put": {
        "tags": [
          "Rules"
        ],
        "summary": "Update Policy Based Forwarding PostRules",
        "description": "Update Policy Based Forwarding PostRules",
        "operationId": "updatePolicyBasedForwardingPostRules",
        "parameters": [
          {
            "name": "query",
            "in": "query",
            "description": "The query object",
            "required": true,
            "style": "form",
            "explode": true,
            "schema": {
              "type": "object"
            }
          }
        ],
        "requestBody": {
          "description": "The payload object",
          "content": {
            "text/plain": {
              "schema": {
                "type": "object",
                "description": "The payload object"
              }
            }
          },
          "required": true
        },
        "responses": {
          "200": {
            "description": "successful operation",
            "headers": {}
          }
        },
        "deprecated": false
      },
      "delete": {
        "tags": [
          "Rules"
        ],
        "summary": "Delete Policy Based Forwarding PostRules",
        "description": "Delete Policy Based Forwarding PostRules",
        "operationId": "deletePolicyBasedForwardingPostRules",
        "parameters": [
          {
            "name": "query",
            "in": "query",
            "description": "The query object",
            "required": true,
            "style": "form",
            "explode": true,
            "schema": {
              "type": "object"
            }
          }
        ],
        "responses": {
          "200": {
            "description": "successful operation",
            "headers": {}
          }
        },
        "deprecated": false
      }
    },
    "/restapi/v10.1/Policies/DecryptionPreRules": {
      "get": {
        "tags": [
          "Rules"
        ],
        "summary": "Get Decryption PreRules",
        "description": "Get Decryption PreRules",
        "operationId": "getDecryptionPreRules",
        "parameters": [
          {
            "name": "query",
            "in": "query",
            "description": "The query object",
            "required": true,
            "style": "form",
            "explode": true,
            "schema": {
              "type": "object"
            }
          }
        ],
        "responses": {
          "200": {
            "description": "successful operation",
            "headers": {}
          }
        },
        "deprecated": false
      },
      "post": {
        "tags": [
          "Rules"
        ],
        "summary": "Create Decryption PreRules",
        "description": "Create Decryption PreRules",
        "operationId": "createDecryptionPreRules",
        "parameters": [
          {
            "name": "query",
            "in": "query",
            "description": "The query object",
            "required": true,
            "style": "form",
            "explode": true,
            "schema": {
              "type": "object"
            }
          }
        ],
        "requestBody": {
          "description": "The payload object",
          "content": {
            "text/plain": {
              "schema": {
                "type": "object",
                "description": "The payload object"
              }
            }
          },
          "required": true
        },
        "responses": {
          "200": {
            "description": "successful operation",
            "headers": {}
          }
        },
        "deprecated": false
      },
      "put": {
        "tags": [
          "Rules"
        ],
        "summary": "Update Decryption PreRules",
        "description": "Update Decryption PreRules",
        "operationId": "updateDecryptionPreRules",
        "parameters": [
          {
            "name": "query",
            "in": "query",
            "description": "The query object",
            "required": true,
            "style": "form",
            "explode": true,
            "schema": {
              "type": "object"
            }
          }
        ],
        "requestBody": {
          "description": "The payload object",
          "content": {
            "text/plain": {
              "schema": {
                "type": "object",
                "description": "The payload object"
              }
            }
          },
          "required": true
        },
        "responses": {
          "200": {
            "description": "successful operation",
            "headers": {}
          }
        },
        "deprecated": false
      },
      "delete": {
        "tags": [
          "Rules"
        ],
        "summary": "Delete Decryption PreRules",
        "description": "Delete Decryption PreRules",
        "operationId": "deleteDecryptionPreRules",
        "parameters": [
          {
            "name": "query",
            "in": "query",
            "description": "The query object",
            "required": true,
            "style": "form",
            "explode": true,
            "schema": {
              "type": "object"
            }
          }
        ],
        "responses": {
          "200": {
            "description": "successful operation",
            "headers": {}
          }
        },
        "deprecated": false
      }
    },
    "/restapi/v10.1/Policies/DecryptionPostRules": {
      "get": {
        "tags": [
          "Rules"
        ],
        "summary": "Get Decryption PostRules",
        "description": "Get Decryption PostRules",
        "operationId": "getDecryptionPostRules",
        "parameters": [
          {
            "name": "query",
            "in": "query",
            "description": "The query object",
            "required": true,
            "style": "form",
            "explode": true,
            "schema": {
              "type": "object"
            }
          }
        ],
        "responses": {
          "200": {
            "description": "successful operation",
            "headers": {}
          }
        },
        "deprecated": false
      },
      "post": {
        "tags": [
          "Rules"
        ],
        "summary": "Create Decryption PostRules",
        "description": "Create Decryption PostRules",
        "operationId": "createDecryptionPostRules",
        "parameters": [
          {
            "name": "query",
            "in": "query",
            "description": "The query object",
            "required": true,
            "style": "form",
            "explode": true,
            "schema": {
              "type": "object"
            }
          }
        ],
        "requestBody": {
          "description": "The payload object",
          "content": {
            "text/plain": {
              "schema": {
                "type": "object",
                "description": "The payload object"
              }
            }
          },
          "required": true
        },
        "responses": {
          "200": {
            "description": "successful operation",
            "headers": {}
          }
        },
        "deprecated": false
      },
      "put": {
        "tags": [
          "Rules"
        ],
        "summary": "Update Decryption PostRules",
        "description": "Update Decryption PostRules",
        "operationId": "updateDecryptionPostRules",
        "parameters": [
          {
            "name": "query",
            "in": "query",
            "description": "The query object",
            "required": true,
            "style": "form",
            "explode": true,
            "schema": {
              "type": "object"
            }
          }
        ],
        "requestBody": {
          "description": "The payload object",
          "content": {
            "text/plain": {
              "schema": {
                "type": "object",
                "description": "The payload object"
              }
            }
          },
          "required": true
        },
        "responses": {
          "200": {
            "description": "successful operation",
            "headers": {}
          }
        },
        "deprecated": false
      },
      "delete": {
        "tags": [
          "Rules"
        ],
        "summary": "Delete Decryption PostRules",
        "description": "Delete Decryption PostRules",
        "operationId": "deleteDecryptionPostRules",
        "parameters": [
          {
            "name": "query",
            "in": "query",
            "description": "The query object",
            "required": true,
            "style": "form",
            "explode": true,
            "schema": {
              "type": "object"
            }
          }
        ],
        "responses": {
          "200": {
            "description": "successful operation",
            "headers": {}
          }
        },
        "deprecated": false
      }
    },
    "/restapi/v10.1/Policies/TunnelInspectionPreRules": {
      "get": {
        "tags": [
          "Rules"
        ],
        "summary": "Get Tunnel Inspection PreRules",
        "description": "Get Tunnel Inspection PreRules",
        "operationId": "getTunnelInspectionPreRules",
        "parameters": [
          {
            "name": "query",
            "in": "query",
            "description": "The query object",
            "required": true,
            "style": "form",
            "explode": true,
            "schema": {
              "type": "object"
            }
          }
        ],
        "responses": {
          "200": {
            "description": "successful operation",
            "headers": {}
          }
        },
        "deprecated": false
      },
      "post": {
        "tags": [
          "Rules"
        ],
        "summary": "Create Tunnel Inspection PreRules",
        "description": "Create Tunnel Inspection PreRules",
        "operationId": "createTunnelInspectionPreRules",
        "parameters": [
          {
            "name": "query",
            "in": "query",
            "description": "The query object",
            "required": true,
            "style": "form",
            "explode": true,
            "schema": {
              "type": "object"
            }
          }
        ],
        "requestBody": {
          "description": "The payload object",
          "content": {
            "text/plain": {
              "schema": {
                "type": "object",
                "description": "The payload object"
              }
            }
          },
          "required": true
        },
        "responses": {
          "200": {
            "description": "successful operation",
            "headers": {}
          }
        },
        "deprecated": false
      },
      "put": {
        "tags": [
          "Rules"
        ],
        "summary": "Update Tunnel Inspection PreRules",
        "description": "Update Tunnel Inspection PreRules",
        "operationId": "updateTunnelInspectionPreRules",
        "parameters": [
          {
            "name": "query",
            "in": "query",
            "description": "The query object",
            "required": true,
            "style": "form",
            "explode": true,
            "schema": {
              "type": "object"
            }
          }
        ],
        "requestBody": {
          "description": "The payload object",
          "content": {
            "text/plain": {
              "schema": {
                "type": "object",
                "description": "The payload object"
              }
            }
          },
          "required": true
        },
        "responses": {
          "200": {
            "description": "successful operation",
            "headers": {}
          }
        },
        "deprecated": false
      },
      "delete": {
        "tags": [
          "Rules"
        ],
        "summary": "Delete Tunnel Inspection PreRules",
        "description": "Delete Tunnel Inspection PreRules",
        "operationId": "deleteTunnelInspectionPreRules",
        "parameters": [
          {
            "name": "query",
            "in": "query",
            "description": "The query object",
            "required": true,
            "style": "form",
            "explode": true,
            "schema": {
              "type": "object"
            }
          }
        ],
        "responses": {
          "200": {
            "description": "successful operation",
            "headers": {}
          }
        },
        "deprecated": false
      }
    },
    "/restapi/v10.1/Policies/TunnelInspectionPostRules": {
      "get": {
        "tags": [
          "Rules"
        ],
        "summary": "Get Tunnel Inspection PostRules",
        "description": "Get Tunnel Inspection PostRules",
        "operationId": "getTunnelInspectionPostRules",
        "parameters": [
          {
            "name": "query",
            "in": "query",
            "description": "The query object",
            "required": true,
            "style": "form",
            "explode": true,
            "schema": {
              "type": "object"
            }
          }
        ],
        "responses": {
          "200": {
            "description": "successful operation",
            "headers": {}
          }
        },
        "deprecated": false
      },
      "post": {
        "tags": [
          "Rules"
        ],
        "summary": "Create Tunnel Inspection PostRules",
        "description": "Create Tunnel Inspection PostRules",
        "operationId": "createTunnelInspectionPostRules",
        "parameters": [
          {
            "name": "query",
            "in": "query",
            "description": "The query object",
            "required": true,
            "style": "form",
            "explode": true,
            "schema": {
              "type": "object"
            }
          }
        ],
        "requestBody": {
          "description": "The payload object",
          "content": {
            "text/plain": {
              "schema": {
                "type": "object",
                "description": "The payload object"
              }
            }
          },
          "required": true
        },
        "responses": {
          "200": {
            "description": "successful operation",
            "headers": {}
          }
        },
        "deprecated": false
      },
      "put": {
        "tags": [
          "Rules"
        ],
        "summary": "Update Tunnel Inspection PostRules",
        "description": "Update Tunnel Inspection PostRules",
        "operationId": "updateTunnelInspectionPostRules",
        "parameters": [
          {
            "name": "query",
            "in": "query",
            "description": "The query object",
            "required": true,
            "style": "form",
            "explode": true,
            "schema": {
              "type": "object"
            }
          }
        ],
        "requestBody": {
          "description": "The payload object",
          "content": {
            "text/plain": {
              "schema": {
                "type": "object",
                "description": "The payload object"
              }
            }
          },
          "required": true
        },
        "responses": {
          "200": {
            "description": "successful operation",
            "headers": {}
          }
        },
        "deprecated": false
      },
      "delete": {
        "tags": [
          "Rules"
        ],
        "summary": "Delete Tunnel Inspection PostRules",
        "description": "Delete Tunnel Inspection PostRules",
        "operationId": "deleteTunnelInspectionPostRules",
        "parameters": [
          {
            "name": "query",
            "in": "query",
            "description": "The query object",
            "required": true,
            "style": "form",
            "explode": true,
            "schema": {
              "type": "object"
            }
          }
        ],
        "responses": {
          "200": {
            "description": "successful operation",
            "headers": {}
          }
        },
        "deprecated": false
      }
    },
    "/restapi/v10.1/Policies/ApplicationOverridePreRules": {
      "get": {
        "tags": [
          "Rules"
        ],
        "summary": "Get Application Override PreRules",
        "description": "Get Application Override PreRules",
        "operationId": "getApplicationOverridePreRules",
        "parameters": [
          {
            "name": "query",
            "in": "query",
            "description": "The query object",
            "required": true,
            "style": "form",
            "explode": true,
            "schema": {
              "type": "object"
            }
          }
        ],
        "responses": {
          "200": {
            "description": "successful operation",
            "headers": {}
          }
        },
        "deprecated": false
      },
      "post": {
        "tags": [
          "Rules"
        ],
        "summary": "Create Application Override PreRules",
        "description": "Create Application Override PreRules",
        "operationId": "createApplicationOverridePreRules",
        "parameters": [
          {
            "name": "query",
            "in": "query",
            "description": "The query object",
            "required": true,
            "style": "form",
            "explode": true,
            "schema": {
              "type": "object"
            }
          }
        ],
        "requestBody": {
          "description": "The payload object",
          "content": {
            "text/plain": {
              "schema": {
                "type": "object",
                "description": "The payload object"
              }
            }
          },
          "required": true
        },
        "responses": {
          "200": {
            "description": "successful operation",
            "headers": {}
          }
        },
        "deprecated": false
      },
      "put": {
        "tags": [
          "Rules"
        ],
        "summary": "Update Application Override PreRules",
        "description": "Update Application Override PreRules",
        "operationId": "updateApplicationOverridePreRules",
        "parameters": [
          {
            "name": "query",
            "in": "query",
            "description": "The query object",
            "required": true,
            "style": "form",
            "explode": true,
            "schema": {
              "type": "object"
            }
          }
        ],
        "requestBody": {
          "description": "The payload object",
          "content": {
            "text/plain": {
              "schema": {
                "type": "object",
                "description": "The payload object"
              }
            }
          },
          "required": true
        },
        "responses": {
          "200": {
            "description": "successful operation",
            "headers": {}
          }
        },
        "deprecated": false
      },
      "delete": {
        "tags": [
          "Rules"
        ],
        "summary": "Delete Application Override PreRules",
        "description": "Delete Application Override PreRules",
        "operationId": "deleteApplicationOverridePreRules",
        "parameters": [
          {
            "name": "query",
            "in": "query",
            "description": "The query object",
            "required": true,
            "style": "form",
            "explode": true,
            "schema": {
              "type": "object"
            }
          }
        ],
        "responses": {
          "200": {
            "description": "successful operation",
            "headers": {}
          }
        },
        "deprecated": false
      }
    },
    "/restapi/v10.1/Policies/ApplicationOverridePostRules": {
      "get": {
        "tags": [
          "Rules"
        ],
        "summary": "Get Application Override PostRules",
        "description": "Get Application Override PostRules",
        "operationId": "getApplicationOverridePostRules",
        "parameters": [
          {
            "name": "query",
            "in": "query",
            "description": "The query object",
            "required": true,
            "style": "form",
            "explode": true,
            "schema": {
              "type": "object"
            }
          }
        ],
        "responses": {
          "200": {
            "description": "successful operation",
            "headers": {}
          }
        },
        "deprecated": false
      },
      "post": {
        "tags": [
          "Rules"
        ],
        "summary": "Create Application Override PostRules",
        "description": "Create Application Override PostRules",
        "operationId": "createApplicationOverridePostRules",
        "parameters": [
          {
            "name": "query",
            "in": "query",
            "description": "The query object",
            "required": true,
            "style": "form",
            "explode": true,
            "schema": {
              "type": "object"
            }
          }
        ],
        "requestBody": {
          "description": "The payload object",
          "content": {
            "text/plain": {
              "schema": {
                "type": "object",
                "description": "The payload object"
              }
            }
          },
          "required": true
        },
        "responses": {
          "200": {
            "description": "successful operation",
            "headers": {}
          }
        },
        "deprecated": false
      },
      "put": {
        "tags": [
          "Rules"
        ],
        "summary": "Update Application Override PostRules",
        "description": "Update Application Override PostRules",
        "operationId": "updateApplicationOverridePostRules",
        "parameters": [
          {
            "name": "query",
            "in": "query",
            "description": "The query object",
            "required": true,
            "style": "form",
            "explode": true,
            "schema": {
              "type": "object"
            }
          }
        ],
        "requestBody": {
          "description": "The payload object",
          "content": {
            "text/plain": {
              "schema": {
                "type": "object",
                "description": "The payload object"
              }
            }
          },
          "required": true
        },
        "responses": {
          "200": {
            "description": "successful operation",
            "headers": {}
          }
        },
        "deprecated": false
      },
      "delete": {
        "tags": [
          "Rules"
        ],
        "summary": "Delete Application Override PostRules",
        "description": "Delete Application Override PostRules",
        "operationId": "deleteApplicationOverridePostRules",
        "parameters": [
          {
            "name": "query",
            "in": "query",
            "description": "The query object",
            "required": true,
            "style": "form",
            "explode": true,
            "schema": {
              "type": "object"
            }
          }
        ],
        "responses": {
          "200": {
            "description": "successful operation",
            "headers": {}
          }
        },
        "deprecated": false
      }
    },
    "/restapi/v10.1/Policies/AuthenticationPreRules": {
      "get": {
        "tags": [
          "Rules"
        ],
        "summary": "Get Authentication PreRules",
        "description": "Get Authentication PreRules",
        "operationId": "getAuthenticationPreRules",
        "parameters": [
          {
            "name": "query",
            "in": "query",
            "description": "The query object",
            "required": true,
            "style": "form",
            "explode": true,
            "schema": {
              "type": "object"
            }
          }
        ],
        "responses": {
          "200": {
            "description": "successful operation",
            "headers": {}
          }
        },
        "deprecated": false
      },
      "post": {
        "tags": [
          "Rules"
        ],
        "summary": "Create Authentication PreRules",
        "description": "Create Authentication PreRules",
        "operationId": "createAuthenticationPreRules",
        "parameters": [
          {
            "name": "query",
            "in": "query",
            "description": "The query object",
            "required": true,
            "style": "form",
            "explode": true,
            "schema": {
              "type": "object"
            }
          }
        ],
        "requestBody": {
          "description": "The payload object",
          "content": {
            "text/plain": {
              "schema": {
                "type": "object",
                "description": "The payload object"
              }
            }
          },
          "required": true
        },
        "responses": {
          "200": {
            "description": "successful operation",
            "headers": {}
          }
        },
        "deprecated": false
      },
      "put": {
        "tags": [
          "Rules"
        ],
        "summary": "Update Authentication PreRules",
        "description": "Update Authentication PreRules",
        "operationId": "updateAuthenticationPreRules",
        "parameters": [
          {
            "name": "query",
            "in": "query",
            "description": "The query object",
            "required": true,
            "style": "form",
            "explode": true,
            "schema": {
              "type": "object"
            }
          }
        ],
        "requestBody": {
          "description": "The payload object",
          "content": {
            "text/plain": {
              "schema": {
                "type": "object",
                "description": "The payload object"
              }
            }
          },
          "required": true
        },
        "responses": {
          "200": {
            "description": "successful operation",
            "headers": {}
          }
        },
        "deprecated": false
      },
      "delete": {
        "tags": [
          "Rules"
        ],
        "summary": "Delete Authentication PreRules",
        "description": "Delete Authentication PreRules",
        "operationId": "deleteAuthenticationPreRules",
        "parameters": [
          {
            "name": "query",
            "in": "query",
            "description": "The query object",
            "required": true,
            "style": "form",
            "explode": true,
            "schema": {
              "type": "object"
            }
          }
        ],
        "responses": {
          "200": {
            "description": "successful operation",
            "headers": {}
          }
        },
        "deprecated": false
      }
    },
    "/restapi/v10.1/Policies/AuthenticationPostRules": {
      "get": {
        "tags": [
          "Rules"
        ],
        "summary": "Get Authentication PostRules",
        "description": "Get Authentication PostRules",
        "operationId": "getAuthenticationPostRules",
        "parameters": [
          {
            "name": "query",
            "in": "query",
            "description": "The query object",
            "required": true,
            "style": "form",
            "explode": true,
            "schema": {
              "type": "object"
            }
          }
        ],
        "responses": {
          "200": {
            "description": "successful operation",
            "headers": {}
          }
        },
        "deprecated": false
      },
      "post": {
        "tags": [
          "Rules"
        ],
        "summary": "Create Authentication PostRules",
        "description": "Create Authentication PostRules",
        "operationId": "createAuthenticationPostRules",
        "parameters": [
          {
            "name": "query",
            "in": "query",
            "description": "The query object",
            "required": true,
            "style": "form",
            "explode": true,
            "schema": {
              "type": "object"
            }
          }
        ],
        "requestBody": {
          "description": "The payload object",
          "content": {
            "text/plain": {
              "schema": {
                "type": "object",
                "description": "The payload object"
              }
            }
          },
          "required": true
        },
        "responses": {
          "200": {
            "description": "successful operation",
            "headers": {}
          }
        },
        "deprecated": false
      },
      "put": {
        "tags": [
          "Rules"
        ],
        "summary": "Update Authentication PostRules",
        "description": "Update Authentication PostRules",
        "operationId": "updateAuthenticationPostRules",
        "parameters": [
          {
            "name": "query",
            "in": "query",
            "description": "The query object",
            "required": true,
            "style": "form",
            "explode": true,
            "schema": {
              "type": "object"
            }
          }
        ],
        "requestBody": {
          "description": "The payload object",
          "content": {
            "text/plain": {
              "schema": {
                "type": "object",
                "description": "The payload object"
              }
            }
          },
          "required": true
        },
        "responses": {
          "200": {
            "description": "successful operation",
            "headers": {}
          }
        },
        "deprecated": false
      },
      "delete": {
        "tags": [
          "Rules"
        ],
        "summary": "Delete Authentication PostRules",
        "description": "Delete Authentication PostRules",
        "operationId": "deleteAuthenticationPostRules",
        "parameters": [
          {
            "name": "query",
            "in": "query",
            "description": "The query object",
            "required": true,
            "style": "form",
            "explode": true,
            "schema": {
              "type": "object"
            }
          }
        ],
        "responses": {
          "200": {
            "description": "successful operation",
            "headers": {}
          }
        },
        "deprecated": false
      }
    },
    "/restapi/v10.1/Policies/DoSPreRules": {
      "get": {
        "tags": [
          "Rules"
        ],
        "summary": "Get DoS PreRules",
        "description": "Get DoS PreRules",
        "operationId": "getDoSPreRules",
        "parameters": [
          {
            "name": "query",
            "in": "query",
            "description": "The query object",
            "required": true,
            "style": "form",
            "explode": true,
            "schema": {
              "type": "object"
            }
          }
        ],
        "responses": {
          "200": {
            "description": "successful operation",
            "headers": {}
          }
        },
        "deprecated": false
      },
      "post": {
        "tags": [
          "Rules"
        ],
        "summary": "Create DoS PreRules",
        "description": "Create DoS PreRules",
        "operationId": "createDoSPreRules",
        "parameters": [
          {
            "name": "query",
            "in": "query",
            "description": "The query object",
            "required": true,
            "style": "form",
            "explode": true,
            "schema": {
              "type": "object"
            }
          }
        ],
        "requestBody": {
          "description": "The payload object",
          "content": {
            "text/plain": {
              "schema": {
                "type": "object",
                "description": "The payload object"
              }
            }
          },
          "required": true
        },
        "responses": {
          "200": {
            "description": "successful operation",
            "headers": {}
          }
        },
        "deprecated": false
      },
      "put": {
        "tags": [
          "Rules"
        ],
        "summary": "Update DoS PreRules",
        "description": "Update DoS PreRules",
        "operationId": "updateDoSPreRules",
        "parameters": [
          {
            "name": "query",
            "in": "query",
            "description": "The query object",
            "required": true,
            "style": "form",
            "explode": true,
            "schema": {
              "type": "object"
            }
          }
        ],
        "requestBody": {
          "description": "The payload object",
          "content": {
            "text/plain": {
              "schema": {
                "type": "object",
                "description": "The payload object"
              }
            }
          },
          "required": true
        },
        "responses": {
          "200": {
            "description": "successful operation",
            "headers": {}
          }
        },
        "deprecated": false
      },
      "delete": {
        "tags": [
          "Rules"
        ],
        "summary": "Delete DoS PreRules",
        "description": "Delete DoS PreRules",
        "operationId": "deleteDoSPreRules",
        "parameters": [
          {
            "name": "query",
            "in": "query",
            "description": "The query object",
            "required": true,
            "style": "form",
            "explode": true,
            "schema": {
              "type": "object"
            }
          }
        ],
        "responses": {
          "200": {
            "description": "successful operation",
            "headers": {}
          }
        },
        "deprecated": false
      }
    },
    "/restapi/v10.1/Policies/DoSPostRules": {
      "get": {
        "tags": [
          "Rules"
        ],
        "summary": "Get DoS PostRules",
        "description": "Get DoS PostRules",
        "operationId": "getDoSPostRules",
        "parameters": [
          {
            "name": "query",
            "in": "query",
            "description": "The query object",
            "required": true,
            "style": "form",
            "explode": true,
            "schema": {
              "type": "object"
            }
          }
        ],
        "responses": {
          "200": {
            "description": "successful operation",
            "headers": {}
          }
        },
        "deprecated": false
      },
      "post": {
        "tags": [
          "Rules"
        ],
        "summary": "Create DoS PostRules",
        "description": "Create DoS PostRules",
        "operationId": "createDoSPostRules",
        "parameters": [
          {
            "name": "query",
            "in": "query",
            "description": "The query object",
            "required": true,
            "style": "form",
            "explode": true,
            "schema": {
              "type": "object"
            }
          }
        ],
        "requestBody": {
          "description": "The payload object",
          "content": {
            "text/plain": {
              "schema": {
                "type": "object",
                "description": "The payload object"
              }
            }
          },
          "required": true
        },
        "responses": {
          "200": {
            "description": "successful operation",
            "headers": {}
          }
        },
        "deprecated": false
      },
      "put": {
        "tags": [
          "Rules"
        ],
        "summary": "Update DoS PostRules",
        "description": "Update DoS PostRules",
        "operationId": "updateDoSPostRules",
        "parameters": [
          {
            "name": "query",
            "in": "query",
            "description": "The query object",
            "required": true,
            "style": "form",
            "explode": true,
            "schema": {
              "type": "object"
            }
          }
        ],
        "requestBody": {
          "description": "The payload object",
          "content": {
            "text/plain": {
              "schema": {
                "type": "object",
                "description": "The payload object"
              }
            }
          },
          "required": true
        },
        "responses": {
          "200": {
            "description": "successful operation",
            "headers": {}
          }
        },
        "deprecated": false
      },
      "delete": {
        "tags": [
          "Rules"
        ],
        "summary": "Delete DoS PostRules",
        "description": "Delete DoS PostRules",
        "operationId": "deleteDoSPostRules",
        "parameters": [
          {
            "name": "query",
            "in": "query",
            "description": "The query object",
            "required": true,
            "style": "form",
            "explode": true,
            "schema": {
              "type": "object"
            }
          }
        ],
        "responses": {
          "200": {
            "description": "successful operation",
            "headers": {}
          }
        },
        "deprecated": false
      }
    }
  },
  "tags":[ 
    { 
      "name":"Security",
      "description":"Security"
    },
    { 
      "name":"Rules",
      "description":"Rules"
    }
  ]
}