{
  "openapi": "3.0.2",
  "info": {
    "title": "zapper",
    "version": "1.0.0"
  },
  "servers": [
    {
      "url": "http://localhost:8080/",
      "description": ""
    }
  ],
  "paths": {
    "/JSON/spider/action/scan/": {
      "get": {
        "summary": "# To start the Ajax Spider\n",
        "description": "# To start the Ajax Spider\n",
        "parameters": [
          {
            "name": "apikey",
            "description": "apikey of zap",
            "schema": {
              "type": "string"
            },
            "in": "query",
            "required": true
          },
          {
            "name": "url",
            "description": "target url",
            "schema": {
              "type": "string"
            },
            "in": "query",
            "required": true
          }
        ],
        "responses": {
          "200": {
            "description": "Valid Response"
          }
        }
      }
    },
    "/JSON/context/action/newContext/": {
      "get": {
        "summary": "Create a new context for auth.",
        "description": "Create a new context for auth.",
        "parameters": [
          {
            "name": "apikey",
            "description": "ZAP API key",
            "schema": {
              "type": "string"
            },
            "in": "query",
            "required": true
          },
          {
            "name": "contextName",
            "description": "Context name",
            "schema": {
              "type": "string"
            },
            "in": "query",
            "required": true
          }
        ],
        "responses": {
          "200": {
            "description": "Valid Response"
          }
        }
      }
    },
    "/JSON/context/view/contextList/": {
      "get": {
        "summary": "Get the list of available contexts",
        "description": "Get the list of available contexts",
        "parameters": [
          {
            "name": "apikey",
            "description": "Zap API key",
            "schema": {
              "type": "string"
            },
            "in": "query",
            "required": true
          }
        ],
        "responses": {
          "200": {
            "description": "Valid Response"
          }
        }
      }
    },
    "/JSON/context/view/context/": {
      "get": {
        "summary": "View context details",
        "description": "View context details",
        "parameters": [
          {
            "name": "apikey",
            "description": "Zap api key",
            "schema": {
              "type": "string"
            },
            "in": "query",
            "required": true
          },
          {
            "name": "contextName",
            "description": "Name of the context",
            "schema": {
              "type": "string"
            },
            "in": "query",
            "required": true
          }
        ],
        "responses": {
          "200": {
            "description": "Valid Response"
          }
        }
      }
    },
    "/JSON/sessionManagement/view/getSessionManagementMethod/": {
      "get": {
        "summary": "Gets the name of the session management method for the context with the given ID.",
        "description": "Gets the name of the session management method for the context with the given ID.\n\n",
        "parameters": [
          {
            "name": "contextId",
            "description": "contextId used",
            "schema": {
              "type": "integer"
            },
            "in": "query",
            "required": true
          },
          {
            "name": "apikey",
            "description": "Zap api key",
            "schema": {
              "type": "string"
            },
            "in": "query",
            "required": true
          }
        ],
        "responses": {
          "200": {
            "description": "Valid Response"
          }
        }
      }
    },
    "/JSON/sessionManagement/view/getSupportedSessionManagementMethods/": {
      "get": {
        "summary": "Gets the name of the session management methods.",
        "description": "Gets the name of the session management methods.\n",
        "parameters": [
          {
            "name": "apikey",
            "description": "Zap api key.",
            "schema": {
              "type": "string"
            },
            "in": "query",
            "required": true
          }
        ],
        "responses": {
          "200": {
            "description": "Valid Response"
          }
        }
      }
    },
    "/JSON/sessionManagement/action/setSessionManagementMethod/": {
      "get": {
        "summary": "Sets the session management method for the context with the given ID.",
        "description": "Sets the session management method for the context with the given ID.\n\n",
        "parameters": [
          {
            "name": "apikey",
            "description": "Zap api key",
            "schema": {
              "type": "string"
            },
            "in": "query",
            "required": true
          },
          {
            "name": "contextId",
            "description": "ContextID used",
            "schema": {
              "type": "integer"
            },
            "in": "query",
            "required": true
          },
          {
            "name": "methodName",
            "description": "session method type ",
            "schema": {
              "type": "string"
            },
            "in": "query",
            "required": true
          }
        ],
        "responses": {
          "200": {
            "description": "Valid Response"
          }
        }
      }
    },
    "/JSON/authentication/view/getSupportedAuthenticationMethods/": {
      "get": {
        "summary": "Gets the list of supported authentication methods.",
        "description": "Gets the list of supported authentication methods.",
        "parameters": [
          {
            "name": "apikey",
            "description": "Zap api key.",
            "schema": {
              "type": "string"
            },
            "in": "query",
            "required": true
          }
        ],
        "responses": {
          "200": {
            "description": "Valid Response"
          }
        }
      }
    },
    "/JSON/authentication/view/getAuthenticationMethod/": {
      "get": {
        "summary": "Gets the name of the authentication method for the context with the given ID.",
        "description": "Gets the name of the authentication method for the context with the given ID.\n\n",
        "parameters": [
          {
            "name": "apikey",
            "description": "Zap api key",
            "schema": {
              "type": "string"
            },
            "in": "query",
            "required": true
          },
          {
            "name": "contextId",
            "description": "contextID used",
            "schema": {
              "type": "integer"
            },
            "in": "query",
            "required": true
          }
        ],
        "responses": {
          "200": {
            "description": "Valid Response"
          }
        }
      }
    },
    "/JSON/authentication/action/setAuthenticationMethod/": {
      "get": {
        "summary": "Sets the authentication method for the context with the given ID.",
        "description": "Sets the authentication method for the context with the given ID.\n\n",
        "parameters": [
          {
            "name": "apikey",
            "description": "Zap api key",
            "schema": {
              "type": "string"
            },
            "in": "query",
            "required": true
          },
          {
            "name": "contextId",
            "description": "Used context",
            "schema": {
              "type": "integer"
            },
            "in": "query",
            "required": true
          },
          {
            "name": "authMethodName",
            "description": "Required method name",
            "schema": {
              "type": "string"
            },
            "in": "query",
            "required": true
          },
          {
            "name": "authMethodConfigParams",
            "description": "used when forbased auth is selected\n\nloginUrl=http%3A%2F%2Flocalhost:3000%2Flogin%2F&loginRequestData=username%3D%7B%admin@pronghorn%25%7D%26password%3D%7B%admin%25%7D",
            "schema": {
              "type": "string"
            },
            "in": "query"
          }
        ],
        "responses": {
          "200": {
            "description": "Valid Response"
          }
        }
      }
    },
    "/JSON/authentication/action/setLoggedInIndicator/": {
      "get": {
        "summary": "Sets the logged in indicator for the context with the given ID.",
        "description": "Sets the logged in indicator for the context with the given ID.\n\n",
        "parameters": [
          {
            "name": "apikey",
            "description": "Zap api key",
            "schema": {
              "type": "string"
            },
            "in": "query",
            "required": true
          },
          {
            "name": "contextId",
            "description": "Used contextID",
            "schema": {
              "type": "integer"
            },
            "in": "query",
            "required": true
          },
          {
            "name": "loggedInIndicatorRegex",
            "description": "Used regex for logged in indicator\n\nex: \n\\Q<a id=\"logout\" tabindex=\"0\" role=\"button\" class=\"logout\">\\E",
            "schema": {
              "type": "string"
            },
            "in": "query",
            "required": true
          }
        ],
        "responses": {
          "200": {
            "description": "Valid Response"
          }
        }
      }
    },
    "/JSON/authentication/action/setLoggedOutIndicator/": {
      "get": {
        "summary": "Sets Logged out indicator",
        "description": "Sets Logged out indicator",
        "parameters": [
          {
            "name": "apikey",
            "description": "zap api key",
            "schema": {
              "type": "string"
            },
            "in": "query",
            "required": true
          },
          {
            "name": "loggedOutIndicatorRegex",
            "description": "Logged out indicator regex\n\nex:\n\\QYou have successfully logged out.\\E",
            "schema": {
              "type": "string"
            },
            "in": "query",
            "required": true
          },
          {
            "name": "contextId",
            "description": "Used contextId",
            "schema": {
              "type": "string"
            },
            "in": "query",
            "required": true
          }
        ],
        "responses": {
          "200": {
            "description": "Valid Response"
          }
        }
      }
    },
    "/JSON/users/view/usersList/": {
      "get": {
        "summary": "Gets a list of users that belong to the context with the given ID, or all users if none provided.",
        "description": "Gets a list of users that belong to the context with the given ID, or all users if none provided.\n\n",
        "parameters": [
          {
            "name": "contextId",
            "description": "Used contextId",
            "schema": {
              "type": "integer"
            },
            "in": "query",
            "required": true
          },
          {
            "name": "apikey",
            "description": "Zap api key",
            "schema": {
              "type": "string"
            },
            "in": "query",
            "required": true
          }
        ],
        "responses": {
          "200": {
            "description": "Valid Response"
          }
        }
      }
    },
    "/JSON/users/view/getUserById/": {
      "get": {
        "summary": "Gets the data of the user with the given ID that belongs to the context with the given ID.",
        "description": "Gets the data of the user with the given ID that belongs to the context with the given ID.\n\n",
        "parameters": [
          {
            "name": "contextId",
            "description": "Used contextID",
            "schema": {
              "type": "integer"
            },
            "in": "query",
            "required": true
          },
          {
            "name": "apikey",
            "description": "Zap api key",
            "schema": {
              "type": "string"
            },
            "in": "query",
            "required": true
          },
          {
            "name": "userId",
            "description": "userID ",
            "schema": {
              "type": "integer"
            },
            "in": "query",
            "required": true
          }
        ],
        "responses": {
          "200": {
            "description": "Valid Response"
          }
        }
      }
    },
    "/JSON/users/action/setUserName/": {
      "get": {
        "summary": "Renames the user with the given ID that belongs to the context with the given ID.",
        "description": "Renames the user with the given ID that belongs to the context with the given ID.\n\n",
        "parameters": [
          {
            "name": "contextId",
            "description": "Used contextId",
            "schema": {
              "type": "integer"
            },
            "in": "query",
            "required": true
          },
          {
            "name": "userId",
            "description": "userId",
            "schema": {
              "type": "integer"
            },
            "in": "query",
            "required": true
          },
          {
            "name": "apikey",
            "description": "Zap api key",
            "schema": {
              "type": "string"
            },
            "in": "query",
            "required": true
          },
          {
            "name": "name",
            "description": "name of the user",
            "schema": {
              "type": "string"
            },
            "in": "query",
            "required": true
          }
        ],
        "responses": {
          "200": {
            "description": "Valid Response"
          }
        }
      }
    },
    "/JSON/users/action/setAuthenticationCredentials/": {
      "get": {
        "summary": "Sets the authentication credentials for the user with the given ID",
        "description": "Sets the authentication credentials for the user with the given ID that belongs to the context with the given ID.\n\n",
        "parameters": [
          {
            "name": "contextId",
            "description": "Used contextId",
            "schema": {
              "type": "integer"
            },
            "in": "query",
            "required": true
          },
          {
            "name": "userId",
            "description": "User ID",
            "schema": {
              "type": "integer"
            },
            "in": "query",
            "required": true
          },
          {
            "name": "authCredentialsConfigParams",
            "description": "auth credentials",
            "schema": {
              "type": "string"
            },
            "in": "query",
            "required": true,
            "examples": {
              "example": {
                "value": "username=admin@pronghorn&&password=admin"
              }
            }
          },
          {
            "name": "apikey",
            "description": "Zap api key",
            "schema": {
              "type": "string"
            },
            "in": "query",
            "required": true
          }
        ],
        "responses": {
          "200": {
            "description": "Valid Response"
          }
        }
      }
    },
    "/JSON/users/action/removeUser/": {
      "get": {
        "summary": "Removes the user with the given ID that belongs to the context with the given ID.",
        "description": "Removes the user with the given ID that belongs to the context with the given ID.\n\n",
        "parameters": [
          {
            "name": "apikey",
            "description": "Zap api key",
            "schema": {
              "type": "string"
            },
            "in": "query",
            "required": true
          },
          {
            "name": "contextId",
            "description": "used contextId",
            "schema": {
              "type": "integer"
            },
            "in": "query",
            "required": true
          },
          {
            "name": "userId",
            "description": "UserId",
            "schema": {
              "type": "integer"
            },
            "in": "query",
            "required": true
          }
        ],
        "responses": {
          "200": {
            "description": "Valid Response"
          }
        }
      }
    },
    "/JSON/context/action/includeInContext/": {
      "get": {
        "summary": "Include regex to context",
        "description": "Include regex to context\n\n",
        "parameters": [
          {
            "name": "apikey",
            "description": "Zap api key",
            "schema": {
              "type": "string"
            },
            "in": "query",
            "required": true
          },
          {
            "name": "contextName",
            "description": "context name",
            "schema": {
              "type": "string"
            },
            "in": "query",
            "required": true
          },
          {
            "name": "regex",
            "description": "Required regex\nFor ex: http://localhost:3000.*",
            "schema": {
              "type": "string"
            },
            "in": "query",
            "required": true
          }
        ],
        "responses": {
          "200": {
            "description": "Valid Response"
          }
        }
      }
    },
    "/JSON/context/action/excludeFromContext/": {
      "get": {
        "summary": "Include regex to context",
        "description": "Include regex to context\n\n",
        "parameters": [
          {
            "name": "apikey",
            "description": "Zap api key",
            "schema": {
              "type": "string"
            },
            "in": "query",
            "required": true
          },
          {
            "name": "contextName",
            "description": "context name",
            "schema": {
              "type": "string"
            },
            "in": "query",
            "required": true
          },
          {
            "name": "regex",
            "description": "Required regex\nFor ex: http://localhost:3000.*",
            "schema": {
              "type": "string"
            },
            "in": "query",
            "required": true
          }
        ],
        "responses": {
          "200": {
            "description": "Valid Response"
          }
        }
      }
    },
    "/JSON/ascan/action/scan/": {
      "get": {
        "summary": "Runs the active scanner",
        "description": "Runs the active scanner against the given URL and/or Context. Optionally, the 'recurse' parameter can be used to scan URLs under the given URL, the parameter 'inScopeOnly' can be used to constrain the scan to URLs that are in scope (ignored if a Context is specified), the parameter 'scanPolicyName' allows to specify the scan policy (if none is given it uses the default scan policy), the parameters 'method' and 'postData' allow to select a given request in conjunction with the given URL.",
        "parameters": [
          {
            "name": "url",
            "description": "Target url. It is ignored if context is specified",
            "schema": {
              "type": "string"
            },
            "in": "query"
          },
          {
            "name": "recurse",
            "description": "If you select ‘Recurse’ then all of the nodes underneath the one selected will also be scanned.",
            "schema": {
              "type": "boolean"
            },
            "in": "query"
          },
          {
            "name": "inScopeOnly",
            "description": "The parameter 'inScopeOnly' can be used to constrain the scan to URLs that are in scope (ignored if a Context is specified)",
            "schema": {
              "type": "boolean"
            },
            "in": "query"
          },
          {
            "name": "scanPolicyName",
            "description": "Allows to specify the scan policy (if none is given it uses the default scan policy)",
            "schema": {
              "type": "string"
            },
            "in": "query"
          },
          {
            "name": "postData",
            "description": "Key value pairs in the request POST data.",
            "schema": {
              "type": "string"
            },
            "in": "query"
          },
          {
            "name": "contextId",
            "description": "Used context ID",
            "schema": {
              "type": "integer"
            },
            "in": "query"
          },
          {
            "name": "apikey",
            "description": "Zap api key",
            "schema": {
              "type": "string"
            },
            "in": "query",
            "required": true
          }
        ],
        "responses": {
          "200": {
            "description": "Valid Response"
          }
        }
      }
    },
    "/JSON/ascan/action/addScanPolicy/": {
      "get": {
        "summary": "Add scan policy",
        "description": "Add scan policy",
        "parameters": [
          {
            "name": "scanPolicyName",
            "description": "scan policy name",
            "schema": {
              "type": "string"
            },
            "in": "query",
            "required": true
          },
          {
            "name": "alertThreshold",
            "description": "Alert threshold",
            "schema": {
              "type": "string"
            },
            "in": "query"
          },
          {
            "name": "attackStrength",
            "description": "attack strength",
            "schema": {
              "type": "string"
            },
            "in": "query"
          },
          {
            "name": "apikey",
            "description": "Zap api key",
            "schema": {
              "type": "string"
            },
            "in": "query",
            "required": true
          }
        ],
        "responses": {
          "200": {
            "description": "Valid Response"
          }
        }
      }
    },
    "/JSON/ascan/action/updateScanPolicy/": {
      "get": {
        "summary": "Update scan policy",
        "description": "Update scan policy",
        "parameters": [
          {
            "name": "scanPolicyName",
            "description": "scan policy name",
            "schema": {
              "type": "string"
            },
            "in": "query",
            "required": true
          },
          {
            "name": "alertThreshold",
            "description": "Alert threshold",
            "schema": {
              "type": "string"
            },
            "in": "query"
          },
          {
            "name": "attackStrength",
            "description": "attack strength",
            "schema": {
              "type": "string"
            },
            "in": "query"
          },
          {
            "name": "apikey",
            "description": "Zap api key",
            "schema": {
              "type": "string"
            },
            "in": "query",
            "required": true
          }
        ],
        "responses": {
          "200": {
            "description": "Valid Response"
          }
        }
      }
    },
    "/JSON/ascan/view/scanPolicyNames/": {
      "get": {
        "summary": "Scan policies names",
        "description": "Scan policies names",
        "parameters": [
          {
            "name": "apikey",
            "description": "Zap api key",
            "schema": {
              "type": "string"
            },
            "in": "query",
            "required": true
          }
        ],
        "responses": {
          "200": {
            "description": "Valid Response"
          }
        }
      }
    },
    "/JSON/ascan/view/scanners/": {
      "get": {
        "summary": "List of active scanners",
        "description": "List of active scanners ",
        "parameters": [
          {
            "name": "scanPolicyName",
            "description": "Scan policy name",
            "schema": {
              "type": "string"
            },
            "in": "query"
          },
          {
            "name": "policyId",
            "description": "Policy ID",
            "schema": {
              "type": "integer"
            },
            "in": "query"
          },
          {
            "name": "apikey",
            "description": "Zap api key",
            "schema": {
              "type": "string"
            },
            "in": "query",
            "required": true
          }
        ],
        "responses": {
          "200": {
            "description": "Valid Response"
          }
        }
      }
    },
    "/JSON/ascan/view/policies/": {
      "get": {
        "summary": "List of active policies",
        "description": "List of active policies ",
        "parameters": [
          {
            "name": "scanPolicyName",
            "description": "Scan policy name",
            "schema": {
              "type": "string"
            },
            "in": "query"
          },
          {
            "name": "policyId",
            "description": "Policy ID",
            "schema": {
              "type": "integer"
            },
            "in": "query"
          },
          {
            "name": "apikey",
            "description": "Zap api key",
            "schema": {
              "type": "string"
            },
            "in": "query",
            "required": true
          }
        ],
        "responses": {
          "200": {
            "description": "Valid Response"
          }
        }
      }
    },
    "/JSON/pscan/action/enableAllScanners/": {
      "get": {
        "summary": "Enable all the passive scanners",
        "description": "Enable all the passive scanners",
        "parameters": [
          {
            "name": "apikey",
            "description": "Zap api key",
            "schema": {
              "type": "string"
            },
            "in": "query",
            "required": true
          }
        ],
        "responses": {
          "200": {
            "description": "Valid Response"
          }
        }
      }
    },
    "/JSON/pscan/action/disableAllScanners/": {
      "get": {
        "summary": "Disable all the passive scanners",
        "description": "Disable all the passive scanners",
        "parameters": [
          {
            "name": "apikey",
            "description": "Zap api key",
            "schema": {
              "type": "string"
            },
            "in": "query",
            "required": true
          }
        ],
        "responses": {
          "200": {
            "description": "Valid Response"
          }
        }
      }
    },
    "/JSON/pscan/view/scanners/": {
      "get": {
        "summary": "List pf passive scanners",
        "description": "List of passive scanners",
        "parameters": [
          {
            "name": "apikey",
            "description": "Zap api key",
            "schema": {
              "type": "string"
            },
            "in": "query",
            "required": true
          }
        ],
        "responses": {
          "200": {
            "description": "Valid Response"
          }
        }
      }
    },
    "/JSON/alert/view/alert/": {
      "get": {
        "summary": "Gets the alert with the given ID",
        "description": "Gets the alert with the given ID, the corresponding HTTP message can be obtained with the 'messageId' field and 'message' API method",
        "parameters": [
          {
            "name": "apikey",
            "description": "Zap api key",
            "schema": {
              "type": "string"
            },
            "in": "query",
            "required": true
          },
          {
            "name": "id",
            "description": "alert id",
            "schema": {
              "type": "integer"
            },
            "in": "query",
            "required": true
          }
        ],
        "responses": {
          "200": {
            "description": "Valid Response"
          }
        }
      }
    },
    "/JSON/alert/view/alerts/": {
      "get": {
        "summary": "Gets the alerts raised by ZAP, optionally filtering by URL or riskId, and paginating with 'start' position and 'count' of alerts",
        "description": "Gets the alerts raised by ZAP, optionally filtering by URL or riskId, and paginating with 'start' position and 'count' of alerts\n\n",
        "parameters": [
          {
            "name": "apikey",
            "description": "Zap api key",
            "schema": {
              "type": "string"
            },
            "in": "query",
            "required": true
          },
          {
            "name": "baseurl",
            "description": "base url like http://localhost:3000",
            "schema": {
              "type": "string"
            },
            "in": "query"
          },
          {
            "name": "start",
            "description": "",
            "schema": {
              "type": "string"
            },
            "in": "query"
          },
          {
            "name": "count",
            "description": "",
            "schema": {
              "type": "string"
            },
            "in": "query"
          },
          {
            "name": "riskId",
            "description": "",
            "schema": {
              "type": "string"
            },
            "in": "query"
          }
        ],
        "responses": {
          "200": {
            "description": "Valid Response"
          }
        }
      }
    },
    "/JSON/alert/view/alertsSummary": {
      "get": {
        "summary": "Gets number of alerts grouped by each risk level, optionally filtering by URL",
        "description": "Gets number of alerts grouped by each risk level, optionally filtering by URL\n\n",
        "parameters": [
          {
            "name": "apikey",
            "description": "Zap api key",
            "schema": {
              "type": "string"
            },
            "in": "query",
            "required": true
          },
          {
            "name": "baseurl",
            "description": "baseurl like : http://localhost:3000",
            "schema": {
              "type": "string"
            },
            "in": "query"
          }
        ],
        "responses": {
          "200": {
            "description": "Valid Response"
          }
        }
      }
    },
    "/JSON/alert/view/alertCountsByRisk/": {
      "get": {
        "summary": "Gets a count of the alerts, optionally filtered as per alertsPerRisk",
        "description": "Gets a count of the alerts, optionally filtered as per alertsPerRisk\n\n",
        "parameters": [
          {
            "name": "url",
            "description": "url ",
            "schema": {
              "type": "string"
            },
            "in": "query",
            "required": false
          },
          {
            "name": "recurse",
            "description": "",
            "schema": {
              "type": "string"
            },
            "in": "query"
          },
          {
            "name": "apikey",
            "description": "Zap api key",
            "schema": {
              "type": "string"
            },
            "in": "query",
            "required": true
          }
        ],
        "responses": {
          "200": {
            "description": "Valid Response"
          }
        }
      }
    },
    "/JSON/stats/view/siteStats/": {
      "get": {
        "summary": "Gets all of the global statistics, optionally filtered by a key prefix",
        "description": "Gets all of the global statistics, optionally filtered by a key prefix\n\n",
        "parameters": [
          {
            "name": "site",
            "description": "site like http://localhost:3000",
            "schema": {
              "type": "string"
            },
            "in": "query",
            "required": true
          },
          {
            "name": "apikey",
            "description": "Zap api key",
            "schema": {
              "type": "string"
            },
            "in": "query",
            "required": true
          },
          {
            "name": "keyPrefix",
            "description": "keyPrefix",
            "schema": {
              "type": "string"
            },
            "in": "query"
          }
        ],
        "responses": {
          "200": {
            "description": "Valid Response"
          }
        }
      }
    },
    "/JSON/users/action/newUser/": {
      "get": {
        "summary": "Creates a new user with the given name for the context with the given ID.",
        "description": "Creates a new user with the given name for the context with the given ID.\n\n",
        "parameters": [
          {
            "name": "apikey",
            "description": "Zap api key",
            "schema": {
              "type": "string"
            },
            "in": "query",
            "required": true
          },
          {
            "name": "contextId",
            "description": "contextid used",
            "schema": {
              "type": "string"
            },
            "in": "query",
            "required": true
          },
          {
            "name": "name",
            "description": "new username ",
            "schema": {
              "type": "string"
            },
            "in": "query",
            "required": true
          }
        ],
        "responses": {
          "200": {
            "description": "Valid Response"
          }
        }
      }
    },
    "/JSON/alertFilter/view/alertFilterList/": {
      "get": {
        "summary": "Lists the alert filters of the context with the given ID.",
        "description": "Lists the alert filters of the context with the given ID.",
        "parameters": [
          {
            "name": "apikey",
            "description": "Zap api key",
            "schema": {
              "type": "integer"
            },
            "in": "query",
            "required": true
          },
          {
            "name": "contextId",
            "description": "used context",
            "schema": {
              "type": "integer"
            },
            "in": "query",
            "required": true
          }
        ],
        "responses": {
          "200": {
            "description": "Valid Response"
          }
        }
      }
    }
  }
}