{
  "_links": {},
  "created": "string",
  "id": "string",
  "issuerMode": "CUSTOM_URL_DOMAIN",
  "lastUpdated": "string",
  "name": "string",
  "policy": {
    "accountLink": {
      "action": "AUTO",
      "filter": {
        "groups": {}
      }
    },
    "maxClockSkew": 6,
    "provisioning": {
      "action": "AUTO",
      "conditions": {
        "deprovisioned": {},
        "suspended": {}
      },
      "groups": {
        "action": "NONE",
        "assignments": [
          "string",
          "string",
          "string"
        ],
        "filter": [
          "string",
          "string",
          "string",
          "string",
          "string",
          "string",
          "string"
        ],
        "sourceAttributeName": "string"
      },
      "profileMaster": true
    },
    "subject": {
      "filter": "string",
      "format": [
        "string",
        "string",
        "string",
        "string",
        "string",
        "string",
        "string",
        "string",
        "string"
      ],
      "matchAttribute": "string",
      "matchType": "EMAIL",
      "userNameTemplate": {
        "template": "string"
      }
    }
  },
  "protocol": {
    "algorithms": {
      "request": {
        "signature": {}
      },
      "response": {
        "signature": {}
      }
    },
    "credentials": {
      "client": {
        "client_id": "string",
        "client_secret": "string"
      },
      "signing": {
        "kid": "string"
      },
      "trust": {
        "audience": "string",
        "issuer": "string",
        "kid": "string",
        "revocation": "OCSP",
        "revocationCacheLifetime": 9
      }
    },
    "endpoints": {
      "acs": {
        "binding": "HTTP-REDIRECT",
        "destination": "string",
        "type": "INSTANCE",
        "url": "string"
      },
      "authorization": {
        "binding": "HTTP-POST",
        "destination": "string",
        "type": "INSTANCE",
        "url": "string"
      },
      "jwks": {
        "binding": "HTTP-POST",
        "destination": "string",
        "type": "ORG",
        "url": "string"
      },
      "metadata": {
        "binding": "HTTP-REDIRECT",
        "destination": "string",
        "type": "INSTANCE",
        "url": "string"
      },
      "slo": {
        "binding": "HTTP-REDIRECT",
        "destination": "string",
        "type": "INSTANCE",
        "url": "string"
      },
      "sso": {
        "binding": "HTTP-POST",
        "destination": "string",
        "type": "ORG",
        "url": "string"
      },
      "token": {
        "binding": "HTTP-REDIRECT",
        "destination": "string",
        "type": "ORG",
        "url": "string"
      },
      "userInfo": {
        "binding": "HTTP-POST",
        "destination": "string",
        "type": "INSTANCE",
        "url": "string"
      }
    },
    "issuer": {
      "binding": "HTTP-POST",
      "destination": "string",
      "type": "ORG",
      "url": "string"
    },
    "relayState": {
      "format": "OPAQUE"
    },
    "scopes": [
      "string",
      "string",
      "string",
      "string",
      "string"
    ],
    "settings": {
      "nameFormat": "string"
    },
    "type": "SAML2"
  },
  "status": "ACTIVE",
  "type": "X509"
}