[
  {
    "_links": {},
    "created": "string",
    "createdBy": "string",
    "default": true,
    "description": "string",
    "displayName": "string",
    "id": "string",
    "lastUpdated": "string",
    "lastUpdatedBy": "string",
    "name": "string"
  },
  {
    "_links": {},
    "created": "string",
    "createdBy": "string",
    "default": true,
    "description": "string",
    "displayName": "string",
    "id": "string",
    "lastUpdated": "string",
    "lastUpdatedBy": "string",
    "name": "string"
  },
  {
    "_links": {},
    "created": "string",
    "createdBy": "string",
    "default": false,
    "description": "string",
    "displayName": "string",
    "id": "string",
    "lastUpdated": "string",
    "lastUpdatedBy": "string",
    "name": "string"
  },
  {
    "_links": {},
    "created": "string",
    "createdBy": "string",
    "default": true,
    "description": "string",
    "displayName": "string",
    "id": "string",
    "lastUpdated": "string",
    "lastUpdatedBy": "string",
    "name": "string"
  }
]