[
  {
    "_links": {},
    "channel": {
      "config": {
        "authScheme": {
          "key": "string",
          "type": {},
          "value": "string"
        },
        "headers": [
          {
            "key": "string",
            "value": "string"
          },
          {
            "key": "string",
            "value": "string"
          },
          {
            "key": "string",
            "value": "string"
          },
          {
            "key": "string",
            "value": "string"
          },
          {
            "key": "string",
            "value": "string"
          },
          {
            "key": "string",
            "value": "string"
          },
          {
            "key": "string",
            "value": "string"
          },
          {
            "key": "string",
            "value": "string"
          },
          {
            "key": "string",
            "value": "string"
          }
        ],
        "uri": "string"
      },
      "type": "HTTP",
      "version": "string"
    },
    "created": "string",
    "createdBy": "string",
    "events": {
      "items": [
        "string"
      ],
      "type": "FLOW_EVENT"
    },
    "id": "string",
    "lastUpdated": "string",
    "name": "string",
    "status": "ACTIVE",
    "verificationStatus": "UNVERIFIED"
  },
  {
    "_links": {},
    "channel": {
      "config": {
        "authScheme": {
          "key": "string",
          "type": {},
          "value": "string"
        },
        "headers": [
          {
            "key": "string",
            "value": "string"
          },
          {
            "key": "string",
            "value": "string"
          },
          {
            "key": "string",
            "value": "string"
          },
          {
            "key": "string",
            "value": "string"
          },
          {
            "key": "string",
            "value": "string"
          },
          {
            "key": "string",
            "value": "string"
          },
          {
            "key": "string",
            "value": "string"
          }
        ],
        "uri": "string"
      },
      "type": "HTTP",
      "version": "string"
    },
    "created": "string",
    "createdBy": "string",
    "events": {
      "items": [
        "string",
        "string",
        "string",
        "string",
        "string",
        "string",
        "string"
      ],
      "type": "FLOW_EVENT"
    },
    "id": "string",
    "lastUpdated": "string",
    "name": "string",
    "status": "INACTIVE",
    "verificationStatus": "UNVERIFIED"
  },
  {
    "_links": {},
    "channel": {
      "config": {
        "authScheme": {
          "key": "string",
          "type": {},
          "value": "string"
        },
        "headers": [
          {
            "key": "string",
            "value": "string"
          },
          {
            "key": "string",
            "value": "string"
          },
          {
            "key": "string",
            "value": "string"
          },
          {
            "key": "string",
            "value": "string"
          },
          {
            "key": "string",
            "value": "string"
          },
          {
            "key": "string",
            "value": "string"
          },
          {
            "key": "string",
            "value": "string"
          },
          {
            "key": "string",
            "value": "string"
          }
        ],
        "uri": "string"
      },
      "type": "HTTP",
      "version": "string"
    },
    "created": "string",
    "createdBy": "string",
    "events": {
      "items": [
        "string",
        "string",
        "string",
        "string",
        "string",
        "string"
      ],
      "type": "FLOW_EVENT"
    },
    "id": "string",
    "lastUpdated": "string",
    "name": "string",
    "status": "INACTIVE",
    "verificationStatus": "UNVERIFIED"
  }
]