{
  "$id": "schema.json",
  "type": "object",
  "schema": "http://json-schema.org/draft-07/schema#",
  "translate": false,
  "dynamicfields": true,
  "properties": {
    "ph_request_type": {
      "type": "string",
      "description": "type of request (internal to adapter)",
      "default": "listGroups",
      "enum": [
        "listGroups",
        "createGroup",
        "listGroupRules",
        "createGroupRule",
        "deleteGroupRule",
        "getGroupRule",
        "updateGroupRule",
        "activateGroupRule",
        "deactivateGroupRule",
        "deleteGroup",
        "getGroup",
        "updateGroup",
        "listAssignedApplicationsForGroup",
        "listGroupAssignedRoles",
        "assignRoleToGroup",
        "removeRoleFromGroup",
        "getRole",
        "listApplicationTargetsForApplicationAdministratorRoleForGroup",
        "removeApplicationTargetFromApplicationAdministratorRoleGivenToGroup",
        "addApplicationTargetToAdminRoleGivenToGroup",
        "removeApplicationTargetFromAdministratorRoleGivenToGroup",
        "addApplicationInstanceTargetToAppAdminRoleGivenToGroup",
        "listGroupTargetsForGroupRole",
        "removeGroupTargetFromGroupAdministratorRoleGivenToGroup",
        "addGroupTargetToGroupAdministratorRoleForGroup",
        "listGroupUsers",
        "removeUserFromGroup",
        "addUserToGroup"
      ],
      "external_name": "ph_request_type"
    }
  },
  "definitions": {}
}