{
  "_embedded": {},
  "_links": {},
  "assignmentType": "GROUP",
  "created": "string",
  "description": "string",
  "id": "string",
  "label": "string",
  "lastUpdated": "string",
  "status": "INACTIVE",
  "type": "SUPER_ADMIN"
}