[
  {
    "_embedded": {},
    "_links": {},
    "created": "string",
    "externalId": "string",
    "id": "string",
    "lastUpdated": "string",
    "profile": {}
  },
  {
    "_embedded": {},
    "_links": {},
    "created": "string",
    "externalId": "string",
    "id": "string",
    "lastUpdated": "string",
    "profile": {}
  }
]