{
  "_embedded": {},
  "_links": {},
  "created": "string",
  "credentials": {
    "password": {
      "value": "string"
    },
    "userName": "string"
  },
  "externalId": "string",
  "id": "string",
  "lastSync": "string",
  "lastUpdated": "string",
  "passwordChanged": "string",
  "profile": {},
  "scope": "string",
  "status": "string",
  "statusChanged": "string",
  "syncState": "string"
}