{
  "_links": {},
  "alg": "string",
  "created": "string",
  "e": "string",
  "expiresAt": "string",
  "key_ops": [
    "string",
    "string",
    "string",
    "string"
  ],
  "kid": "string",
  "kty": "string",
  "lastUpdated": "string",
  "n": "string",
  "status": "string",
  "use": "string",
  "x5c": [
    "string",
    "string",
    "string"
  ],
  "x5t": "string",
  "x5t#S256": "string",
  "x5u": "string"
}