{
  "_links": {},
  "alwaysIncludeInToken": true,
  "claimType": "RESOURCE",
  "conditions": {
    "scopes": [
      "string",
      "string",
      "string",
      "string",
      "string"
    ]
  },
  "group_filter_type": "CONTAINS",
  "id": "string",
  "name": "string",
  "status": "INACTIVE",
  "system": true,
  "value": "string",
  "valueType": "GROUPS"
}