[
  {
    "_embedded": {},
    "_links": {},
    "conditions": {
      "app": {
        "exclude": [
          {
            "id": "string",
            "name": "string",
            "type": "APP"
          }
        ],
        "include": [
          {
            "id": "string",
            "name": "string",
            "type": "APP"
          },
          {
            "id": "string",
            "name": "string",
            "type": "APP"
          },
          {
            "id": "string",
            "name": "string",
            "type": "APP"
          },
          {
            "id": "string",
            "name": "string",
            "type": "APP_TYPE"
          },
          {
            "id": "string",
            "name": "string",
            "type": "APP_TYPE"
          },
          {
            "id": "string",
            "name": "string",
            "type": "APP"
          },
          {
            "id": "string",
            "name": "string",
            "type": "APP_TYPE"
          }
        ]
      },
      "apps": {
        "exclude": [
          "string",
          "string"
        ],
        "include": [
          "string",
          "string",
          "string",
          "string",
          "string"
        ]
      },
      "authContext": {
        "authType": "RADIUS"
      },
      "authProvider": {
        "include": [
          "string"
        ],
        "provider": "LDAP"
      },
      "beforeScheduledAction": {
        "duration": {
          "number": 4,
          "unit": "string"
        },
        "lifecycleAction": {
          "status": "EXPIRED_PASSWORD"
        }
      },
      "clients": {
        "include": [
          "string",
          "string",
          "string",
          "string",
          "string",
          "string",
          "string",
          "string",
          "string"
        ]
      },
      "context": {
        "expression": "string"
      },
      "device": {
        "migrated": true,
        "platform": {
          "supportedMDMFrameworks": [
            "NATIVE",
            "NATIVE",
            "SAFE",
            "NATIVE",
            "NATIVE",
            "NATIVE"
          ],
          "types": [
            "ANDROID",
            "WINDOWS",
            "IOS",
            "WINDOWS",
            "ANDROID",
            "WINDOWS",
            "OSX",
            "OSX",
            "ANDROID"
          ]
        },
        "rooted": false,
        "trustLevel": "ANY"
      },
      "grantTypes": {
        "include": [
          "string",
          "string",
          "string",
          "string",
          "string"
        ]
      },
      "groups": {
        "exclude": [
          "string"
        ],
        "include": [
          "string",
          "string",
          "string",
          "string",
          "string",
          "string",
          "string"
        ]
      },
      "identityProvider": {
        "idpIds": [
          "string",
          "string",
          "string"
        ],
        "provider": "SPECIFIC_IDP"
      },
      "mdmEnrollment": {
        "blockNonSafeAndroid": false,
        "enrollment": "OMM"
      },
      "network": {
        "connection": "ANYWHERE",
        "exclude": [
          "string",
          "string"
        ],
        "include": [
          "string",
          "string",
          "string"
        ]
      },
      "people": {
        "groups": {
          "exclude": [
            "string",
            "string",
            "string",
            "string",
            "string"
          ],
          "include": [
            "string",
            "string",
            "string",
            "string"
          ]
        },
        "users": {
          "exclude": [
            "string",
            "string",
            "string",
            "string",
            "string",
            "string",
            "string",
            "string",
            "string",
            "string"
          ],
          "include": [
            "string",
            "string",
            "string",
            "string",
            "string",
            "string",
            "string",
            "string",
            "string"
          ]
        }
      },
      "platform": {
        "exclude": [
          {
            "os": {},
            "type": "OTHER"
          },
          {
            "os": {},
            "type": "MOBILE"
          },
          {
            "os": {},
            "type": "MOBILE"
          },
          {
            "os": {},
            "type": "DESKTOP"
          },
          {
            "os": {},
            "type": "ANY"
          },
          {
            "os": {},
            "type": "MOBILE"
          }
        ],
        "include": [
          {
            "os": {},
            "type": "DESKTOP"
          },
          {
            "os": {},
            "type": "DESKTOP"
          },
          {
            "os": {},
            "type": "ANY"
          },
          {
            "os": {},
            "type": "DESKTOP"
          },
          {
            "os": {},
            "type": "MOBILE"
          },
          {
            "os": {},
            "type": "ANY"
          },
          {
            "os": {},
            "type": "ANY"
          },
          {
            "os": {},
            "type": "OTHER"
          },
          {
            "os": {},
            "type": "DESKTOP"
          },
          {
            "os": {},
            "type": "MOBILE"
          }
        ]
      },
      "risk": {
        "behaviors": [
          "string",
          "string",
          "string",
          "string",
          "string"
        ]
      },
      "riskScore": {
        "level": "string"
      },
      "scopes": {
        "include": [
          "string",
          "string",
          "string",
          "string",
          "string",
          "string"
        ]
      },
      "userIdentifier": {
        "attribute": "string",
        "patterns": [
          {
            "matchType": "SUFFIX",
            "value": "string"
          },
          {
            "matchType": "CONTAINS",
            "value": "string"
          },
          {
            "matchType": "EXPRESSION",
            "value": "string"
          },
          {
            "matchType": "SUFFIX",
            "value": "string"
          },
          {
            "matchType": "STARTS_WITH",
            "value": "string"
          }
        ],
        "type": "ATTRIBUTE"
      },
      "userStatus": {
        "value": "DELETED"
      },
      "users": {
        "exclude": [
          "string",
          "string",
          "string",
          "string"
        ],
        "inactivity": {
          "number": 4,
          "unit": "string"
        },
        "include": [
          "string",
          "string",
          "string",
          "string",
          "string",
          "string",
          "string",
          "string"
        ],
        "lifecycleExpiration": {
          "lifecycleStatus": "string",
          "number": 8,
          "unit": "string"
        },
        "passwordExpiration": {
          "number": 6,
          "unit": "string"
        },
        "userLifecycleAttribute": {
          "attributeName": "string",
          "matchingValue": "string"
        }
      }
    },
    "created": "string",
    "description": "string",
    "id": "string",
    "lastUpdated": "string",
    "name": "string",
    "priority": 8,
    "status": "ACTIVE",
    "system": true,
    "type": "PASSWORD"
  },
  {
    "_embedded": {},
    "_links": {},
    "conditions": {
      "app": {
        "exclude": [
          {
            "id": "string",
            "name": "string",
            "type": "APP_TYPE"
          },
          {
            "id": "string",
            "name": "string",
            "type": "APP"
          },
          {
            "id": "string",
            "name": "string",
            "type": "APP"
          },
          {
            "id": "string",
            "name": "string",
            "type": "APP_TYPE"
          }
        ],
        "include": [
          {
            "id": "string",
            "name": "string",
            "type": "APP"
          },
          {
            "id": "string",
            "name": "string",
            "type": "APP"
          },
          {
            "id": "string",
            "name": "string",
            "type": "APP"
          },
          {
            "id": "string",
            "name": "string",
            "type": "APP"
          },
          {
            "id": "string",
            "name": "string",
            "type": "APP"
          },
          {
            "id": "string",
            "name": "string",
            "type": "APP"
          }
        ]
      },
      "apps": {
        "exclude": [
          "string",
          "string",
          "string",
          "string",
          "string"
        ],
        "include": [
          "string",
          "string",
          "string",
          "string",
          "string",
          "string",
          "string",
          "string",
          "string",
          "string"
        ]
      },
      "authContext": {
        "authType": "RADIUS"
      },
      "authProvider": {
        "include": [
          "string",
          "string",
          "string",
          "string",
          "string",
          "string",
          "string"
        ],
        "provider": "LDAP"
      },
      "beforeScheduledAction": {
        "duration": {
          "number": 2,
          "unit": "string"
        },
        "lifecycleAction": {
          "status": "INACTIVE"
        }
      },
      "clients": {
        "include": [
          "string",
          "string",
          "string",
          "string",
          "string",
          "string",
          "string",
          "string",
          "string"
        ]
      },
      "context": {
        "expression": "string"
      },
      "device": {
        "migrated": false,
        "platform": {
          "supportedMDMFrameworks": [
            "SAFE",
            "AFW",
            "SAFE",
            "AFW",
            "SAFE",
            "NATIVE",
            "NATIVE",
            "SAFE",
            "NATIVE",
            "NATIVE"
          ],
          "types": [
            "WINDOWS",
            "ANDROID",
            "WINDOWS",
            "OSX"
          ]
        },
        "rooted": true,
        "trustLevel": "ANY"
      },
      "grantTypes": {
        "include": [
          "string",
          "string"
        ]
      },
      "groups": {
        "exclude": [
          "string",
          "string",
          "string",
          "string",
          "string"
        ],
        "include": [
          "string",
          "string",
          "string"
        ]
      },
      "identityProvider": {
        "idpIds": [
          "string",
          "string",
          "string",
          "string"
        ],
        "provider": "OKTA"
      },
      "mdmEnrollment": {
        "blockNonSafeAndroid": false,
        "enrollment": "ANY_OR_NONE"
      },
      "network": {
        "connection": "ANYWHERE",
        "exclude": [
          "string",
          "string",
          "string",
          "string",
          "string",
          "string",
          "string",
          "string",
          "string",
          "string"
        ],
        "include": [
          "string",
          "string",
          "string",
          "string",
          "string",
          "string"
        ]
      },
      "people": {
        "groups": {
          "exclude": [
            "string",
            "string",
            "string",
            "string",
            "string",
            "string",
            "string",
            "string"
          ],
          "include": [
            "string",
            "string"
          ]
        },
        "users": {
          "exclude": [
            "string",
            "string",
            "string"
          ],
          "include": [
            "string",
            "string",
            "string"
          ]
        }
      },
      "platform": {
        "exclude": [
          {
            "os": {},
            "type": "ANY"
          },
          {
            "os": {},
            "type": "ANY"
          },
          {
            "os": {},
            "type": "DESKTOP"
          },
          {
            "os": {},
            "type": "MOBILE"
          },
          {
            "os": {},
            "type": "OTHER"
          },
          {
            "os": {},
            "type": "OTHER"
          },
          {
            "os": {},
            "type": "DESKTOP"
          },
          {
            "os": {},
            "type": "DESKTOP"
          },
          {
            "os": {},
            "type": "OTHER"
          },
          {
            "os": {},
            "type": "ANY"
          }
        ],
        "include": [
          {
            "os": {},
            "type": "MOBILE"
          },
          {
            "os": {},
            "type": "ANY"
          },
          {
            "os": {},
            "type": "ANY"
          },
          {
            "os": {},
            "type": "ANY"
          },
          {
            "os": {},
            "type": "ANY"
          },
          {
            "os": {},
            "type": "ANY"
          },
          {
            "os": {},
            "type": "MOBILE"
          }
        ]
      },
      "risk": {
        "behaviors": [
          "string",
          "string",
          "string",
          "string"
        ]
      },
      "riskScore": {
        "level": "string"
      },
      "scopes": {
        "include": [
          "string",
          "string",
          "string",
          "string",
          "string"
        ]
      },
      "userIdentifier": {
        "attribute": "string",
        "patterns": [
          {
            "matchType": "CONTAINS",
            "value": "string"
          },
          {
            "matchType": "SUFFIX",
            "value": "string"
          },
          {
            "matchType": "SUFFIX",
            "value": "string"
          },
          {
            "matchType": "STARTS_WITH",
            "value": "string"
          },
          {
            "matchType": "SUFFIX",
            "value": "string"
          },
          {
            "matchType": "STARTS_WITH",
            "value": "string"
          },
          {
            "matchType": "SUFFIX",
            "value": "string"
          },
          {
            "matchType": "STARTS_WITH",
            "value": "string"
          }
        ],
        "type": "IDENTIFIER"
      },
      "userStatus": {
        "value": "EXPIRED_PASSWORD"
      },
      "users": {
        "exclude": [
          "string",
          "string",
          "string",
          "string",
          "string",
          "string",
          "string"
        ],
        "inactivity": {
          "number": 5,
          "unit": "string"
        },
        "include": [
          "string",
          "string",
          "string",
          "string"
        ],
        "lifecycleExpiration": {
          "lifecycleStatus": "string",
          "number": 1,
          "unit": "string"
        },
        "passwordExpiration": {
          "number": 3,
          "unit": "string"
        },
        "userLifecycleAttribute": {
          "attributeName": "string",
          "matchingValue": "string"
        }
      }
    },
    "created": "string",
    "description": "string",
    "id": "string",
    "lastUpdated": "string",
    "name": "string",
    "priority": 10,
    "status": "ACTIVE",
    "system": false,
    "type": "OAUTH_AUTHORIZATION_POLICY"
  },
  {
    "_embedded": {},
    "_links": {},
    "conditions": {
      "app": {
        "exclude": [
          {
            "id": "string",
            "name": "string",
            "type": "APP"
          },
          {
            "id": "string",
            "name": "string",
            "type": "APP_TYPE"
          }
        ],
        "include": [
          {
            "id": "string",
            "name": "string",
            "type": "APP"
          },
          {
            "id": "string",
            "name": "string",
            "type": "APP"
          },
          {
            "id": "string",
            "name": "string",
            "type": "APP_TYPE"
          }
        ]
      },
      "apps": {
        "exclude": [
          "string",
          "string",
          "string",
          "string",
          "string",
          "string",
          "string"
        ],
        "include": [
          "string",
          "string",
          "string",
          "string"
        ]
      },
      "authContext": {
        "authType": "ANY"
      },
      "authProvider": {
        "include": [
          "string",
          "string"
        ],
        "provider": "LDAP"
      },
      "beforeScheduledAction": {
        "duration": {
          "number": 5,
          "unit": "string"
        },
        "lifecycleAction": {
          "status": "PENDING"
        }
      },
      "clients": {
        "include": [
          "string"
        ]
      },
      "context": {
        "expression": "string"
      },
      "device": {
        "migrated": false,
        "platform": {
          "supportedMDMFrameworks": [
            "SAFE",
            "AFW",
            "NATIVE",
            "SAFE"
          ],
          "types": [
            "OSX",
            "IOS",
            "WINDOWS",
            "IOS",
            "ANDROID"
          ]
        },
        "rooted": false,
        "trustLevel": "ANY"
      },
      "grantTypes": {
        "include": [
          "string"
        ]
      },
      "groups": {
        "exclude": [
          "string",
          "string",
          "string",
          "string",
          "string",
          "string",
          "string"
        ],
        "include": [
          "string",
          "string",
          "string",
          "string",
          "string",
          "string",
          "string"
        ]
      },
      "identityProvider": {
        "idpIds": [
          "string",
          "string",
          "string",
          "string",
          "string",
          "string",
          "string",
          "string"
        ],
        "provider": "OKTA"
      },
      "mdmEnrollment": {
        "blockNonSafeAndroid": true,
        "enrollment": "OMM"
      },
      "network": {
        "connection": "ANYWHERE",
        "exclude": [
          "string"
        ],
        "include": [
          "string",
          "string",
          "string",
          "string",
          "string",
          "string",
          "string"
        ]
      },
      "people": {
        "groups": {
          "exclude": [
            "string",
            "string",
            "string",
            "string"
          ],
          "include": [
            "string",
            "string",
            "string",
            "string",
            "string",
            "string"
          ]
        },
        "users": {
          "exclude": [
            "string",
            "string",
            "string",
            "string"
          ],
          "include": [
            "string",
            "string",
            "string",
            "string",
            "string",
            "string",
            "string",
            "string",
            "string",
            "string"
          ]
        }
      },
      "platform": {
        "exclude": [
          {
            "os": {},
            "type": "MOBILE"
          },
          {
            "os": {},
            "type": "DESKTOP"
          },
          {
            "os": {},
            "type": "MOBILE"
          },
          {
            "os": {},
            "type": "DESKTOP"
          },
          {
            "os": {},
            "type": "ANY"
          },
          {
            "os": {},
            "type": "DESKTOP"
          },
          {
            "os": {},
            "type": "MOBILE"
          }
        ],
        "include": [
          {
            "os": {},
            "type": "ANY"
          },
          {
            "os": {},
            "type": "ANY"
          },
          {
            "os": {},
            "type": "OTHER"
          },
          {
            "os": {},
            "type": "DESKTOP"
          },
          {
            "os": {},
            "type": "OTHER"
          }
        ]
      },
      "risk": {
        "behaviors": [
          "string",
          "string",
          "string",
          "string",
          "string",
          "string"
        ]
      },
      "riskScore": {
        "level": "string"
      },
      "scopes": {
        "include": [
          "string",
          "string",
          "string",
          "string",
          "string",
          "string",
          "string"
        ]
      },
      "userIdentifier": {
        "attribute": "string",
        "patterns": [
          {
            "matchType": "CONTAINS",
            "value": "string"
          },
          {
            "matchType": "EXPRESSION",
            "value": "string"
          },
          {
            "matchType": "SUFFIX",
            "value": "string"
          },
          {
            "matchType": "EXPRESSION",
            "value": "string"
          }
        ],
        "type": "ATTRIBUTE"
      },
      "userStatus": {
        "value": "DELETING"
      },
      "users": {
        "exclude": [
          "string"
        ],
        "inactivity": {
          "number": 2,
          "unit": "string"
        },
        "include": [
          "string",
          "string",
          "string",
          "string",
          "string",
          "string",
          "string",
          "string",
          "string",
          "string"
        ],
        "lifecycleExpiration": {
          "lifecycleStatus": "string",
          "number": 10,
          "unit": "string"
        },
        "passwordExpiration": {
          "number": 3,
          "unit": "string"
        },
        "userLifecycleAttribute": {
          "attributeName": "string",
          "matchingValue": "string"
        }
      }
    },
    "created": "string",
    "description": "string",
    "id": "string",
    "lastUpdated": "string",
    "name": "string",
    "priority": 9,
    "status": "ACTIVE",
    "system": false,
    "type": "OAUTH_AUTHORIZATION_POLICY"
  }
]