[
  {
    "_links": {},
    "category": "string",
    "description": "string",
    "displayName": "string",
    "features": [
      "string",
      "string",
      "string",
      "string",
      "string",
      "string",
      "string"
    ],
    "id": "string",
    "lastUpdated": "string",
    "name": "string",
    "signOnModes": [
      "string",
      "string",
      "string",
      "string",
      "string",
      "string"
    ],
    "status": "INACTIVE",
    "verificationStatus": "string",
    "website": "string"
  },
  {
    "_links": {},
    "category": "string",
    "description": "string",
    "displayName": "string",
    "features": [
      "string",
      "string",
      "string",
      "string",
      "string"
    ],
    "id": "string",
    "lastUpdated": "string",
    "name": "string",
    "signOnModes": [
      "string",
      "string",
      "string",
      "string",
      "string",
      "string",
      "string",
      "string"
    ],
    "status": "ACTIVE",
    "verificationStatus": "string",
    "website": "string"
  },
  {
    "_links": {},
    "category": "string",
    "description": "string",
    "displayName": "string",
    "features": [
      "string",
      "string",
      "string",
      "string"
    ],
    "id": "string",
    "lastUpdated": "string",
    "name": "string",
    "signOnModes": [
      "string"
    ],
    "status": "INACTIVE",
    "verificationStatus": "string",
    "website": "string"
  }
]