[
  {
    "_embedded": {},
    "_links": {},
    "created": "string",
    "id": "string",
    "lastMembershipUpdated": "string",
    "lastUpdated": "string",
    "objectClass": [
      "string",
      "string",
      "string",
      "string",
      "string",
      "string"
    ],
    "profile": {
      "description": "string",
      "name": "string"
    },
    "type": "BUILT_IN"
  },
  {
    "_embedded": {},
    "_links": {},
    "created": "string",
    "id": "string",
    "lastMembershipUpdated": "string",
    "lastUpdated": "string",
    "objectClass": [
      "string",
      "string",
      "string",
      "string",
      "string",
      "string",
      "string",
      "string",
      "string"
    ],
    "profile": {
      "description": "string",
      "name": "string"
    },
    "type": "OKTA_GROUP"
  },
  {
    "_embedded": {},
    "_links": {},
    "created": "string",
    "id": "string",
    "lastMembershipUpdated": "string",
    "lastUpdated": "string",
    "objectClass": [
      "string",
      "string",
      "string"
    ],
    "profile": {
      "description": "string",
      "name": "string"
    },
    "type": "BUILT_IN"
  },
  {
    "_embedded": {},
    "_links": {},
    "created": "string",
    "id": "string",
    "lastMembershipUpdated": "string",
    "lastUpdated": "string",
    "objectClass": [
      "string",
      "string",
      "string",
      "string",
      "string",
      "string",
      "string",
      "string",
      "string",
      "string"
    ],
    "profile": {
      "description": "string",
      "name": "string"
    },
    "type": "OKTA_GROUP"
  }
]