{
  "_embedded": {},
  "_links": {},
  "conditions": {
    "app": {
      "exclude": [
        {
          "id": "string",
          "name": "string",
          "type": "APP_TYPE"
        },
        {
          "id": "string",
          "name": "string",
          "type": "APP_TYPE"
        },
        {
          "id": "string",
          "name": "string",
          "type": "APP"
        },
        {
          "id": "string",
          "name": "string",
          "type": "APP"
        },
        {
          "id": "string",
          "name": "string",
          "type": "APP"
        }
      ],
      "include": [
        {
          "id": "string",
          "name": "string",
          "type": "APP"
        },
        {
          "id": "string",
          "name": "string",
          "type": "APP"
        },
        {
          "id": "string",
          "name": "string",
          "type": "APP"
        },
        {
          "id": "string",
          "name": "string",
          "type": "APP"
        },
        {
          "id": "string",
          "name": "string",
          "type": "APP"
        },
        {
          "id": "string",
          "name": "string",
          "type": "APP"
        }
      ]
    },
    "apps": {
      "exclude": [
        "string"
      ],
      "include": [
        "string"
      ]
    },
    "authContext": {
      "authType": "RADIUS"
    },
    "authProvider": {
      "include": [
        "string",
        "string",
        "string",
        "string"
      ],
      "provider": "ACTIVE_DIRECTORY"
    },
    "beforeScheduledAction": {
      "duration": {
        "number": 9,
        "unit": "string"
      },
      "lifecycleAction": {
        "status": "EXPIRED_PASSWORD"
      }
    },
    "clients": {
      "include": [
        "string",
        "string",
        "string"
      ]
    },
    "context": {
      "expression": "string"
    },
    "device": {
      "migrated": false,
      "platform": {
        "supportedMDMFrameworks": [
          "SAFE",
          "NATIVE",
          "NATIVE",
          "NATIVE"
        ],
        "types": [
          "ANDROID"
        ]
      },
      "rooted": true,
      "trustLevel": "ANY"
    },
    "grantTypes": {
      "include": [
        "string",
        "string",
        "string",
        "string",
        "string",
        "string",
        "string",
        "string",
        "string"
      ]
    },
    "groups": {
      "exclude": [
        "string",
        "string",
        "string",
        "string",
        "string",
        "string",
        "string",
        "string",
        "string"
      ],
      "include": [
        "string",
        "string",
        "string",
        "string",
        "string",
        "string",
        "string",
        "string",
        "string"
      ]
    },
    "identityProvider": {
      "idpIds": [
        "string",
        "string"
      ],
      "provider": "ANY"
    },
    "mdmEnrollment": {
      "blockNonSafeAndroid": true,
      "enrollment": "OMM"
    },
    "network": {
      "connection": "ANYWHERE",
      "exclude": [
        "string"
      ],
      "include": [
        "string",
        "string",
        "string",
        "string",
        "string"
      ]
    },
    "people": {
      "groups": {
        "exclude": [
          "string",
          "string",
          "string",
          "string",
          "string"
        ],
        "include": [
          "string",
          "string",
          "string",
          "string",
          "string",
          "string",
          "string",
          "string"
        ]
      },
      "users": {
        "exclude": [
          "string",
          "string",
          "string",
          "string",
          "string",
          "string",
          "string",
          "string",
          "string",
          "string"
        ],
        "include": [
          "string",
          "string",
          "string",
          "string",
          "string",
          "string",
          "string",
          "string",
          "string",
          "string"
        ]
      }
    },
    "platform": {
      "exclude": [
        {
          "os": {},
          "type": "MOBILE"
        },
        {
          "os": {},
          "type": "MOBILE"
        },
        {
          "os": {},
          "type": "ANY"
        },
        {
          "os": {},
          "type": "ANY"
        },
        {
          "os": {},
          "type": "OTHER"
        },
        {
          "os": {},
          "type": "DESKTOP"
        },
        {
          "os": {},
          "type": "ANY"
        },
        {
          "os": {},
          "type": "MOBILE"
        },
        {
          "os": {},
          "type": "DESKTOP"
        }
      ],
      "include": [
        {
          "os": {},
          "type": "OTHER"
        },
        {
          "os": {},
          "type": "MOBILE"
        },
        {
          "os": {},
          "type": "DESKTOP"
        },
        {
          "os": {},
          "type": "ANY"
        },
        {
          "os": {},
          "type": "MOBILE"
        }
      ]
    },
    "risk": {
      "behaviors": [
        "string",
        "string",
        "string",
        "string",
        "string",
        "string",
        "string",
        "string",
        "string"
      ]
    },
    "riskScore": {
      "level": "string"
    },
    "scopes": {
      "include": [
        "string",
        "string",
        "string",
        "string",
        "string",
        "string"
      ]
    },
    "userIdentifier": {
      "attribute": "string",
      "patterns": [
        {
          "matchType": "EXPRESSION",
          "value": "string"
        },
        {
          "matchType": "CONTAINS",
          "value": "string"
        },
        {
          "matchType": "CONTAINS",
          "value": "string"
        },
        {
          "matchType": "STARTS_WITH",
          "value": "string"
        }
      ],
      "type": "ATTRIBUTE"
    },
    "userStatus": {
      "value": "EXPIRED_PASSWORD"
    },
    "users": {
      "exclude": [
        "string",
        "string",
        "string",
        "string"
      ],
      "inactivity": {
        "number": 10,
        "unit": "string"
      },
      "include": [
        "string",
        "string"
      ],
      "lifecycleExpiration": {
        "lifecycleStatus": "string",
        "number": 6,
        "unit": "string"
      },
      "passwordExpiration": {
        "number": 5,
        "unit": "string"
      },
      "userLifecycleAttribute": {
        "attributeName": "string",
        "matchingValue": "string"
      }
    }
  },
  "created": "string",
  "description": "string",
  "id": "string",
  "lastUpdated": "string",
  "name": "string",
  "priority": 4,
  "status": "INACTIVE",
  "system": true,
  "type": "IDP_DISCOVERY"
}