{
  "name": "adapter-okta",
  "webName": "Adapter for Integration to Okta",
  "supportLevel": "community",
  "vendor": "Okta",
  "product": "Okta",
  "techAlliance": false,
  "osVersion": [],
  "apiVersions": [],
  "iapVersions": [
    "2021.1.x",
    "2021.2.x",
    "2022.1.x",
    "2023.1.x"
  ],
  "method": "REST",
  "type": "Adapter",
  "domains": [
    "Security (SASE)"
  ],
  "tags": [
    "Security Policy Management"
  ],
  "useCases": [
    "Security Group updates",
    "Security Rule Removal",
    "Security Rule Creation"
  ],
  "deprecated": {
    "isDeprecated": false
  },
  "brokerSince": "",
  "authMethods": [
    {
      "type": "API Key",
      "primary": true
    }
  ],
  "documentation": {
    "storeLink": "",
    "npmLink": "https://www.npmjs.com/package/@itentialopensource/adapter-okta",
    "repoLink": "https://gitlab.com/itentialopensource/adapters/adapter-okta",
    "docLink": "https://gitlab.com/itentialopensource/adapters/adapter-okta/-/blob/master/README.md?ref_type=heads",
    "demoLinks": [],
    "trainingLinks": [
      {
        "title": "Itential Academy",
        "link": "https://www.itential.com/itential-academy/"
      }
    ],
    "faqLink": "https://docs.itential.com/opensource/docs/troubleshooting-an-adapter",
    "contributeLink": "https://gitlab.com/itentialopensource/adapters/contributing-guide",
    "issueLink": "https://itential.atlassian.net/servicedesk/customer/portals",
    "webLink": "https://www.itential.com/adapters/okta/",
    "vendorLink": "https://www.okta.com/",
    "productLink": "https://www.okta.com/",
    "apiLinks": [
      {
        "title": "Core Okta API",
        "link": "https://developer.okta.com/docs/reference/core-okta-api/",
        "public": true
      },
      {
        "title": "Okta Developer Reference",
        "link": "https://developer.okta.com/docs/reference/",
        "public": true
      }
    ],
    "workshopLinks": [],
    "workshopHomePage": "https://www.itential.com/get-started/"
  },
  "assets": [],
  "relatedItems": {
    "adapters": [],
    "integrations": [],
    "ecosystemApplications": [],
    "workflowProjects": [],
    "transformationProjects": [],
    "exampleProjects": []
  }
}