[
  {
    "_embedded": {},
    "_links": {},
    "activated": "string",
    "created": "string",
    "credentials": {
      "password": {
        "hash": {
          "algorithm": {},
          "salt": "string",
          "saltOrder": "string",
          "value": "string",
          "workFactor": 1
        },
        "hook": {
          "type": "string"
        },
        "value": "string"
      },
      "provider": {
        "name": "string",
        "type": "LDAP"
      },
      "recovery_question": {
        "answer": "string",
        "question": "string"
      }
    },
    "id": "string",
    "lastLogin": "string",
    "lastUpdated": "string",
    "passwordChanged": "string",
    "profile": {
      "city": "string",
      "costCenter": "string",
      "countryCode": "string",
      "department": "string",
      "displayName": "string",
      "division": "string",
      "email": "string",
      "employeeNumber": "string",
      "firstName": "string",
      "honorificPrefix": "string",
      "honorificSuffix": "string",
      "lastName": "string",
      "locale": "string",
      "login": "string",
      "manager": "string",
      "managerId": "string",
      "middleName": "string",
      "mobilePhone": "string",
      "nickName": "string",
      "organization": "string",
      "postalAddress": "string",
      "preferredLanguage": "string",
      "primaryPhone": "string",
      "profileUrl": "string",
      "secondEmail": "string",
      "state": "string",
      "streetAddress": "string",
      "timezone": "string",
      "title": "string",
      "userType": "string",
      "zipCode": "string"
    },
    "status": "DEPROVISIONED",
    "statusChanged": "string",
    "transitioningToStatus": "RECOVERY",
    "type": {
      "_links": {},
      "created": "string",
      "createdBy": "string",
      "default": false,
      "description": "string",
      "displayName": "string",
      "id": "string",
      "lastUpdated": "string",
      "lastUpdatedBy": "string",
      "name": "string"
    }
  }
]