{
  "actions": {
    "token": {
      "accessTokenLifetimeMinutes": 8,
      "refreshTokenLifetimeMinutes": 4,
      "refreshTokenWindowMinutes": 4
    }
  },
  "conditions": {
    "clients": {
      "include": [
        "string"
      ]
    },
    "grantTypes": {
      "include": [
        "string",
        "string",
        "string",
        "string",
        "string"
      ]
    },
    "people": {
      "groups": {
        "exclude": [
          "string",
          "string",
          "string",
          "string",
          "string",
          "string",
          "string",
          "string",
          "string"
        ],
        "include": [
          "string",
          "string",
          "string"
        ]
      },
      "users": {
        "exclude": [
          "string",
          "string",
          "string",
          "string"
        ],
        "include": [
          "string"
        ]
      }
    },
    "scopes": {
      "include": [
        "string",
        "string",
        "string",
        "string"
      ]
    }
  },
  "created": "string",
  "id": "string",
  "lastUpdated": "string",
  "name": "string",
  "priority": 8,
  "status": "ACTIVE",
  "system": true,
  "type": "RESOURCE_ACCESS"
}