{
  "_embedded": {},
  "_links": {},
  "created": "string",
  "factorType": "hotp",
  "id": "string",
  "lastUpdated": "string",
  "provider": "YUBICO",
  "status": "DISABLED",
  "verify": {
    "activationToken": "string",
    "answer": "string",
    "attestation": "string",
    "clientData": "string",
    "nextPassCode": "string",
    "passCode": "string",
    "registrationData": "string",
    "stateToken": "string"
  }
}