[
  {
    "_links": {},
    "description": "string",
    "id": "string",
    "name": "string",
    "stage": {
      "state": "CLOSED",
      "value": "EA"
    },
    "status": "ENABLED",
    "type": "self-service"
  },
  {
    "_links": {},
    "description": "string",
    "id": "string",
    "name": "string",
    "stage": {
      "state": "CLOSED",
      "value": "BETA"
    },
    "status": "ENABLED",
    "type": "self-service"
  },
  {
    "_links": {},
    "description": "string",
    "id": "string",
    "name": "string",
    "stage": {
      "state": "OPEN",
      "value": "EA"
    },
    "status": "DISABLED",
    "type": "self-service"
  }
]