{
  "_embedded": {},
  "_links": {},
  "created": "string",
  "id": "string",
  "lastMembershipUpdated": "string",
  "lastUpdated": "string",
  "objectClass": [
    "string",
    "string",
    "string",
    "string",
    "string",
    "string",
    "string",
    "string"
  ],
  "profile": {
    "description": "string",
    "name": "string"
  },
  "type": "APP_GROUP"
}