{
  "_links": {},
  "channel": {
    "config": {
      "authScheme": {
        "key": "string",
        "type": "string",
        "value": "string"
      },
      "headers": [
        {
          "key": "string",
          "value": "string"
        },
        {
          "key": "string",
          "value": "string"
        },
        {
          "key": "string",
          "value": "string"
        }
      ],
      "method": "string",
      "uri": "string"
    },
    "type": "HTTP",
    "version": "string"
  },
  "created": "string",
  "id": "string",
  "lastUpdated": "string",
  "name": "string",
  "status": "INACTIVE",
  "type": "com.okta.import.transform",
  "version": "string"
}