{
  "actions": [
    {
      "name": "getAccountsAccountUserId",
      "protocol": "REST",
      "method": "GET",
      "entitypath": "{base_path}/{version}/accounts/{pathv1}/users/{pathv2}?{query}",
      "requestSchema": "schema.json",
      "responseSchema": "schema.json",
      "timeout": 0,
      "sendEmpty": false,
      "sendGetBody": false,
      "requestDatatype": "JSON",
      "responseDatatype": "JSON",
      "headers": {},
      "responseObjects": [
        {
          "type": "default",
          "key": "",
          "mockFile": "mockdatafiles/getAccountsAccountUserId-default.json"
        }
      ]
    },
    {
      "name": "postAccountsAccountUser",
      "protocol": "REST",
      "method": "POST",
      "entitypath": "{base_path}/{version}/accounts/{pathv1}/users?{query}",
      "requestSchema": "schema.json",
      "responseSchema": "schema.json",
      "timeout": 0,
      "sendEmpty": false,
      "requestDatatype": "JSON",
      "responseDatatype": "JSON",
      "headers": {},
      "responseObjects": [
        {
          "type": "default",
          "key": "",
          "mockFile": "mockdatafiles/postAccountsAccountUser-default.json"
        }
      ]
    },
    {
      "name": "getAccountsAccountUser",
      "protocol": "REST",
      "method": "GET",
      "entitypath": "{base_path}/{version}/accounts/{pathv1}/users?{query}",
      "requestSchema": "schema.json",
      "responseSchema": "schema.json",
      "timeout": 0,
      "sendEmpty": false,
      "sendGetBody": false,
      "requestDatatype": "JSON",
      "responseDatatype": "JSON",
      "headers": {},
      "responseObjects": [
        {
          "type": "default",
          "key": "",
          "mockFile": "mockdatafiles/getAccountsAccountUser-default.json"
        }
      ]
    },
    {
      "name": "postAccountsAccountUsersId",
      "protocol": "REST",
      "method": "POST",
      "entitypath": "{base_path}/{version}/accounts/{pathv1}/users/{pathv2}?{query}",
      "requestSchema": "schema.json",
      "responseSchema": "schema.json",
      "timeout": 0,
      "sendEmpty": false,
      "requestDatatype": "JSON",
      "responseDatatype": "JSON",
      "headers": {},
      "responseObjects": [
        {
          "type": "default",
          "key": "",
          "mockFile": "mockdatafiles/postAccountsAccountUsersId-default.json"
        }
      ]
    },
    {
      "name": "deleteAccountsAccountUsersId",
      "protocol": "REST",
      "method": "DELETE",
      "entitypath": "{base_path}/{version}/accounts/{pathv1}/users/{pathv2}?{query}",
      "requestSchema": "schema.json",
      "responseSchema": "schema.json",
      "timeout": 0,
      "sendEmpty": false,
      "requestDatatype": "JSON",
      "responseDatatype": "JSON",
      "headers": {},
      "responseObjects": [
        {
          "type": "default",
          "key": "",
          "mockFile": ""
        }
      ]
    },
    {
      "name": "postAccountsAccountUsersIdActionsUpdatePassword",
      "protocol": "REST",
      "method": "POST",
      "entitypath": "{base_path}/{version}/accounts/{pathv1}/users/{pathv2}/actions/update-password?{query}",
      "requestSchema": "schema.json",
      "responseSchema": "schema.json",
      "timeout": 0,
      "sendEmpty": false,
      "requestDatatype": "JSON",
      "responseDatatype": "JSON",
      "headers": {},
      "responseObjects": [
        {
          "type": "default",
          "key": "",
          "mockFile": "mockdatafiles/postAccountsAccountUsersIdActionsUpdatePassword-default.json"
        }
      ]
    },
    {
      "name": "postAccountsAccountUsersIdActionsResetPassword",
      "protocol": "REST",
      "method": "POST",
      "entitypath": "{base_path}/{version}/accounts/{pathv1}/users/{pathv2}/actions/reset-password?{query}",
      "requestSchema": "schema.json",
      "responseSchema": "schema.json",
      "timeout": 0,
      "sendEmpty": false,
      "requestDatatype": "JSON",
      "responseDatatype": "JSON",
      "headers": {},
      "responseObjects": [
        {
          "type": "default",
          "key": "",
          "mockFile": "mockdatafiles/postAccountsAccountUsersIdActionsResetPassword-default.json"
        }
      ]
    }
  ]
}