{
  "id": "@itentialopensource/adapter-keygen",
  "type": "Adapter",
  "export": "Keygen",
  "title": "Keygen",
  "src": "adapter.js",
  "roles": [
    "admin"
  ],
  "methods": [
		{
      "name": "iapUpdateAdapterConfiguration",
      "summary": "Updates the adapter configuration",
      "description": "Updates the adapter configuration file with the provided changes",
      "input": [
        {
          "name": "configFile",
          "type": "string",
          "info": "The name of the file to change",
          "required": true,
          "schema": {
            "title": "configFile",
            "type": "string"
          }
        },
        {
          "name": "changes",
          "type": "object",
          "info": "JSON object containing the configuration changes",
          "required": true,
          "schema": {
            "title": "changes",
            "type": "object"
          }
        },
        {
          "name": "entity",
          "type": "string",
          "info": "The entity in which the changes are being made",
          "required": false,
          "schema": {
            "title": "entity",
            "type": "string"
          }
        },
        {
          "name": "type",
          "type": "string",
          "info": "The type of file to change - action, schema, or mock",
          "required": false,
          "schema": {
            "title": "type",
            "type": "string"
          }
        },
        {
          "name": "action",
          "type": "string",
          "info": "The action to be changed",
          "required": false,
          "schema": {
            "title": "action",
            "type": "string"
          }
        },
        {
          "name" : "replace",
          "type": "boolean",
          "info": "True to replace entire mock data, false to merge/append",
          "required": false,
          "schema": {
            "title": "replace",
            "type" : "boolean"
          }
        }
      ],
      "output": {
        "name": "result",
        "type": "object",
        "description": "A JSON Object containing status, code and the result",
        "schema": {
          "title": "result",
          "type": "object"
        }
      },
      "roles": [
        "admin"
      ],
      "route": {
        "verb": "POST",
        "path": "/iapUpdateAdapterConfiguration"
      },
      "task": true
    },
    {
      "name": "iapSuspendAdapter",
      "summary": "Suspends the adapter",
      "description": "Suspends the adapter",
      "input": [
        {
          "name": "mode",
          "type": "enum",
          "enumerals": [
            "pause",
            "error"
          ],
          "info": "How incoming requests are handled. Defaults to 'pause'",
          "description": "How incoming requests are handled. Defaults to 'pause'",
          "schema": {
            "title": "mode",
            "type": "string"
          },
          "required": false
        }
      ],
      "output": {
        "name": "result",
        "type": "object",
        "description": "A JSON Object containing the adapter suspended status",
        "schema": {
          "title": "result",
          "type": "object"
        }
      },
      "roles": [
        "admin"
      ],
      "route": {
        "verb": "POST",
        "path": "/iapSuspendAdapter"
      },
      "task": true
    },
    {
      "name": "iapUnsuspendAdapter",
      "summary": "Unsuspends the adapter",
      "description": "Unsuspends the adapter",
      "input": [],
      "output": {
        "name": "result",
        "type": "object",
        "description": "A JSON Object containing the adapter suspended status",
        "schema": {
          "title": "result",
          "type": "object"
        }
      },
      "roles": [
        "admin"
      ],
      "route": {
        "verb": "POST",
        "path": "/iapUnsuspendAdapter"
      },
      "task": true
    },
    {
      "name": "iapGetAdapterQueue",
      "summary": "Return the requests that are waiting in the queue if throttling is enabled",
      "description": "Return the requests that are waiting in the queue if throttling is enabled",
      "input": [],
      "output": {
        "name": "result",
        "type": "object",
        "description": "A JSON Object containing the adapter queue",
        "schema": {
          "title": "result",
          "type": "object"
        }
      },
      "roles": [
        "admin"
      ],
      "route": {
        "verb": "POST",
        "path": "/iapGetAdapterQueue"
      },
      "task": true
    },
    {
      "name": "iapFindAdapterPath",
      "summary": "Provides the ability to see if a particular API path is supported by the adapter",
      "description": "Provides the ability to see if a particular API path is supported by the adapter",
      "input": [
        {
          "name": "apiPath",
          "type": "string",
          "info": "The API Path you want to check - make sure to not include base path and version",
          "description": "The API Path you want to check - make sure to not include base path and version",
          "schema": {
            "title": "apiPath",
            "type": "string"
          },
          "required": true
        }
      ],
      "output": {
        "name": "result",
        "type": "object",
        "description": "A JSON Object containing the result",
        "schema": {
          "title": "result",
          "type": "object"
        }
      },
      "roles": [
        "admin"
      ],
      "route": {
        "verb": "POST",
        "path": "/iapFindAdapterPath"
      },
      "task": true
    },
    {
      "name": "iapTroubleshootAdapter",
      "summary": "Runs troubleshoot script for adapter",
      "description": "Runs troubleshoot script for adapter",
      "input": [
        {
          "name": "props",
          "type": "object",
          "info": "Object containing configuration, healthcheck and auth properties {'connProps':{'host': 'api.service.com', 'base_path': '/', 'protocol': 'http', 'port': 443, 'version': 'v1'},'healthCheckEndpoint': '/healthcheck', 'auth': {'auth_method': 'no authentication', 'username': 'username', 'password': 'password'}}",
          "required": true,
          "schema": {
            "title": "props",
            "type": "object"
          }
        },
        {
          "name": "persistFlag",
          "type": "boolean",
          "info": "Whether the input properties should be saved",
          "required": true,
          "schema": {
            "title": "persistFlag",
            "type": "boolean"
          }
        }
      ],
      "output": {
        "name": "result",
        "type": "object",
        "description": "A JSON Object containing the test results",
        "schema": {
          "title": "result",
          "type": "object"
        }
      },
      "roles": [
        "admin"
      ],
      "route": {
        "verb": "POST",
        "path": "/iapTroubleshootAdapter"
      },
      "task": true
    },
    {
      "name": "iapRunAdapterHealthcheck",
      "summary": "Runs healthcheck script for adapter",
      "description": "Runs healthcheck script for adapter",
      "input": [],
      "output": {
        "name": "result",
        "type": "boolean",
        "description": "Whether healthcheck passed or failed",
        "schema": {
          "title": "result",
          "type": "boolean"
        }
      },
      "roles": [
        "admin"
      ],
      "route": {
        "verb": "POST",
        "path": "/iapRunAdapterHealthcheck"
      },
      "task": true
    },
    {
      "name": "iapRunAdapterConnectivity",
      "summary": "Runs connectivity check script for adapter",
      "description": "Runs connectivity check script for adapter",
      "input": [],
      "output": {
        "name": "result",
        "type": "object",
        "description": "A JSON Object containing the test results",
        "schema": {
          "title": "result",
          "type": "object"
        }
      },
      "roles": [
        "admin"
      ],
      "route": {
        "verb": "POST",
        "path": "/iapRunAdapterConnectivity"
      },
      "task": true
    },
    {
      "name": "iapRunAdapterBasicGet",
      "summary": "Runs basicGet script for adapter",
      "description": "Runs basicGet script for adapter",
      "input": [],
      "output": {
        "name": "result",
        "type": "object",
        "description": "A JSON Object containing the test results",
        "schema": {
          "title": "result",
          "type": "object"
        }
      },
      "roles": [
        "admin"
      ],
      "route": {
        "verb": "POST",
        "path": "/iapRunAdapterBasicGet"
      },
      "task": true
    },
    {
      "name": "iapMoveAdapterEntitiesToDB",
      "summary": "Moves entities from an adapter into the IAP database",
      "description": "Moves entities from an adapter into the IAP database",
      "input": [],
      "output": {
        "name": "res",
        "type": "object",
        "description": "A JSON Object containing status, code and the response from the mongo transaction",
        "schema": {
          "title": "res",
          "type": "object"
        }
      },
      "roles": [
        "admin"
      ],
      "route": {
        "verb": "POST",
        "path": "/iapMoveAdapterEntitiesToDB"
      },
      "task": true
    },
    {
      "name": "iapDeactivateTasks",
      "summary": "Deactivate the inputted tasks",
      "description": "Deactivate the inputted tasks",
      "input": [
        {
          "name": "tasks",
          "type": "array",
          "description": "Tasks to deactivate",
          "schema": {
            "title": "tasks",
            "type": "array"
          }
        }
      ],
      "output": {
        "name": "result",
        "type": "object",
        "description": "A JSON Object containing success status",
        "schema": {
          "title": "result",
          "type": "object"
        }
      },
      "roles": [
        "admin"
      ],
      "route": {
        "verb": "POST",
        "path": "/iapDeactivateTasks"
      },
      "task": true
    },
    {
      "name": "iapActivateTasks",
      "summary": "Activate the inputted tasks",
      "description": "activate the inputted tasks",
      "input": [
        {
          "name": "tasks",
          "type": "array",
          "description": "Tasks to activate",
          "schema": {
            "title": "tasks",
            "type": "array"
          }
        }
      ],
      "output": {
        "name": "result",
        "type": "object",
        "description": "A JSON Object containing success status",
        "schema": {
          "title": "result",
          "type": "object"
        }
      },
      "roles": [
        "admin"
      ],
      "route": {
        "verb": "POST",
        "path": "/iapActivateTasks"
      },
      "task": true
    },
    {
      "name": "iapPopulateEntityCache",
      "summary": "Populate the cache for the given entities",
      "description": "Populate the cache for the given entities",
      "input": [
        {
          "name": "entityTypes",
          "type": "array",
          "info": "the entity type(s) to populate",
          "required": true,
          "schema": {
            "title": "entityTypes",
            "type": "array"
          }
        }
      ],
      "output": {
        "name": "result",
        "type": "object",
        "description": "A JSON Object containing status, code and the result",
        "schema": {
          "title": "result",
          "type": "object"
        }
      },
      "roles": [
        "admin"
      ],
      "route": {
        "verb": "POST",
        "path": "/iapPopulateEntityCache"
      },
      "task": true
    },
    {
      "name": "iapRetrieveEntitiesCache",
      "summary": "Retrieves data from cache for specified entity type",
      "description": "Retrieves data from cache for specified entity type",
      "input": [
        {
          "name": "entityType",
          "type": "string",
          "info": "entity of which to retrieve",
          "required": true,
          "schema": {
            "title": "entityType",
            "type": "string"
          }
        },
        {
          "name": "options",
          "type": "object",
          "info": "settings of which data to return and how to return it",
          "required": false,
          "schema": {
            "title": "options",
            "type": "object"
          }
        }
      ],
      "output": {
        "name": "result",
        "type": "object",
        "description": "A JSON Object containing status, code and the result",
        "schema": {
          "title": "result",
          "type": "object"
        }
      },
      "roles": [
        "admin"
      ],
      "route": {
        "verb": "POST",
        "path": "/iapRetrieveEntitiesCache"
      },
      "task": true
    },
    {
      "name": "getDevice",
      "summary": "Get the Appliance",
      "description": "Get the Appliance",
      "input": [
        {
          "name": "deviceName",
          "type": "string",
          "info": "An Appliance Device Name",
          "required": true,
          "schema": {
            "title": "deviceName",
            "type": "string"
          }
        }
      ],
      "output": {
        "name": "result",
        "type": "object",
        "description": "A JSON Object containing status, code and the result",
        "schema": {
          "title": "result",
          "type": "object"
        }
      },
      "roles": [
        "admin"
      ],
      "route": {
        "verb": "POST",
        "path": "/getDevice"
      },
      "task": false
    },
    {
      "name": "getDevicesFiltered",
      "summary": "Get Appliances that match the filter",
      "description": "Get Appliances that match the filter",
      "input": [
        {
          "name": "options",
          "type": "object",
          "info": "options - e.g. { 'start': 1, 'limit': 20, 'filter': { 'name': 'abc123' } }",
          "required": true,
          "schema": {
            "title": "options",
            "type": "object"
          }
        }
      ],
      "output": {
        "name": "result",
        "type": "array",
        "description": "A JSON Object containing status, code and the result",
        "schema": {
          "title": "result",
          "type": "array"
        }
      },
      "roles": [
        "admin"
      ],
      "route": {
        "verb": "POST",
        "path": "/getDevicesFiltered"
      },
      "task": false
    },
    {
      "name": "isAlive",
      "summary": "Checks the status for the provided Appliance",
      "description": "Checks the status for the provided Appliance",
      "input": [
        {
          "name": "deviceName",
          "type": "string",
          "info": "An Appliance Device Name",
          "required": true,
          "schema": {
            "title": "deviceName",
            "type": "string"
          }
        }
      ],
      "output": {
        "name": "result",
        "type": "boolean",
        "description": "A JSON Object containing status, code and the result",
        "schema": {
          "title": "result",
          "type": "boolean"
        }
      },
      "roles": [
        "admin"
      ],
      "route": {
        "verb": "POST",
        "path": "/isAlive"
      },
      "task": false
    },
    {
      "name": "getConfig",
      "summary": "Gets a config for the provided Appliance",
      "description": "Gets a config for the provided Appliance",
      "input": [
        {
          "name": "deviceName",
          "type": "string",
          "info": "An Appliance Device Name",
          "required": true,
          "schema": {
            "title": "deviceName",
            "type": "string"
          }
        },
        {
          "name": "format",
          "type": "string",
          "info": "The format to be returned - this is ignored as we always return json",
          "required": false,
          "schema": {
            "title": "format",
            "type": "string"
          }
        }
      ],
      "output": {
        "name": "result",
        "type": "object",
        "description": "A JSON Object containing status, code and the result",
        "schema": {
          "title": "result",
          "type": "object"
        }
      },
      "roles": [
        "admin"
      ],
      "route": {
        "verb": "POST",
        "path": "/getConfig"
      },
      "task": false
    },
    {
      "name": "iapGetDeviceCount",
      "summary": "Gets a device count from the system",
      "description": "Gets a device count from the system",
      "input": [],
      "output": {
        "name": "result",
        "type": "object",
        "description": "A JSON Object containing status, code and the result",
        "schema": {
          "title": "result",
          "type": "object"
        }
      },
      "roles": [
        "admin"
      ],
      "route": {
        "verb": "POST",
        "path": "/iapGetDeviceCount"
      },
      "task": false
    },
    {
      "name": "iapExpandedGenericAdapterRequest",
      "summary": "Makes the requested generic call with additional options",
      "description": "Makes the requested generic call with additional options via metadata",
      "input": [
        {
          "name": "metadata",
          "type": "object",
          "info": "metadata for the call (optional)",
          "description": "metadata for the call - allows for many enhancements (optional)",
          "schema": {
            "title": "metadata",
            "type": "object"
          },
          "required": false
        },
        {
          "name": "uriPath",
          "type": "string",
          "info": "the path of the api call - do not include the host, port, base path or version",
          "description": "the path of the api call",
          "schema": {
            "title": "uriPath",
            "type": "string"
          },
          "required": false
        },
        {
          "name": "restMethod",
          "type": "string",
          "info": "the rest method (GET, POST, PUT, PATCH, DELETE)",
          "description": "the rest method (GET, POST, PUT, PATCH, DELETE)",
          "schema": {
            "title": "restMethod",
            "type": "string"
          },
          "required": false
        },
        {
          "name": "pathVars",
          "type": "object",
          "info": "the parameters to be put within the url path (optional)",
          "description": "the parameters to be put within the url path (optional)",
          "schema": {
            "title": "pathVars",
            "type": "object"
          },
          "required": false
        },
        {
          "name": "queryData",
          "type": "object",
          "info": "the query parameters to be put on the url (optional)",
          "description": "the query parameters to be put on the url (optional)",
          "schema": {
            "title": "queryData",
            "type": "object"
          },
          "required": false
        },
        {
          "name": "requestBody",
          "type": "object",
          "info": "the payload to be sent with the request (optional)",
          "description": "the payload to be sent with the request (optional)",
          "schema": {
            "title": "requestBody",
            "type": "object"
          },
          "required": false
        },
        {
          "name": "addlHeaders",
          "type": "object",
          "info": "additional headers to be put on the call (optional)",
          "description": "additional headers to be put on the call (optional)",
          "schema": {
            "title": "addlHeaders",
            "type": "object"
          },
          "required": false
        }
      ],
      "output": {
        "name": "result",
        "type": "object",
        "description": "A JSON Object containing status, code and the result",
        "schema": {
          "title": "result",
          "type": "object"
        }
      },
      "roles": [
        "admin"
      ],
      "route": {
        "verb": "POST",
        "path": "/iapExpandedGenericAdapterRequest"
      },
      "task": true
    },
    {
      "name": "genericAdapterRequest",
      "summary": "Makes the requested generic call",
      "description": "Makes the requested generic call",
      "input": [
        {
          "name": "uriPath",
          "type": "string",
          "info": "the path of the api call - do not include the host, port, base path or version",
          "description": "the path of the api call",
          "schema": {
            "title": "uriPath",
            "type": "string"
          },
          "required": true
        },
        {
          "name": "restMethod",
          "type": "string",
          "info": "the rest method (GET, POST, PUT, PATCH, DELETE)",
          "description": "the rest method (GET, POST, PUT, PATCH, DELETE)",
          "schema": {
            "title": "restMethod",
            "type": "string"
          },
          "required": true
        },
        {
          "name": "queryData",
          "type": "object",
          "info": "the query parameters to be put on the url (optional)",
          "description": "the query parameters to be put on the url (optional)",
          "schema": {
            "title": "queryData",
            "type": "object"
          },
          "required": false
        },
        {
          "name": "requestBody",
          "type": "object",
          "info": "the payload to be sent with the request (optional)",
          "description": "the payload to be sent with the request (optional)",
          "schema": {
            "title": "requestBody",
            "type": "object"
          },
          "required": false
        },
        {
          "name": "addlHeaders",
          "type": "object",
          "info": "additional headers to be put on the call (optional)",
          "description": "additional headers to be put on the call (optional)",
          "schema": {
            "title": "addlHeaders",
            "type": "object"
          },
          "required": false
        }
      ],
      "output": {
        "name": "result",
        "type": "object",
        "description": "A JSON Object containing status, code and the result",
        "schema": {
          "title": "result",
          "type": "object"
        }
      },
      "roles": [
        "admin"
      ],
      "route": {
        "verb": "POST",
        "path": "/genericAdapterRequest"
      },
      "task": true
    },
    {
      "name": "genericAdapterRequestNoBasePath",
      "summary": "Makes the requested generic call",
      "description": "Makes the requested generic call",
      "input": [
        {
          "name": "uriPath",
          "type": "string",
          "info": "the path of the api call - do not include the host, port, base path or version",
          "description": "the path of the api call",
          "schema": {
            "title": "uriPath",
            "type": "string"
          },
          "required": true
        },
        {
          "name": "restMethod",
          "type": "string",
          "info": "the rest method (GET, POST, PUT, PATCH, DELETE)",
          "description": "the rest method (GET, POST, PUT, PATCH, DELETE)",
          "schema": {
            "title": "restMethod",
            "type": "string"
          },
          "required": true
        },
        {
          "name": "queryData",
          "type": "object",
          "info": "the query parameters to be put on the url (optional)",
          "description": "the query parameters to be put on the url (optional)",
          "schema": {
            "title": "queryData",
            "type": "object"
          },
          "required": false
        },
        {
          "name": "requestBody",
          "type": "object",
          "info": "the payload to be sent with the request (optional)",
          "description": "the payload to be sent with the request (optional)",
          "schema": {
            "title": "requestBody",
            "type": "object"
          },
          "required": false
        },
        {
          "name": "addlHeaders",
          "type": "object",
          "info": "additional headers to be put on the call (optional)",
          "description": "additional headers to be put on the call (optional)",
          "schema": {
            "title": "addlHeaders",
            "type": "object"
          },
          "required": false
        }
      ],
      "output": {
        "name": "result",
        "type": "object",
        "description": "A JSON Object containing status, code and the result",
        "schema": {
          "title": "result",
          "type": "object"
        }
      },
      "roles": [
        "admin"
      ],
      "route": {
        "verb": "POST",
        "path": "/genericAdapterRequestNoBasePath"
      },
      "task": true
    },
    {
      "name": "iapRunAdapterLint",
      "summary": "Run the adapter lint script to return the results",
      "description": "Run the adapter lint script to return the results",
      "input": [],
      "output": {
        "name": "result",
        "type": "string",
        "description": "A string containing the run results",
        "schema": {
          "title": "result",
          "type": "string"
        }
      },
      "roles": [
        "admin"
      ],
      "route": {
        "verb": "GET",
        "path": "/iapRunAdapterLint"
      },
      "task": true
    },
    {
      "name": "iapRunAdapterTests",
      "summary": "Run the adapter test scripts (baseunit and unit) to return the results",
      "description": "Run the adapter test scripts (baseunit and unit) to return the results",
      "input": [],
      "output": {
        "name": "result",
        "type": "object",
        "description": "A JSON Object containing status, code and the result",
        "schema": {
          "title": "result",
          "type": "object"
        }
      },
      "roles": [
        "admin"
      ],
      "route": {
        "verb": "GET",
        "path": "/iapRunAdapterTests"
      },
      "task": true
    },
    {
      "name": "iapGetAdapterInventory",
      "summary": "Provide inventory information abbout the adapter",
      "description": "Provide inventory information abbout the adapter",
      "input": [],
      "output": {
        "name": "result",
        "type": "object",
        "description": "A JSON Object containing status, code and the result",
        "schema": {
          "title": "result",
          "type": "object"
        }
      },
      "roles": [
        "admin"
      ],
      "route": {
        "verb": "GET",
        "path": "/iapGetAdapterInventory"
      },
      "task": true
    },    
    {
      "name": "getAccountsAccountUserId",
      "summary": "Retrieve a user",
      "description": "Retrieves the details of an existing user.",
      "input": [
        {
          "name": "id",
          "type": "string",
          "info": "The identifier (UUID) of the user to be updated.: string",
          "required": true,
          "schema": {
            "title": "id",
            "type": "string"
          }
        },
        {
          "name": "account",
          "type": "string",
          "info": "The identifier (UUID) or slug of your Keygen account.: string",
          "required": true,
          "schema": {
            "title": "account",
            "type": "string"
          }
        }
      ],
      "output": {
        "name": "result",
        "type": "object",
        "description": "A JSON Object containing status, code and the result",
        "schema": {
          "title": "result",
          "type": "object"
        }
      },
      "roles": [
        "admin"
      ],
      "route": {
        "verb": "POST",
        "path": "/getAccountsAccountUserId"
      },
      "task": true
    },
    {
      "name": "postAccountsAccountUser",
      "summary": "Adds a user",
      "description": "Creates a new user resource.",
      "input": [
        {
          "name": "account",
          "type": "string",
          "info": "The identifier (UUID) or slug of your Keygen account.: string",
          "required": true,
          "schema": {
            "title": "account",
            "type": "string"
          }
        },
        {
          "name": "bodyQuery",
          "type": "object",
          "info": ": object",
          "required": true,
          "schema": {
            "title": "bodyQuery",
            "type": "object"
          }
        }
      ],
      "output": {
        "name": "result",
        "type": "object",
        "description": "A JSON Object containing status, code and the result",
        "schema": {
          "title": "result",
          "type": "object"
        }
      },
      "roles": [
        "admin"
      ],
      "route": {
        "verb": "POST",
        "path": "/postAccountsAccountUser"
      },
      "task": true
    },
    {
      "name": "getAccountsAccountUser",
      "summary": "List all users",
      "description": "Returns a list of users. The users are returned sorted by creation date, with the most recent users appearing first. Resources are automatically scoped to the authenticated bearer e.g. when authenticated as a product, only users of that specific product will be listed.",
      "input": [
        {
          "name": "account",
          "type": "string",
          "info": "The identifier (UUID) or slug of your Keygen account.: string",
          "required": true,
          "schema": {
            "title": "account",
            "type": "string"
          }
        },
        {
          "name": "limit",
          "type": "number",
          "info": "A limit on the number of users to be returned. Limit must be a number between 1 and 100.: 123",
          "required": false,
          "schema": {
            "title": "limit",
            "type": "number"
          }
        },
        {
          "name": "active",
          "type": "boolean",
          "info": "The status of the user to filter by. A user is considered active if they have a license associated with their user.: boolean",
          "required": false,
          "schema": {
            "title": "active",
            "type": "boolean"
          }
        },
        {
          "name": "product",
          "type": "boolean",
          "info": "The identifier (UUID) of the product to filter by.: boolean",
          "required": false,
          "schema": {
            "title": "product",
            "type": "boolean"
          }
        },
        {
          "name": "roles",
          "type": "array",
          "info": "Array containing role names to filter by.: array",
          "required": false,
          "schema": {
            "title": "roles",
            "type": "array"
          }
        }
      ],
      "output": {
        "name": "result",
        "type": "object",
        "description": "A JSON Object containing status, code and the result",
        "schema": {
          "title": "result",
          "type": "object"
        }
      },
      "roles": [
        "admin"
      ],
      "route": {
        "verb": "POST",
        "path": "/getAccountsAccountUser"
      },
      "task": true
    },
    {
      "name": "getAccountsAccountUserWithOptions",
      "summary": "List all users",
      "description": "Returns a list of users. The users are returned sorted by creation date, with the most recent users appearing first. Resources are automatically scoped to the authenticated bearer e.g. when authenticated as a product, only users of that specific product will be listed.",
      "input": [
        {
          "name": "account",
          "type": "string",
          "info": "The identifier (UUID) or slug of your Keygen account.: string",
          "required": true,
          "schema": {
            "title": "account",
            "type": "string"
          }
        },
        {
          "name": "queryData",
          "type": "object",
          "info": "Contains properties: limit, active, product, roles, page",
          "required": false,
          "schema": {
            "title": "queryData",
            "type": "object"
          }
        }
      ],
      "output": {
        "name": "result",
        "type": "object",
        "description": "A JSON Object containing status, code and the result",
        "schema": {
          "title": "result",
          "type": "object"
        }
      },
      "roles": [
        "admin"
      ],
      "route": {
        "verb": "POST",
        "path": "/getAccountsAccountUserWithOptions"
      },
      "task": true
    },
    {
      "name": "postAccountsAccountUsersId",
      "summary": "Update a user",
      "description": "Updates the specified user resource by setting the values of the parameters passed. Any parameters not provided will be left unchanged.",
      "input": [
        {
          "name": "account",
          "type": "string",
          "info": "The identifier (UUID) or slug of your Keygen account.: string",
          "required": true,
          "schema": {
            "title": "account",
            "type": "string"
          }
        },
        {
          "name": "id",
          "type": "string",
          "info": "The identifier (UUID) of the user to be updated.: string",
          "required": true,
          "schema": {
            "title": "id",
            "type": "string"
          }
        },
        {
          "name": "bodyQuery",
          "type": "object",
          "info": ": object",
          "required": true,
          "schema": {
            "title": "bodyQuery",
            "type": "object"
          }
        }
      ],
      "output": {
        "name": "result",
        "type": "object",
        "description": "A JSON Object containing status, code and the result",
        "schema": {
          "title": "result",
          "type": "object"
        }
      },
      "roles": [
        "admin"
      ],
      "route": {
        "verb": "POST",
        "path": "/postAccountsAccountUsersId"
      },
      "task": true
    },
    {
      "name": "deleteAccountsAccountUsersId",
      "summary": "Deletes a user",
      "description": "Permanently deletes a user. It cannot be undone. This action also immediately deletes any licenses and machines that the user is associated with.",
      "input": [
        {
          "name": "account",
          "type": "string",
          "info": "The identifier (UUID) or slug of your Keygen account.: string",
          "required": true,
          "schema": {
            "title": "account",
            "type": "string"
          }
        },
        {
          "name": "id",
          "type": "string",
          "info": "The identifier (UUID) of the user to be updated.: string",
          "required": true,
          "schema": {
            "title": "id",
            "type": "string"
          }
        }
      ],
      "output": {
        "name": "result",
        "type": "object",
        "description": "A JSON Object containing status, code and the result",
        "schema": {
          "title": "result",
          "type": "object"
        }
      },
      "roles": [
        "admin"
      ],
      "route": {
        "verb": "POST",
        "path": "/deleteAccountsAccountUsersId"
      },
      "task": true
    },
    {
      "name": "postAccountsAccountUsersIdActionsUpdatePassword",
      "summary": "Update a user's password",
      "description": "Action to update the user's password. A user's password can only be updated when authenticated as the given user.",
      "input": [
        {
          "name": "account",
          "type": "string",
          "info": "The identifier (UUID) or slug of your Keygen account.: string",
          "required": true,
          "schema": {
            "title": "account",
            "type": "string"
          }
        },
        {
          "name": "id",
          "type": "string",
          "info": "The identifier (UUID) of the user to be updated.: string",
          "required": true,
          "schema": {
            "title": "id",
            "type": "string"
          }
        },
        {
          "name": "bodyQuery",
          "type": "object",
          "info": ": object",
          "required": true,
          "schema": {
            "title": "bodyQuery",
            "type": "object"
          }
        }
      ],
      "output": {
        "name": "result",
        "type": "object",
        "description": "A JSON Object containing status, code and the result",
        "schema": {
          "title": "result",
          "type": "object"
        }
      },
      "roles": [
        "admin"
      ],
      "route": {
        "verb": "POST",
        "path": "/postAccountsAccountUsersIdActionsUpdatePassword"
      },
      "task": true
    },
    {
      "name": "postAccountsAccountUsersIdActionsResetPassword",
      "summary": "Reset a user's password",
      "description": "Fulfill a user's password reset request. Password reset tokens expire 24 hours after requesting the reset.",
      "input": [
        {
          "name": "account",
          "type": "string",
          "info": "The identifier (UUID) or slug of your Keygen account.: string",
          "required": true,
          "schema": {
            "title": "account",
            "type": "string"
          }
        },
        {
          "name": "id",
          "type": "string",
          "info": "The identifier (UUID) of the user to be updated.: string",
          "required": true,
          "schema": {
            "title": "id",
            "type": "string"
          }
        },
        {
          "name": "bodyQuery",
          "type": "object",
          "info": ": object",
          "required": true,
          "schema": {
            "title": "bodyQuery",
            "type": "object"
          }
        }
      ],
      "output": {
        "name": "result",
        "type": "object",
        "description": "A JSON Object containing status, code and the result",
        "schema": {
          "title": "result",
          "type": "object"
        }
      },
      "roles": [
        "admin"
      ],
      "route": {
        "verb": "POST",
        "path": "/postAccountsAccountUsersIdActionsResetPassword"
      },
      "task": true
    },
    {
      "name": "postAccountsAccountLicenses",
      "summary": "Creates a new license",
      "description": "Creates a new license resource.",
      "input": [
        {
          "name": "account",
          "type": "string",
          "info": "The identifier (UUID) or slug of your Keygen account.: string",
          "required": true,
          "schema": {
            "title": "account",
            "type": "string"
          }
        },
        {
          "name": "bodyQuery",
          "type": "object",
          "info": ": object",
          "required": true,
          "schema": {
            "title": "bodyQuery",
            "type": "object"
          }
        }
      ],
      "output": {
        "name": "result",
        "type": "object",
        "description": "A JSON Object containing status, code and the result",
        "schema": {
          "title": "result",
          "type": "object"
        }
      },
      "roles": [
        "admin"
      ],
      "route": {
        "verb": "POST",
        "path": "/postAccountsAccountLicenses"
      },
      "task": true
    },
    {
      "name": "getAccountsAccountLicenses",
      "summary": "List all license",
      "description": "Returns a list of licenses. The licenses are returned sorted by creation date, with the most recent licenses appearing first. Resources are automatically scoped to the authenticated bearer e.g. when authenticated as a user, only licenses of that specific user will be listed.",
      "input": [
        {
          "name": "account",
          "type": "string",
          "info": "The identifier (UUID) or slug of your Keygen account.: string",
          "required": true,
          "schema": {
            "title": "account",
            "type": "string"
          }
        },
        {
          "name": "limit",
          "type": "number",
          "info": "A limit on the number of licenses to be returned. Limit must be a number between 1 and 100.: 123",
          "required": false,
          "schema": {
            "title": "limit",
            "type": "number"
          }
        },
        {
          "name": "suspended",
          "type": "boolean",
          "info": "The suspended status of the license to filter by.: boolean",
          "required": false,
          "schema": {
            "title": "suspended",
            "type": "boolean"
          }
        },
        {
          "name": "expired",
          "type": "boolean",
          "info": "The expiration status of the license to filter by. Please note that this is for filtering by the license's expiry only. We do not support filtering by license validity.: boolean",
          "required": false,
          "schema": {
            "title": "expired",
            "type": "boolean"
          }
        },
        {
          "name": "unassigned",
          "type": "boolean",
          "info": "The user-relationship status of the license to filter by. A license without a user is considered unassigned.: boolean",
          "required": false,
          "schema": {
            "title": "unassigned",
            "type": "boolean"
          }
        },
        {
          "name": "product",
          "type": "string",
          "info": "The identifier (UUID) of the product to filter by.: string",
          "required": false,
          "schema": {
            "title": "product",
            "type": "string"
          }
        },
        {
          "name": "policy",
          "type": "string",
          "info": "The identifier (UUID) of the policy to filter by.: string",
          "required": false,
          "schema": {
            "title": "policy",
            "type": "string"
          }
        },
        {
          "name": "user",
          "type": "string",
          "info": "The identifier (UUID) of the user to filter by.: string",
          "required": false,
          "schema": {
            "title": "user",
            "type": "string"
          }
        },
        {
          "name": "machine",
          "type": "string",
          "info": "The identifier (UUID) of the machine to filter by.: string",
          "required": false,
          "schema": {
            "title": "machine",
            "type": "string"
          }
        }
      ],
      "output": {
        "name": "result",
        "type": "object",
        "description": "A JSON Object containing status, code and the result",
        "schema": {
          "title": "result",
          "type": "object"
        }
      },
      "roles": [
        "admin"
      ],
      "route": {
        "verb": "POST",
        "path": "/getAccountsAccountLicenses"
      },
      "task": true
    },
    {
      "name": "getAccountsAccountLicensesId",
      "summary": "Retrieve a license",
      "description": "Retrieves the details of an existing license.",
      "input": [
        {
          "name": "id",
          "type": "string",
          "info": "The identifier (UUID) or key of the license to be retrieved. Cannot be a legacy encrypted license key.: string",
          "required": true,
          "schema": {
            "title": "id",
            "type": "string"
          }
        },
        {
          "name": "account",
          "type": "string",
          "info": "The identifier (UUID) or slug of your Keygen account.: string",
          "required": true,
          "schema": {
            "title": "account",
            "type": "string"
          }
        }
      ],
      "output": {
        "name": "result",
        "type": "object",
        "description": "A JSON Object containing status, code and the result",
        "schema": {
          "title": "result",
          "type": "object"
        }
      },
      "roles": [
        "admin"
      ],
      "route": {
        "verb": "POST",
        "path": "/getAccountsAccountLicensesId"
      },
      "task": true
    },
    {
      "name": "patchAccountsAccountLicensesId",
      "summary": "Update a license",
      "description": "Updates the specified license resource by setting the values of the parameters passed. Any parameters not provided will be left unchanged.",
      "input": [
        {
          "name": "id",
          "type": "string",
          "info": "The identifier (UUID) or key of the license to be retrieved. Cannot be a legacy encrypted license key.: string",
          "required": true,
          "schema": {
            "title": "id",
            "type": "string"
          }
        },
        {
          "name": "account",
          "type": "string",
          "info": "The identifier (UUID) or slug of your Keygen account.: string",
          "required": true,
          "schema": {
            "title": "account",
            "type": "string"
          }
        },
        {
          "name": "bodyQuery",
          "type": "object",
          "info": ": object",
          "required": true,
          "schema": {
            "title": "bodyQuery",
            "type": "object"
          }
        }
      ],
      "output": {
        "name": "result",
        "type": "object",
        "description": "A JSON Object containing status, code and the result",
        "schema": {
          "title": "result",
          "type": "object"
        }
      },
      "roles": [
        "admin"
      ],
      "route": {
        "verb": "POST",
        "path": "/patchAccountsAccountLicensesId"
      },
      "task": true
    },
    {
      "name": "deleteAccountsAccountLicensesId",
      "summary": "Delete a license",
      "description": "Permanently deletes a license. It cannot be undone. This action also immediately deletes any machines that the license is associated with.",
      "input": [
        {
          "name": "id",
          "type": "string",
          "info": "The identifier (UUID) or key of the license to be retrieved. Cannot be a legacy encrypted license key.: string",
          "required": true,
          "schema": {
            "title": "id",
            "type": "string"
          }
        },
        {
          "name": "account",
          "type": "string",
          "info": "The identifier (UUID) or slug of your Keygen account.: string",
          "required": true,
          "schema": {
            "title": "account",
            "type": "string"
          }
        }
      ],
      "output": {
        "name": "result",
        "type": "object",
        "description": "A JSON Object containing status, code and the result",
        "schema": {
          "title": "result",
          "type": "object"
        }
      },
      "roles": [
        "admin"
      ],
      "route": {
        "verb": "POST",
        "path": "/deleteAccountsAccountLicensesId"
      },
      "task": true
    },
    {
      "name": "getAccountsAccountLicensesIdActionsValidate",
      "summary": "Quick validate license",
      "description": "Action to quickly validate a license. This will check the following. if the license is suspended, if the license is expired, if the license is overdue for check-in, and if the license meets its machine requirements (if strict).",
      "input": [
        {
          "name": "id",
          "type": "string",
          "info": "The identifier (UUID) or key of the license to be validated. Cannot be a legacy encrypted license key.: string",
          "required": true,
          "schema": {
            "title": "id",
            "type": "string"
          }
        },
        {
          "name": "account",
          "type": "string",
          "info": "The identifier (UUID) or slug of your Keygen account.: string",
          "required": true,
          "schema": {
            "title": "account",
            "type": "string"
          }
        }
      ],
      "output": {
        "name": "result",
        "type": "object",
        "description": "A JSON Object containing status, code and the result",
        "schema": {
          "title": "result",
          "type": "object"
        }
      },
      "roles": [
        "admin"
      ],
      "route": {
        "verb": "POST",
        "path": "/getAccountsAccountLicensesIdActionsValidate"
      },
      "task": true
    },
    {
      "name": "postAccountsAccountLicensesIdActionsValidate",
      "summary": "Validate license",
      "description": "Action to validate a license. This will check the following. if the license is suspended, if the license is expired, if the license is overdue for check-in, and if the license meets its machine requirements (if strict).\n\nAdditional scopes can also be applied, and may be required by the license's policy, e.g. a policy may set requireFingerprintScope=true, which will require that you specify a scope.fingerprint with the validation request in order to pass validation.\n\nThe scoping feature allows yo...(description truncated)",
      "input": [
        {
          "name": "id",
          "type": "string",
          "info": "The identifier (UUID) or key of the license to be validated. Cannot be a legacy encrypted license key.: string",
          "required": true,
          "schema": {
            "title": "id",
            "type": "string"
          }
        },
        {
          "name": "account",
          "type": "string",
          "info": "The identifier (UUID) or slug of your Keygen account.: string",
          "required": true,
          "schema": {
            "title": "account",
            "type": "string"
          }
        },
        {
          "name": "meta",
          "type": "object",
          "info": ": object",
          "required": true,
          "schema": {
            "title": "meta",
            "type": "object"
          }
        }
      ],
      "output": {
        "name": "result",
        "type": "object",
        "description": "A JSON Object containing status, code and the result",
        "schema": {
          "title": "result",
          "type": "object"
        }
      },
      "roles": [
        "admin"
      ],
      "route": {
        "verb": "POST",
        "path": "/postAccountsAccountLicensesIdActionsValidate"
      },
      "task": true
    },
    {
      "name": "postAccountsAccountLicensesActionsValidateKey",
      "summary": "Validate Key",
      "description": "Action to validate a license key. This will look up the license by its key and check the following: if the license is suspended, if the license is expired, if the license is overdue for check-in, and if the license meets its machine requirements (if strict).\n Additional scopes can also be applied, and may be required by the license's policy, e.g. a policy may set requireFingerprintScope=true, which will require that you specify a scope.fingerprint with the validation request in order to pass val...(description truncated)",
      "input": [
        {
          "name": "account",
          "type": "string",
          "info": "The identifier (UUID) or slug of your Keygen account.: string",
          "required": true,
          "schema": {
            "title": "account",
            "type": "string"
          }
        },
        {
          "name": "meta",
          "type": "object",
          "info": ": object",
          "required": true,
          "schema": {
            "title": "meta",
            "type": "object"
          }
        }
      ],
      "output": {
        "name": "result",
        "type": "object",
        "description": "A JSON Object containing status, code and the result",
        "schema": {
          "title": "result",
          "type": "object"
        }
      },
      "roles": [
        "admin"
      ],
      "route": {
        "verb": "POST",
        "path": "/postAccountsAccountLicensesActionsValidateKey"
      },
      "task": true
    },
    {
      "name": "postAccountsAccountLicensesIdActionsSuspend",
      "summary": "Suspend license",
      "description": "Action to temporarily suspend (ban) a license. This will cause the license to fail validation until reinistated. To permanently revoke a license, see the revoke action.",
      "input": [
        {
          "name": "id",
          "type": "string",
          "info": "The identifier (UUID) or key of the license to be suspend. Cannot be a legacy encrypted license key.: string",
          "required": true,
          "schema": {
            "title": "id",
            "type": "string"
          }
        },
        {
          "name": "account",
          "type": "string",
          "info": "The identifier (UUID) or slug of your Keygen account.: string",
          "required": true,
          "schema": {
            "title": "account",
            "type": "string"
          }
        }
      ],
      "output": {
        "name": "result",
        "type": "object",
        "description": "A JSON Object containing status, code and the result",
        "schema": {
          "title": "result",
          "type": "object"
        }
      },
      "roles": [
        "admin"
      ],
      "route": {
        "verb": "POST",
        "path": "/postAccountsAccountLicensesIdActionsSuspend"
      },
      "task": true
    },
    {
      "name": "postAccountsAccountLicensesIdActionsReinstate",
      "summary": "Reinstate license",
      "description": "Action to reinstate a suspended license.",
      "input": [
        {
          "name": "id",
          "type": "string",
          "info": "The identifier (UUID) or key of the license to be reinstated. Cannot be a legacy encrypted license key.: string",
          "required": true,
          "schema": {
            "title": "id",
            "type": "string"
          }
        },
        {
          "name": "account",
          "type": "string",
          "info": "The identifier (UUID) or slug of your Keygen account.: string",
          "required": true,
          "schema": {
            "title": "account",
            "type": "string"
          }
        }
      ],
      "output": {
        "name": "result",
        "type": "object",
        "description": "A JSON Object containing status, code and the result",
        "schema": {
          "title": "result",
          "type": "object"
        }
      },
      "roles": [
        "admin"
      ],
      "route": {
        "verb": "POST",
        "path": "/postAccountsAccountLicensesIdActionsReinstate"
      },
      "task": true
    },
    {
      "name": "postAccountsAccountLicensesIdActionsRenew",
      "summary": "Renew license",
      "description": "Action to renew a license. Extends license expiry by the policy's duration.",
      "input": [
        {
          "name": "id",
          "type": "string",
          "info": "The identifier (UUID) or key of the license to be renewed. Cannot be a legacy encrypted license key.: string",
          "required": true,
          "schema": {
            "title": "id",
            "type": "string"
          }
        },
        {
          "name": "account",
          "type": "string",
          "info": "The identifier (UUID) or slug of your Keygen account.: string",
          "required": true,
          "schema": {
            "title": "account",
            "type": "string"
          }
        }
      ],
      "output": {
        "name": "result",
        "type": "object",
        "description": "A JSON Object containing status, code and the result",
        "schema": {
          "title": "result",
          "type": "object"
        }
      },
      "roles": [
        "admin"
      ],
      "route": {
        "verb": "POST",
        "path": "/postAccountsAccountLicensesIdActionsRenew"
      },
      "task": true
    },
    {
      "name": "postAccountsAccountLicensesIdActionsRevoke",
      "summary": "Revoke license",
      "description": "Action to revoke (delete) a license. This cannot be undone. This action also immediately deletes any machines that the license is associated with.",
      "input": [
        {
          "name": "id",
          "type": "string",
          "info": "The identifier (UUID) or key of the license to be revoked. Cannot be a legacy encrypted license key.: string",
          "required": true,
          "schema": {
            "title": "id",
            "type": "string"
          }
        },
        {
          "name": "account",
          "type": "string",
          "info": "The identifier (UUID) or slug of your Keygen account.: string",
          "required": true,
          "schema": {
            "title": "account",
            "type": "string"
          }
        }
      ],
      "output": {
        "name": "result",
        "type": "object",
        "description": "A JSON Object containing status, code and the result",
        "schema": {
          "title": "result",
          "type": "object"
        }
      },
      "roles": [
        "admin"
      ],
      "route": {
        "verb": "POST",
        "path": "/postAccountsAccountLicensesIdActionsRevoke"
      },
      "task": true
    },
    {
      "name": "postAccountsAccountLicensesIdActionsCheckIn",
      "summary": "Check-In license",
      "description": "Action to check-in a license. Sets the license's lastCheckIn to the current time, and the license's nextCheckIn according to the policy's check-in interval.",
      "input": [
        {
          "name": "id",
          "type": "string",
          "info": "The identifier (UUID) or key of the license to be checked-in. Cannot be a legacy encrypted license key.: string",
          "required": true,
          "schema": {
            "title": "id",
            "type": "string"
          }
        },
        {
          "name": "account",
          "type": "string",
          "info": "The identifier (UUID) or slug of your Keygen account.: string",
          "required": true,
          "schema": {
            "title": "account",
            "type": "string"
          }
        }
      ],
      "output": {
        "name": "result",
        "type": "object",
        "description": "A JSON Object containing status, code and the result",
        "schema": {
          "title": "result",
          "type": "object"
        }
      },
      "roles": [
        "admin"
      ],
      "route": {
        "verb": "POST",
        "path": "/postAccountsAccountLicensesIdActionsCheckIn"
      },
      "task": true
    },
    {
      "name": "postAccountsAccountLicensesIdActionsIncrementUsage",
      "summary": "Increment usage",
      "description": "Action to increment a license's uses attribute in accordance with its policy's maxUses attribute. When the policy's maxUses limit is exceeded, the increment attempt will fail. When the policy's maxUses is set to null, there is no limit on usage.\n\nThe uses attribute cannot be incremented more than the maximum value of a 4 byte integer, 2,147,483,647. If you need to store larger values, you may need to store usage information in your own datastore. Please reach out if you have any questions.",
      "input": [
        {
          "name": "id",
          "type": "string",
          "info": "The identifier (UUID) or key of the license to be incremented. Cannot be a legacy encrypted license key.: string",
          "required": true,
          "schema": {
            "title": "id",
            "type": "string"
          }
        },
        {
          "name": "account",
          "type": "string",
          "info": "The identifier (UUID) or slug of your Keygen account.: string",
          "required": true,
          "schema": {
            "title": "account",
            "type": "string"
          }
        },
        {
          "name": "meta",
          "type": "object",
          "info": ": object",
          "required": true,
          "schema": {
            "title": "meta",
            "type": "object"
          }
        }
      ],
      "output": {
        "name": "result",
        "type": "object",
        "description": "A JSON Object containing status, code and the result",
        "schema": {
          "title": "result",
          "type": "object"
        }
      },
      "roles": [
        "admin"
      ],
      "route": {
        "verb": "POST",
        "path": "/postAccountsAccountLicensesIdActionsIncrementUsage"
      },
      "task": true
    },
    {
      "name": "postAccountsAccountLicensesIdActionsDecrementUsage",
      "summary": "Decrement usage",
      "description": "Action to decrement a license's uses attribute in accordance with its policy's maxUses attribute.",
      "input": [
        {
          "name": "id",
          "type": "string",
          "info": "The identifier (UUID) or key of the license to be decrement. Cannot be a legacy encrypted license key.: string",
          "required": true,
          "schema": {
            "title": "id",
            "type": "string"
          }
        },
        {
          "name": "account",
          "type": "string",
          "info": "The identifier (UUID) or slug of your Keygen account.: string",
          "required": true,
          "schema": {
            "title": "account",
            "type": "string"
          }
        },
        {
          "name": "meta",
          "type": "object",
          "info": ": object",
          "required": true,
          "schema": {
            "title": "meta",
            "type": "object"
          }
        }
      ],
      "output": {
        "name": "result",
        "type": "object",
        "description": "A JSON Object containing status, code and the result",
        "schema": {
          "title": "result",
          "type": "object"
        }
      },
      "roles": [
        "admin"
      ],
      "route": {
        "verb": "POST",
        "path": "/postAccountsAccountLicensesIdActionsDecrementUsage"
      },
      "task": true
    },
    {
      "name": "postAccountsAccountLicensesIdActionsResetUsage",
      "summary": "Reset usage",
      "description": "Action to reset a license's uses attribute to 0.",
      "input": [
        {
          "name": "id",
          "type": "string",
          "info": "The identifier (UUID) or key of the license to reset usage for. Cannot be a legacy encrypted license key.: string",
          "required": true,
          "schema": {
            "title": "id",
            "type": "string"
          }
        },
        {
          "name": "account",
          "type": "string",
          "info": "The identifier (UUID) or slug of your Keygen account.: string",
          "required": true,
          "schema": {
            "title": "account",
            "type": "string"
          }
        }
      ],
      "output": {
        "name": "result",
        "type": "object",
        "description": "A JSON Object containing status, code and the result",
        "schema": {
          "title": "result",
          "type": "object"
        }
      },
      "roles": [
        "admin"
      ],
      "route": {
        "verb": "POST",
        "path": "/postAccountsAccountLicensesIdActionsResetUsage"
      },
      "task": true
    },
    {
      "name": "postAccountsAccountLicensesIdTokens",
      "summary": "Generate an active token",
      "description": "Create an activation token for a license. An activation token has permission to activate and deactivate machines for the given license.\n\nA typical machine activation flow using activation tokens will require you to deliver the license key, as well as the activation token to your customer (e.g. via email). In this scenario, you would generate an activation token after creating a license for them, all of which would likely be done after purchase.\n\nProviding the customer with both the activation to...(description truncated)",
      "input": [
        {
          "name": "id",
          "type": "string",
          "info": "The identifier (UUID) or key of the license the token is for. Cannot be a legacy encrypted license key.: string",
          "required": true,
          "schema": {
            "title": "id",
            "type": "string"
          }
        },
        {
          "name": "account",
          "type": "string",
          "info": "The identifier (UUID) or slug of your Keygen account.: string",
          "required": true,
          "schema": {
            "title": "account",
            "type": "string"
          }
        },
        {
          "name": "data",
          "type": "object",
          "info": ": object",
          "required": true,
          "schema": {
            "title": "data",
            "type": "object"
          }
        }
      ],
      "output": {
        "name": "result",
        "type": "object",
        "description": "A JSON Object containing status, code and the result",
        "schema": {
          "title": "result",
          "type": "object"
        }
      },
      "roles": [
        "admin"
      ],
      "route": {
        "verb": "POST",
        "path": "/postAccountsAccountLicensesIdTokens"
      },
      "task": true
    },
    {
      "name": "putAccountsAccountLicensesIdPolicy",
      "summary": "Change policy",
      "description": "Change a license's policy relationship. This will immediately be taken into effect for all future validations.\n\nBelow are the limitations to changing a license's policy:\n\nYou cannot change from an encrypted policy to an unencrypted policy (or vice-versa).\n\nYou cannot change from a pooled policy to an unpooled policy (or vice-versa).\n\nYou cannot change to a policy that has a different scheme.\n\nYou cannot change to a policy for another product.",
      "input": [
        {
          "name": "id",
          "type": "string",
          "info": "The identifier (UUID) or key of the license to be updated. Cannot be a legacy encrypted license key.: string",
          "required": true,
          "schema": {
            "title": "id",
            "type": "string"
          }
        },
        {
          "name": "account",
          "type": "string",
          "info": "The identifier (UUID) or slug of your Keygen account.: string",
          "required": true,
          "schema": {
            "title": "account",
            "type": "string"
          }
        },
        {
          "name": "data",
          "type": "object",
          "info": ": object",
          "required": true,
          "schema": {
            "title": "data",
            "type": "object"
          }
        }
      ],
      "output": {
        "name": "result",
        "type": "object",
        "description": "A JSON Object containing status, code and the result",
        "schema": {
          "title": "result",
          "type": "object"
        }
      },
      "roles": [
        "admin"
      ],
      "route": {
        "verb": "POST",
        "path": "/putAccountsAccountLicensesIdPolicy"
      },
      "task": true
    },
    {
      "name": "putAccountsAccountLicensesIdUser",
      "summary": "Change user",
      "description": "Change a license's user relationship. This will immediately transfer the license resource to the new user.",
      "input": [
        {
          "name": "id",
          "type": "string",
          "info": "The identifier (UUID) or key of the license to be updated. Cannot be a legacy encrypted license key.: string",
          "required": true,
          "schema": {
            "title": "id",
            "type": "string"
          }
        },
        {
          "name": "account",
          "type": "string",
          "info": "The identifier (UUID) or slug of your Keygen account.: string",
          "required": true,
          "schema": {
            "title": "account",
            "type": "string"
          }
        },
        {
          "name": "data",
          "type": "object",
          "info": ": object",
          "required": true,
          "schema": {
            "title": "data",
            "type": "object"
          }
        }
      ],
      "output": {
        "name": "result",
        "type": "object",
        "description": "A JSON Object containing status, code and the result",
        "schema": {
          "title": "result",
          "type": "object"
        }
      },
      "roles": [
        "admin"
      ],
      "route": {
        "verb": "POST",
        "path": "/putAccountsAccountLicensesIdUser"
      },
      "task": true
    },
    {
      "name": "postAccountsAccountPolicies",
      "summary": "Create a policy",
      "description": "Creates a new policy resource.",
      "input": [
        {
          "name": "account",
          "type": "string",
          "info": "The identifier (UUID) or slug of your Keygen account.: string",
          "required": true,
          "schema": {
            "title": "account",
            "type": "string"
          }
        },
        {
          "name": "data",
          "type": "object",
          "info": ": object",
          "required": true,
          "schema": {
            "title": "data",
            "type": "object"
          }
        }
      ],
      "output": {
        "name": "result",
        "type": "object",
        "description": "A JSON Object containing status, code and the result",
        "schema": {
          "title": "result",
          "type": "object"
        }
      },
      "roles": [
        "admin"
      ],
      "route": {
        "verb": "POST",
        "path": "/postAccountsAccountPolicies"
      },
      "task": true
    },
    {
      "name": "getAccountsAccountPolicies",
      "summary": "List all policies",
      "description": "Returns a list of policies. The policies are returned sorted by creation date, with the most recent policies appearing first. Resources are automatically scoped to the authenticated bearer e.g. when authenticated as a product, only policies of that specific product will be listed.",
      "input": [
        {
          "name": "account",
          "type": "string",
          "info": "The identifier (UUID) or slug of your Keygen account.: string",
          "required": true,
          "schema": {
            "title": "account",
            "type": "string"
          }
        },
        {
          "name": "limit",
          "type": "number",
          "info": "A limit on the number of policies to be returned. Limit must be a number between 1 and 100.: 123",
          "required": false,
          "schema": {
            "title": "limit",
            "type": "number"
          }
        },
        {
          "name": "product",
          "type": "string",
          "info": "The identifier (UUID) of the product to filter by.: string",
          "required": false,
          "schema": {
            "title": "product",
            "type": "string"
          }
        }
      ],
      "output": {
        "name": "result",
        "type": "object",
        "description": "A JSON Object containing status, code and the result",
        "schema": {
          "title": "result",
          "type": "object"
        }
      },
      "roles": [
        "admin"
      ],
      "route": {
        "verb": "POST",
        "path": "/getAccountsAccountPolicies"
      },
      "task": true
    },
    {
      "name": "getAccountsAccountPoliciesId",
      "summary": "Retrieve a policy",
      "description": "Retrieves the details of an existing policy.",
      "input": [
        {
          "name": "id",
          "type": "string",
          "info": "The identifier (UUID) of the policy to be updated.: string",
          "required": true,
          "schema": {
            "title": "id",
            "type": "string"
          }
        },
        {
          "name": "account",
          "type": "string",
          "info": "The identifier (UUID) or slug of your Keygen account.: string",
          "required": true,
          "schema": {
            "title": "account",
            "type": "string"
          }
        }
      ],
      "output": {
        "name": "result",
        "type": "object",
        "description": "A JSON Object containing status, code and the result",
        "schema": {
          "title": "result",
          "type": "object"
        }
      },
      "roles": [
        "admin"
      ],
      "route": {
        "verb": "POST",
        "path": "/getAccountsAccountPoliciesId"
      },
      "task": true
    },
    {
      "name": "patchAccountsAccountPoliciesId",
      "summary": "Update a policy",
      "description": "Updates the specified policy resource by setting the values of the parameters passed. Any parameters not provided will be left unchanged.",
      "input": [
        {
          "name": "id",
          "type": "string",
          "info": "The identifier (UUID) of the policy to be updated.: string",
          "required": true,
          "schema": {
            "title": "id",
            "type": "string"
          }
        },
        {
          "name": "account",
          "type": "string",
          "info": "The identifier (UUID) or slug of your Keygen account.: string",
          "required": true,
          "schema": {
            "title": "account",
            "type": "string"
          }
        },
        {
          "name": "data",
          "type": "object",
          "info": ": object",
          "required": true,
          "schema": {
            "title": "data",
            "type": "object"
          }
        }
      ],
      "output": {
        "name": "result",
        "type": "object",
        "description": "A JSON Object containing status, code and the result",
        "schema": {
          "title": "result",
          "type": "object"
        }
      },
      "roles": [
        "admin"
      ],
      "route": {
        "verb": "POST",
        "path": "/patchAccountsAccountPoliciesId"
      },
      "task": true
    },
    {
      "name": "deleteAccountsAccountPoliciesId",
      "summary": "Delete a policy",
      "description": "Permanently deletes a policy. It cannot be undone. This action also immediately deletes any licenses that the policy is associated with.",
      "input": [
        {
          "name": "id",
          "type": "string",
          "info": "The identifier (UUID) of the policy to be updated.: string",
          "required": true,
          "schema": {
            "title": "id",
            "type": "string"
          }
        },
        {
          "name": "account",
          "type": "string",
          "info": "The identifier (UUID) or slug of your Keygen account.: string",
          "required": true,
          "schema": {
            "title": "account",
            "type": "string"
          }
        }
      ],
      "output": {
        "name": "result",
        "type": "object",
        "description": "A JSON Object containing status, code and the result",
        "schema": {
          "title": "result",
          "type": "object"
        }
      },
      "roles": [
        "admin"
      ],
      "route": {
        "verb": "POST",
        "path": "/deleteAccountsAccountPoliciesId"
      },
      "task": true
    },
    {
      "name": "deleteAccountsAccountPoliciesIdPool",
      "summary": "Retrieve a policy",
      "description": "Pop off (delete) a key from the policy's pool of pre-determined keys. The returned key is only available directly after a pop, similar to authentication tokens. This cannot be undone.\n\nThis action does not create a license resource. What you do with the key after a pop is up to you e.g. create a license with it, discard it, etc. To pop a key and create a license in a single action, simply create a license that implements the pooled policy.",
      "input": [
        {
          "name": "id",
          "type": "string",
          "info": "The identifier (UUID) of the policy to be updated.: string",
          "required": true,
          "schema": {
            "title": "id",
            "type": "string"
          }
        },
        {
          "name": "account",
          "type": "string",
          "info": "The identifier (UUID) or slug of your Keygen account.: string",
          "required": true,
          "schema": {
            "title": "account",
            "type": "string"
          }
        }
      ],
      "output": {
        "name": "result",
        "type": "object",
        "description": "A JSON Object containing status, code and the result",
        "schema": {
          "title": "result",
          "type": "object"
        }
      },
      "roles": [
        "admin"
      ],
      "route": {
        "verb": "POST",
        "path": "/deleteAccountsAccountPoliciesIdPool"
      },
      "task": true
    },
    {
      "name": "postAccountsAccountProducts",
      "summary": "Create a product",
      "description": "Creates a new product resource.",
      "input": [
        {
          "name": "account",
          "type": "string",
          "info": "The identifier (UUID) or slug of your Keygen account.: string",
          "required": true,
          "schema": {
            "title": "account",
            "type": "string"
          }
        },
        {
          "name": "data",
          "type": "object",
          "info": ": object",
          "required": true,
          "schema": {
            "title": "data",
            "type": "object"
          }
        }
      ],
      "output": {
        "name": "result",
        "type": "object",
        "description": "A JSON Object containing status, code and the result",
        "schema": {
          "title": "result",
          "type": "object"
        }
      },
      "roles": [
        "admin"
      ],
      "route": {
        "verb": "POST",
        "path": "/postAccountsAccountProducts"
      },
      "task": true
    },
    {
      "name": "getAccountsAccountProducts",
      "summary": "List all products",
      "description": "Returns a list of products. The products are returned sorted by creation date, with the most recent products appearing first.",
      "input": [
        {
          "name": "account",
          "type": "string",
          "info": "The identifier (UUID) or slug of your Keygen account.: string",
          "required": true,
          "schema": {
            "title": "account",
            "type": "string"
          }
        },
        {
          "name": "limit",
          "type": "number",
          "info": "A limit on the number of products to be returned. Limit must be a number between 1 and 100.: 123",
          "required": false,
          "schema": {
            "title": "limit",
            "type": "number"
          }
        }
      ],
      "output": {
        "name": "result",
        "type": "object",
        "description": "A JSON Object containing status, code and the result",
        "schema": {
          "title": "result",
          "type": "object"
        }
      },
      "roles": [
        "admin"
      ],
      "route": {
        "verb": "POST",
        "path": "/getAccountsAccountProducts"
      },
      "task": true
    },
    {
      "name": "getAccountsAccountProductsId",
      "summary": "Retrieve a product",
      "description": "Retrieves the details of an existing product.",
      "input": [
        {
          "name": "id",
          "type": "string",
          "info": "The identifier (UUID) of the product to be updated.: string",
          "required": true,
          "schema": {
            "title": "id",
            "type": "string"
          }
        },
        {
          "name": "account",
          "type": "string",
          "info": "The identifier (UUID) or slug of your Keygen account.: string",
          "required": true,
          "schema": {
            "title": "account",
            "type": "string"
          }
        },
        {
          "name": "data",
          "type": "object",
          "info": ": object",
          "required": true,
          "schema": {
            "title": "data",
            "type": "object"
          }
        }
      ],
      "output": {
        "name": "result",
        "type": "object",
        "description": "A JSON Object containing status, code and the result",
        "schema": {
          "title": "result",
          "type": "object"
        }
      },
      "roles": [
        "admin"
      ],
      "route": {
        "verb": "POST",
        "path": "/getAccountsAccountProductsId"
      },
      "task": true
    },
    {
      "name": "patchAccountsAccountProductsId",
      "summary": "update a product",
      "description": "Updates the specified product resource by setting the values of the parameters passed. Any parameters not provided will be left unchanged.",
      "input": [
        {
          "name": "id",
          "type": "string",
          "info": "The identifier (UUID) of the product to be updated.: string",
          "required": true,
          "schema": {
            "title": "id",
            "type": "string"
          }
        },
        {
          "name": "account",
          "type": "string",
          "info": "The identifier (UUID) or slug of your Keygen account.: string",
          "required": true,
          "schema": {
            "title": "account",
            "type": "string"
          }
        },
        {
          "name": "data",
          "type": "object",
          "info": ": object",
          "required": true,
          "schema": {
            "title": "data",
            "type": "object"
          }
        }
      ],
      "output": {
        "name": "result",
        "type": "object",
        "description": "A JSON Object containing status, code and the result",
        "schema": {
          "title": "result",
          "type": "object"
        }
      },
      "roles": [
        "admin"
      ],
      "route": {
        "verb": "POST",
        "path": "/patchAccountsAccountProductsId"
      },
      "task": true
    },
    {
      "name": "deleteAccountsAccountProductsId",
      "summary": "Delete a product",
      "description": "Permanently deletes a product. It cannot be undone. This action also immediately deletes any policies, licenses and machines that the product is associated with.",
      "input": [
        {
          "name": "id",
          "type": "string",
          "info": "The identifier (UUID) of the product to be updated.: string",
          "required": true,
          "schema": {
            "title": "id",
            "type": "string"
          }
        },
        {
          "name": "account",
          "type": "string",
          "info": "The identifier (UUID) or slug of your Keygen account.: string",
          "required": true,
          "schema": {
            "title": "account",
            "type": "string"
          }
        }
      ],
      "output": {
        "name": "result",
        "type": "object",
        "description": "A JSON Object containing status, code and the result",
        "schema": {
          "title": "result",
          "type": "object"
        }
      },
      "roles": [
        "admin"
      ],
      "route": {
        "verb": "POST",
        "path": "/deleteAccountsAccountProductsId"
      },
      "task": true
    },
    {
      "name": "postAccountsAccountProductsIdTokens",
      "summary": "Generate a product token",
      "description": "Generates a new product token resource. Product tokens do not expire.\n\nProduct tokens should not be included in any client-facing code, as they offer full access to all of the product's resources. Only use these tokens server-side e.g. to consume webhooks or to create new resources in response to events from your payment provider.",
      "input": [
        {
          "name": "id",
          "type": "string",
          "info": "The identifier (UUID) of the product to be updated.: string",
          "required": true,
          "schema": {
            "title": "id",
            "type": "string"
          }
        },
        {
          "name": "account",
          "type": "string",
          "info": "The identifier (UUID) or slug of your Keygen account.: string",
          "required": true,
          "schema": {
            "title": "account",
            "type": "string"
          }
        }
      ],
      "output": {
        "name": "result",
        "type": "object",
        "description": "A JSON Object containing status, code and the result",
        "schema": {
          "title": "result",
          "type": "object"
        }
      },
      "roles": [
        "admin"
      ],
      "route": {
        "verb": "POST",
        "path": "/postAccountsAccountProductsIdTokens"
      },
      "task": true
    },
    {
      "name": "postAccountsAccountTokens",
      "summary": "Generate a token",
      "description": "Generate a new token resource for a user. To generate a token for a product, see the product token relationship. By default, user tokens expire in 2 weeks, and admin tokens do not expire. A custom expiry may be provided in the token generate request.\n Admin and product tokens should not be included in any client-facing code, as they offer full access to all of your account's resources. You can authenticate as one of your users or use an activation token to perform client-side machine activations...(description truncated)",
      "input": [
        {
          "name": "account",
          "type": "string",
          "info": "The identifier (UUID) or slug of your Keygen account.: string",
          "required": true,
          "schema": {
            "title": "account",
            "type": "string"
          }
        },
        {
          "name": "data",
          "type": "object",
          "info": ": object",
          "required": true,
          "schema": {
            "title": "data",
            "type": "object"
          }
        }
      ],
      "output": {
        "name": "result",
        "type": "object",
        "description": "A JSON Object containing status, code and the result",
        "schema": {
          "title": "result",
          "type": "object"
        }
      },
      "roles": [
        "admin"
      ],
      "route": {
        "verb": "POST",
        "path": "/postAccountsAccountTokens"
      },
      "task": true
    },
    {
      "name": "getAccountsAccountTokens",
      "summary": "List all tokens",
      "description": "Returns a list of tokens. The tokens are returned sorted by creation date, with the most recent tokens appearing first. Resources are automatically scoped to the authenticated bearer e.g. when authenticated as a product, only tokens that belong to the specific product will be listed.",
      "input": [
        {
          "name": "account",
          "type": "string",
          "info": "The identifier (UUID) or slug of your Keygen account.: string",
          "required": true,
          "schema": {
            "title": "account",
            "type": "string"
          }
        },
        {
          "name": "limit",
          "type": "number",
          "info": "A limit on the number of tokens to be returned. Limit must be a number between 1 and 100.: 123",
          "required": false,
          "schema": {
            "title": "limit",
            "type": "number"
          }
        }
      ],
      "output": {
        "name": "result",
        "type": "object",
        "description": "A JSON Object containing status, code and the result",
        "schema": {
          "title": "result",
          "type": "object"
        }
      },
      "roles": [
        "admin"
      ],
      "route": {
        "verb": "POST",
        "path": "/getAccountsAccountTokens"
      },
      "task": true
    },
    {
      "name": "getAccountsAccountTokensId",
      "summary": "Retrieve a token",
      "description": "Retrieves the details of an existing token.",
      "input": [
        {
          "name": "id",
          "type": "string",
          "info": "The identifier (UUID) of the token to be retrieved.: string",
          "required": true,
          "schema": {
            "title": "id",
            "type": "string"
          }
        },
        {
          "name": "account",
          "type": "string",
          "info": "The identifier (UUID) or slug of your Keygen account.: string",
          "required": true,
          "schema": {
            "title": "account",
            "type": "string"
          }
        }
      ],
      "output": {
        "name": "result",
        "type": "object",
        "description": "A JSON Object containing status, code and the result",
        "schema": {
          "title": "result",
          "type": "object"
        }
      },
      "roles": [
        "admin"
      ],
      "route": {
        "verb": "POST",
        "path": "/getAccountsAccountTokensId"
      },
      "task": true
    },
    {
      "name": "putAccountsAccountTokensId",
      "summary": "Regenerate a token",
      "description": "Regenerate an existing token resource. This will replace the token attribute with a new secure token, and extend the token's expiry by 2 weeks from the current time.",
      "input": [
        {
          "name": "id",
          "type": "string",
          "info": "The identifier (UUID) of the token to be regenerated.: string",
          "required": true,
          "schema": {
            "title": "id",
            "type": "string"
          }
        },
        {
          "name": "account",
          "type": "string",
          "info": "The identifier (UUID) or slug of your Keygen account.: string",
          "required": true,
          "schema": {
            "title": "account",
            "type": "string"
          }
        }
      ],
      "output": {
        "name": "result",
        "type": "object",
        "description": "A JSON Object containing status, code and the result",
        "schema": {
          "title": "result",
          "type": "object"
        }
      },
      "roles": [
        "admin"
      ],
      "route": {
        "verb": "POST",
        "path": "/putAccountsAccountTokensId"
      },
      "task": true
    },
    {
      "name": "deleteAccountsAccountTokensId",
      "summary": "Revoke a token",
      "description": "Permanently revokes a token. It cannot be undone. This action also immediately invalidates all sessions using the given token.",
      "input": [
        {
          "name": "id",
          "type": "string",
          "info": "The identifier (UUID) of the token to be regenerated.: string",
          "required": true,
          "schema": {
            "title": "id",
            "type": "string"
          }
        },
        {
          "name": "account",
          "type": "string",
          "info": "The identifier (UUID) or slug of your Keygen account.: string",
          "required": true,
          "schema": {
            "title": "account",
            "type": "string"
          }
        }
      ],
      "output": {
        "name": "result",
        "type": "object",
        "description": "A JSON Object containing status, code and the result",
        "schema": {
          "title": "result",
          "type": "object"
        }
      },
      "roles": [
        "admin"
      ],
      "route": {
        "verb": "POST",
        "path": "/deleteAccountsAccountTokensId"
      },
      "task": true
    },
    {
      "name": "getAccountsAccountMachines",
      "summary": "List all tokens",
      "description": "Returns a list of tokens. The tokens are returned sorted by creation date, with the most recent tokens appearing first. Resources are automatically scoped to the authenticated bearer e.g. when authenticated as a product, only tokens that belong to the specific product will be listed.",
      "input": [
        {
          "name": "account",
          "type": "string",
          "info": "The identifier (UUID) or slug of your Keygen account.: string",
          "required": true,
          "schema": {
            "title": "account",
            "type": "string"
          }
        },
        {
          "name": "limit",
          "type": "number",
          "info": "A limit on the number of tokens to be returned. Limit must be a number between 1 and 100.: 123",
          "required": false,
          "schema": {
            "title": "limit",
            "type": "number"
          }
        }
      ],
      "output": {
        "name": "result",
        "type": "object",
        "description": "A JSON Object containing status, code and the result",
        "schema": {
          "title": "result",
          "type": "object"
        }
      },
      "roles": [
        "admin"
      ],
      "route": {
        "verb": "POST",
        "path": "/getAccountsAccountMachines"
      },
      "task": true
    },
    {
      "name": "getAccountsAccountMachinesId",
      "summary": "Retrieve a machine",
      "description": "Retrieves the details of an existing machine.",
      "input": [
        {
          "name": "account",
          "type": "string",
          "info": "The identifier (UUID) or slug of your Keygen account.: string",
          "required": true,
          "schema": {
            "title": "account",
            "type": "string"
          }
        },
        {
          "name": "id",
          "type": "string",
          "info": "The identifier (UUID) of the machine to be retrieved.: string",
          "required": true,
          "schema": {
            "title": "id",
            "type": "string"
          }
        }
      ],
      "output": {
        "name": "result",
        "type": "object",
        "description": "A JSON Object containing status, code and the result",
        "schema": {
          "title": "result",
          "type": "object"
        }
      },
      "roles": [
        "admin"
      ],
      "route": {
        "verb": "POST",
        "path": "/getAccountsAccountMachinesId"
      },
      "task": true
    },
    {
      "name": "postAccountsAccountMachines",
      "summary": "Activate a machine",
      "description": "Creates, or activates, a new machine resource for a license. A license can have a maximum of 500 machines associated with it at any one time. If you need a higher limit, please reach out to us.",
      "input": [
        {
          "name": "account",
          "type": "string",
          "info": "The identifier (UUID) or slug of your Keygen account.: string",
          "required": true,
          "schema": {
            "title": "account",
            "type": "string"
          }
        },
        {
          "name": "data",
          "type": "object",
          "info": ": object",
          "required": true,
          "schema": {
            "title": "data",
            "type": "object"
          }
        }
      ],
      "output": {
        "name": "result",
        "type": "object",
        "description": "A JSON Object containing status, code and the result",
        "schema": {
          "title": "result",
          "type": "object"
        }
      },
      "roles": [
        "admin"
      ],
      "route": {
        "verb": "POST",
        "path": "/postAccountsAccountMachines"
      },
      "task": true
    }
  ],
  "views": []
}