{
  "id": "string",
  "type": "string",
  "links": {
    "self": "string"
  },
  "attributes": {
    "fingerprint": "string",
    "name": "string",
    "ip": "string",
    "hostname": "string",
    "platform": "string",
    "requireheartbeat": false,
    "heartbeatStatus": "NOT_STARTED",
    "lastHeartbeat": "string",
    "nextHeartbeat": "string",
    "metadata": [
      "string",
      "string",
      "string",
      "string",
      "string",
      "string",
      "string",
      "string"
    ],
    "created": "string",
    "updated": "string"
  },
  "relationships": {
    "account": {
      "links": {
        "related": "string"
      },
      "data": {
        "type": "string",
        "id": "string"
      }
    },
    "product": {
      "links": {
        "related": "string"
      },
      "data": {
        "type": "string",
        "id": "string"
      }
    },
    "licenses": {
      "links": {
        "related": "string"
      },
      "data": {
        "type": "string",
        "id": "string"
      }
    },
    "users": {
      "links": {
        "related": "string"
      },
      "data": {
        "type": "string",
        "id": "string"
      }
    }
  }
}