{
  "actions": [
    {
      "name": "postAccountsAccountLicensesIdTokens",
      "protocol": "REST",
      "method": "POST",
      "entitypath": "{base_path}/{version}/accounts/{pathv1}/licenses/{pathv2}/tokens?{query}",
      "requestSchema": "schema.json",
      "responseSchema": "schema.json",
      "timeout": 0,
      "sendEmpty": false,
      "requestDatatype": "JSON",
      "responseDatatype": "JSON",
      "headers": {},
      "responseObjects": [
        {
          "type": "default",
          "key": "",
          "mockFile": "mockdatafiles/postAccountsAccountLicensesIdTokens-default.json"
        }
      ]
    },
    {
      "name": "putAccountsAccountLicensesIdPolicy",
      "protocol": "REST",
      "method": "PUT",
      "entitypath": "{base_path}/{version}/accounts/{pathv1}/licenses/{pathv2}/policy?{query}",
      "requestSchema": "schema.json",
      "responseSchema": "schema.json",
      "timeout": 0,
      "sendEmpty": false,
      "requestDatatype": "JSON",
      "responseDatatype": "JSON",
      "headers": {},
      "responseObjects": [
        {
          "type": "default",
          "key": "",
          "mockFile": "mockdatafiles/putAccountsAccountLicensesIdPolicy-default.json"
        }
      ]
    },
    {
      "name": "putAccountsAccountLicensesIdUser",
      "protocol": "REST",
      "method": "PUT",
      "entitypath": "{base_path}/{version}/accounts/{pathv1}/licenses/{pathv2}/user?{query}",
      "requestSchema": "schema.json",
      "responseSchema": "schema.json",
      "timeout": 0,
      "sendEmpty": false,
      "requestDatatype": "JSON",
      "responseDatatype": "JSON",
      "headers": {},
      "responseObjects": [
        {
          "type": "default",
          "key": "",
          "mockFile": "mockdatafiles/putAccountsAccountLicensesIdUser-default.json"
        }
      ]
    }
  ]
}