{
  "id": "string",
  "type": "string",
  "links": {
    "self": "string"
  },
  "attributes": {
    "name": "string",
    "duration": 4,
    "strict": false,
    "floating": false,
    "concurrent": false,
    "scheme": "RSA_2048_JWT_RS256",
    "requireProductScope": true,
    "requirePolicyScope": false,
    "requireMachineScope": true,
    "requireFingerprintScope": true,
    "requireCheckIn": true,
    "checkInInterval": "month",
    "checkInIntervalCount": 2,
    "usePool": true,
    "maxMachines": 8,
    "maxUses": 7,
    "encrypted": true,
    "protected": true,
    "metadata": {},
    "created": "string",
    "updated": "string"
  },
  "relationships": {
    "account": {
      "links": {
        "related": "string"
      },
      "data": {
        "type": "string",
        "id": "string"
      }
    },
    "product": {
      "links": {
        "related": "string"
      },
      "data": {
        "type": "string",
        "id": "string"
      }
    },
    "pool": {
      "links": {
        "related": "string"
      }
    },
    "licenses": {
      "links": {
        "related": "string"
      }
    }
  }
}