{
  "$id": "schema.json",
  "type": "object",
  "schema": "http://json-schema.org/draft-07/schema#",
  "translate": true,
  "dynamicfields": true,
  "properties": {
    "ph_request_type": {
      "type": "string",
      "description": "type of request (internal to adapter)",
      "default": "decodeCSR",
      "enum": [
        "decodeCSR",
        "generateCSR",
        "validateCSR"
      ],
      "external_name": "ph_request_type"
    },
    "csrCommonname": {
      "type": "string",
      "description": "FQDN csr is generated for, can also be IP",
      "parse": false,
      "encode": false,
      "encrypt": {
        "type": "AES",
        "key": ""
      },
      "external_name": "csr_commonname"
    },
    "csrOrganization": {
      "type": "string",
      "description": "organization name",
      "parse": false,
      "encode": false,
      "encrypt": {
        "type": "AES",
        "key": ""
      },
      "external_name": "csr_organization"
    },
    "csrDepartment": {
      "type": "string",
      "description": "",
      "parse": false,
      "encode": false,
      "encrypt": {
        "type": "AES",
        "key": ""
      },
      "external_name": "csr_department"
    },
    "csrCity": {
      "type": "string",
      "description": "",
      "parse": false,
      "encode": false,
      "encrypt": {
        "type": "AES",
        "key": ""
      },
      "external_name": "csr_city"
    },
    "csrState": {
      "type": "string",
      "description": "",
      "parse": false,
      "encode": false,
      "encrypt": {
        "type": "AES",
        "key": ""
      },
      "external_name": "csr_state"
    },
    "csrCountry": {
      "type": "string",
      "description": "valid ISO-3166 country code",
      "parse": false,
      "encode": false,
      "encrypt": {
        "type": "AES",
        "key": ""
      },
      "external_name": "csr_country"
    },
    "csrEmail": {
      "type": "string",
      "description": "",
      "parse": false,
      "encode": false,
      "encrypt": {
        "type": "AES",
        "key": ""
      },
      "external_name": "csr_email"
    }
  },
  "definitions": {}
}