{
  "$id": "schema.json",
  "type": "object",
  "schema": "http://json-schema.org/draft-07/schema#",
  "translate": true,
  "dynamicfields": true,
  "properties": {
    "ph_request_type": {
      "type": "string",
      "description": "type of request (internal to adapter)",
      "default": "getAllInvoices",
      "enum": [
        "getAllInvoices",
        "getUnpaidInvoices",
        "getOrderInvoice"
      ],
      "external_name": "ph_request_type"
    },
    "authKey": {
      "type": "string",
      "description": "Request token obtained from Auth method",
      "parse": false,
      "encode": false,
      "encrypt": {
        "type": "AES",
        "key": ""
      },
      "external_name": "auth_key"
    },
    "orderId": {
      "type": "string",
      "description": "",
      "parse": false,
      "encode": false,
      "encrypt": {
        "type": "AES",
        "key": ""
      },
      "external_name": "order_id"
    }
  },
  "definitions": {}
}