{
  "product_price": [
    {
      "period": "string",
      "price": null,
      "id": "string"
    },
    {
      "period": "string",
      "price": null,
      "id": "string"
    },
    {
      "period": "string",
      "price": null,
      "id": "string"
    },
    {
      "period": "string",
      "price": null,
      "id": "string"
    },
    {
      "period": "string",
      "price": null,
      "id": "string"
    },
    {
      "period": "string",
      "price": null,
      "id": "string"
    },
    {
      "period": "string",
      "price": null,
      "id": "string"
    },
    {
      "period": "string",
      "price": null,
      "id": "string"
    },
    {
      "period": "string",
      "price": null,
      "id": "string"
    }
  ],
  "success": true
}