{
  "product_id": "string",
  "order_number": "string",
  "order_id": "string",
  "invoice_num": "string",
  "invoice_id": "string",
  "lei_id": "string",
  "order_amount": 7,
  "currency": "string",
  "tax": "string",
  "tax_rate": "string",
  "success": true
}