{
  "GeotrustApprovalEmails": [
    "admin@my-domain-name.tld",
    "administrator@my-domain-name.tld",
    "hostmaster@my-domain-name.tld",
    "webmaster@my-domain-name.tld",
    "postmaster@my-domain-name.tld"
  ],
  "success": true
}