{
  "order_id": "1146748",
  "number": "GGS-0719723755",
  "date": "2019-07-23",
  "subtotal": "59.13",
  "tax": "12.42",
  "tax_rate": "21.00",
  "total": "71.55",
  "status": "paid",
  "currency": "EUR",
  "payment_method": "balance",
  "success": true
}