{
  "swagger": "2.0",
  "x-service-type": "json-rpc",
  "info": {
    "title": "FortiManager JSON API Documentation",
    "version": "6.2.1"
  },
  "basePath": "/",
  "schemes": [
    "https"
  ],
  "consumes": [
    "application/json"
  ],
  "produces": [
    "application/json"
  ],
  "definitions": {
    "common.result.object": {
      "type": "object",
      "properties": {
        "code": {
          "type": "integer",
          "format": "int32"
        },
        "message": {
          "type": "string"
        }
      }
    }
  },
  "tags": [{
    "name":"genericRequest",
    "description":"This is a generic json rpc api request"}
  ],
  "paths": {
    "/jsonrpc": {
      "post": {
      "tags":["genericRequest"],
        "summary": "This is a generic json rpc api request",
        "description": "This is a generic json rpc api request",
        "parameters": [
          {
            "name": "body",
            "in": "body",
            "required": true,
            "schema": {
              "type": "object",
              "properties": {
                "method": {
                  "type": "string",
                  "example": "add/get/update/delete"
                },
                "params": {
                  "type": "array",
                  "items": {
                    "type": "object",
                    "properties": {
                      "data": {
                        "type": "array",
                        "items": {}
                      },
                      "url": {
                        "type": "string",
                        "format": "string",
                        "example": "/actionName"
                      }
                    }
                  }
                },
                "session": {
                  "type": "string"
                },
                "id": {
                  "type": "integer",
                  "format": "int32",
                  "example": 1
                }
              }
            }
          }
        ],
        "responses": {
          "200": {
            "description": "OK: Request returns successful",
            "schema": {
              "type": "object",
              "properties": {
                "method": {
                  "type": "string",
                  "example": "add/get/set/update/delete"
                },
                "result": {
                  "type": "array",
                  "items": {
                    "type": "object",
                    "properties": {
                      "status": {
                        "$ref": "#/definitions/common.result.object"
                      },
                      "url": {
                        "type": "string",
                        "format": "string",
                        "example": "/actionName"
                      }
                    }
                  }
                },
                "id": {
                  "type": "integer",
                  "format": "int32",
                  "example": 1
                }
              }
            }
          }
        }
      }
    }
  }
}