{
  "openapi": "3.0.0",
  "info": {
    "title": "FortiManager JSON API Documentation",
    "contact": {},
    "version": "6.2.1"
  },
  "servers": [
    {
      "url": "https://{defaultHost}",
      "variables": {
        "defaultHost": {
          "default": "www.example.com/"
        }
      }
    }
  ],
  "paths": {
    "/jsonrpc": {
      "post": {
        "tags": [
          "genericRequest"
        ],
        "summary": "This is a generic json rpc api request",
        "description": "This is a generic json rpc api request",
        "operationId": "Thisisagenericjsonrpcapirequest",
        "parameters": [],
        "requestBody": {
          "description": "",
          "content": {
            "application/json": {
              "schema": {
                "$ref": "#/components/schemas/body"
              }
            }
          },
          "required": true
        },
        "responses": {
          "200": {
            "description": "OK: Request returns successful",
            "headers": {},
            "content": {
              "application/json": {
                "schema": {
                  "$ref": "#/components/schemas/ThisisagenericjsonrpcapirequestResponse"
                }
              }
            }
          }
        },
        "deprecated": false
      }
    }
  },
  "components": {
    "schemas": {
      "common.result.object": {
        "title": "common.result.object",
        "type": "object",
        "properties": {
          "code": {
            "type": "integer",
            "format": "int32"
          },
          "message": {
            "type": "string"
          }
        }
      },
      "body": {
        "title": "body",
        "type": "object",
        "properties": {
          "method": {
            "type": "string",
            "example": "add/get/update/delete"
          },
          "params": {
            "type": "array",
            "items": {
              "$ref": "#/components/schemas/Param"
            },
            "description": ""
          },
          "session": {
            "type": "string"
          },
          "id": {
            "type": "integer",
            "format": "int32",
            "example": 1
          }
        }
      },
      "Param": {
        "title": "Param",
        "type": "object",
        "properties": {
          "data": {
            "type": "array",
            "items": {
              "type": "object"
            },
            "description": ""
          },
          "url": {
            "type": "string",
            "example": "/actionName"
          }
        }
      },
      "Result": {
        "title": "Result",
        "type": "object",
        "properties": {
          "status": {
            "$ref": "#/components/schemas/common.result.object"
          },
          "url": {
            "type": "string",
            "example": "/actionName"
          }
        }
      },
      "ThisisagenericjsonrpcapirequestResponse": {
        "title": "ThisisagenericjsonrpcapirequestResponse",
        "type": "object",
        "properties": {
          "method": {
            "type": "string",
            "example": "add/get/set/update/delete"
          },
          "result": {
            "type": "array",
            "items": {
              "$ref": "#/components/schemas/Result"
            },
            "description": ""
          },
          "id": {
            "type": "integer",
            "format": "int32",
            "example": 1
          }
        }
      }
    }
  },
  "tags": [
    {
      "name": "genericRequest",
      "description": "This is a generic json rpc api request"
    }
  ]
}