{
  "actions": [
    {
      "name": "getAllOpenIDConnectIdentityProviders",
      "protocol": "REST",
      "method": "GET",
      "entitypath": "{base_path}/{version}/PasswordVault/api/Configuration/OIDC/Providers?{query}",
      "requestSchema": "schema.json",
      "responseSchema": "schema.json",
      "timeout": 0,
      "sendEmpty": false,
      "sendGetBody": false,
      "requestDatatype": "JSON",
      "responseDatatype": "JSON",
      "headers": {},
      "responseObjects": [
        {
          "type": "default",
          "key": "",
          "mockFile": ""
        }
      ]
    },
    {
      "name": "addOpenIDConnectIdentityProvider",
      "protocol": "REST",
      "method": "POST",
      "entitypath": "{base_path}/{version}/PasswordVault/api/Configuration/OIDC/Providers?{query}",
      "requestSchema": "schema.json",
      "responseSchema": "schema.json",
      "timeout": 0,
      "sendEmpty": false,
      "requestDatatype": "JSON",
      "responseDatatype": "JSON",
      "headers": {},
      "responseObjects": [
        {
          "type": "default",
          "key": "",
          "mockFile": ""
        }
      ]
    },
    {
      "name": "getSpecificOpenIDConnectIdentityProvider",
      "protocol": "REST",
      "method": "GET",
      "entitypath": "{base_path}/{version}/PasswordVault/api/Configuration/OIDC/Providers/?{query}",
      "requestSchema": "schema.json",
      "responseSchema": "schema.json",
      "timeout": 0,
      "sendEmpty": false,
      "sendGetBody": false,
      "requestDatatype": "JSON",
      "responseDatatype": "JSON",
      "headers": {},
      "responseObjects": [
        {
          "type": "default",
          "key": "",
          "mockFile": ""
        }
      ]
    },
    {
      "name": "updateOpenIDConnectIdentityProvider",
      "protocol": "REST",
      "method": "PUT",
      "entitypath": "{base_path}/{version}/PasswordVault/api/Configuration/OIDC/Providers/?{query}",
      "requestSchema": "schema.json",
      "responseSchema": "schema.json",
      "timeout": 0,
      "sendEmpty": false,
      "requestDatatype": "JSON",
      "responseDatatype": "JSON",
      "headers": {},
      "responseObjects": [
        {
          "type": "default",
          "key": "",
          "mockFile": ""
        }
      ]
    },
    {
      "name": "deleteOpenIDConnectIdentityProvider",
      "protocol": "REST",
      "method": "DELETE",
      "entitypath": "{base_path}/{version}/PasswordVault/api/Configuration/OIDC/Providers/?{query}",
      "requestSchema": "schema.json",
      "responseSchema": "schema.json",
      "timeout": 0,
      "sendEmpty": false,
      "requestDatatype": "JSON",
      "responseDatatype": "JSON",
      "headers": {},
      "responseObjects": [
        {
          "type": "default",
          "key": "",
          "mockFile": ""
        }
      ]
    }
  ]
}