[
  {
    "referrerURL": "/WebID/",
    "regularExpression": false
  },
  {
    "referrerURL": "/WebID/",
    "regularExpression": false
  },
  {
    "referrerURL": "/WebID/",
    "regularExpression": false
  }
]