{
  "PSMServers": [
    {
      "ID": "PSMServer_a91999c",
      "Name": "PSM Server on PASAAS-PVWA",
      "Address": "54.88.213.184"
    },
    {
      "ID": "PSMServer_a91999c",
      "Name": "PSM Server on PASAAS-PVWA",
      "Address": "54.88.213.184"
    },
    {
      "ID": "PSMServer_a91999c",
      "Name": "PSM Server on PASAAS-PVWA",
      "Address": "54.88.213.184"
    },
    {
      "ID": "PSMServer_a91999c",
      "Name": "PSM Server on PASAAS-PVWA",
      "Address": "54.88.213.184"
    },
    {
      "ID": "PSMServer_a91999c",
      "Name": "PSM Server on PASAAS-PVWA",
      "Address": "54.88.213.184"
    },
    {
      "ID": "PSMServer_a91999c",
      "Name": "PSM Server on PASAAS-PVWA",
      "Address": "54.88.213.184"
    },
    {
      "ID": "PSMServer_a91999c",
      "Name": "PSM Server on PASAAS-PVWA",
      "Address": "54.88.213.184"
    },
    {
      "ID": "PSMServer_a91999c",
      "Name": "PSM Server on PASAAS-PVWA",
      "Address": "54.88.213.184"
    }
  ],
  "Total": 2
}