{
  "$id": "schema.json",
  "type": "object",
  "schema": "http://json-schema.org/draft-07/schema#",
  "translate": true,
  "dynamicfields": true,
  "properties": {
    "ph_request_type": {
      "type": "string",
      "description": "type of request (internal to adapter)",
      "default": "extendedAccountOverview",
      "enum": [
        "extendedAccountOverview",
        "getAccounts",
        "addAccount",
        "getAccountDetails",
        "updateAccount",
        "deleteAccount",
        "getAccountActivity",
        "addPendingAccount",
        "linkanAccount",
        "adHocConnectthroughPSM",
        "changePasswordImmediately",
        "changePasswordintheVaultOnly",
        "changePasswordSetNextPassword",
        "checkInanExclusiveAccount",
        "connectUsingPSM",
        "getJustinTimeAccess",
        "getPasswordValue",
        "reconcilePassword",
        "verifyPassword",
        "changePassword",
        "getDiscoveredAccountDetails",
        "getDiscoveredAccounts",
        "addDiscoveredAccountsV108",
        "logonCyberArkAuthentication",
        "logonLDAPAuthentication",
        "logonRADIUSAuthentication",
        "logonWindowsAuthentication",
        "logoff",
        "getAllSafes",
        "addSafe",
        "getSafebyPlatformID",
        "getSafeDetails",
        "deleteSafe",
        "getSafeAccountGroups",
        "getSafeMembers",
        "addSafeMember",
        "getUserDetails",
        "updateUser",
        "deleteUser",
        "getUsers",
        "addUser",
        "resetUserPassword",
        "activateUser",
        "getGroups",
        "createGroup",
        "addMembertoGroup",
        "updateGroup",
        "deleteGroup",
        "removeUserfromGroup"
      ],
      "external_name": "ph_request_type"
    },
    "body": {
      "type": "object",
      "description": "",
      "parse": false,
      "encode": false,
      "encrypt": {
        "type": "AES",
        "key": ""
      },
      "external_name": "Body"
    }
  },
  "definitions": {}
}