{
  "release": "11.1",
  "version": "5.6.0",
  "services": {
    "evoke": {
      "desired": "i",
      "status": "i",
      "err": null,
      "name": "conjur-evoke",
      "version": "5.14.2.0-e5cfc56",
      "arch": "amd64"
    },
    "ldap-sync": {
      "desired": "i",
      "status": "i",
      "err": null,
      "name": "conjur-ldap-sync",
      "version": "2.1.4.0-3c52a79",
      "arch": "amd64"
    },
    "possum": {
      "desired": "i",
      "status": "i",
      "err": null,
      "name": "conjur-possum",
      "version": "1.4.2.0-982edbd",
      "arch": "amd64"
    },
    "ui": {
      "desired": "i",
      "status": "i",
      "err": null,
      "name": "conjur-ui",
      "version": "2.10.15.0-5289d616",
      "arch": "amd64"
    }
  },
  "role": "master",
  "configuration": {
    "conjur": {
      "role": "master",
      "account": "cyberarkdemo",
      "hostname": "dap.joegarcia.dev",
      "master_altnames": [
        "dap.joegarcia.dev",
        "localhost",
        "conjur"
      ]
    }
  },
  "authenticators": {
    "installed": [
      "authn",
      "authn-iam",
      "authn-k8s",
      "authn-ldap",
      "authn-oidc"
    ],
    "configured": [
      "authn"
    ],
    "enabled": [
      "authn"
    ]
  }
}