{
  "actions": [
    {
      "name": "baseUrlAclCheckRowRight",
      "protocol": "REST",
      "method": "POST",
      "entitypath": "{base_path}/{version}/Acl/CheckRowRight?{query}",
      "requestSchema": "schema.json",
      "responseSchema": "schema.json",
      "timeout": 0,
      "sendEmpty": false,
      "requestDatatype": "JSON",
      "responseDatatype": "JSON",
      "headers": {},
      "responseObjects": [
        {
          "type": "default",
          "key": "",
          "mockFile": ""
        }
      ]
    },
    {
      "name": "baseUrlAclGetAce",
      "protocol": "REST",
      "method": "POST",
      "entitypath": "{base_path}/{version}/Acl/GetAce?{query}",
      "requestSchema": "schema.json",
      "responseSchema": "schema.json",
      "timeout": 0,
      "sendEmpty": false,
      "requestDatatype": "JSON",
      "responseDatatype": "JSON",
      "headers": {},
      "responseObjects": [
        {
          "type": "default",
          "key": "",
          "mockFile": ""
        }
      ]
    },
    {
      "name": "baseUrlAclGetCollectionAces",
      "protocol": "REST",
      "method": "POST",
      "entitypath": "{base_path}/{version}/Acl/GetCollectionAces?{query}",
      "requestSchema": "schema.json",
      "responseSchema": "schema.json",
      "timeout": 0,
      "sendEmpty": false,
      "requestDatatype": "JSON",
      "responseDatatype": "JSON",
      "headers": {},
      "responseObjects": [
        {
          "type": "default",
          "key": "",
          "mockFile": ""
        }
      ]
    },
    {
      "name": "baseUrlAclGetCollectionAcesHelper",
      "protocol": "REST",
      "method": "POST",
      "entitypath": "{base_path}/{version}/Acl/GetCollectionAcesHelper?{query}",
      "requestSchema": "schema.json",
      "responseSchema": "schema.json",
      "timeout": 0,
      "sendEmpty": false,
      "requestDatatype": "JSON",
      "responseDatatype": "JSON",
      "headers": {},
      "responseObjects": [
        {
          "type": "default",
          "key": "",
          "mockFile": ""
        }
      ]
    },
    {
      "name": "baseUrlAclGetDirAces",
      "protocol": "REST",
      "method": "POST",
      "entitypath": "{base_path}/{version}/Acl/GetDirAces?{query}",
      "requestSchema": "schema.json",
      "responseSchema": "schema.json",
      "timeout": 0,
      "sendEmpty": false,
      "requestDatatype": "JSON",
      "responseDatatype": "JSON",
      "headers": {},
      "responseObjects": [
        {
          "type": "default",
          "key": "",
          "mockFile": ""
        }
      ]
    },
    {
      "name": "baseUrlAclGetEffectiveDirRights",
      "protocol": "REST",
      "method": "POST",
      "entitypath": "{base_path}/{version}/Acl/GetEffectiveDirRights?{query}",
      "requestSchema": "schema.json",
      "responseSchema": "schema.json",
      "timeout": 0,
      "sendEmpty": false,
      "requestDatatype": "JSON",
      "responseDatatype": "JSON",
      "headers": {},
      "responseObjects": [
        {
          "type": "default",
          "key": "",
          "mockFile": ""
        }
      ]
    },
    {
      "name": "baseUrlAclGetEffectiveFileRights",
      "protocol": "REST",
      "method": "POST",
      "entitypath": "{base_path}/{version}/Acl/GetEffectiveFileRights?{query}",
      "requestSchema": "schema.json",
      "responseSchema": "schema.json",
      "timeout": 0,
      "sendEmpty": false,
      "requestDatatype": "JSON",
      "responseDatatype": "JSON",
      "headers": {},
      "responseObjects": [
        {
          "type": "default",
          "key": "",
          "mockFile": ""
        }
      ]
    },
    {
      "name": "baseUrlAclGetEffectiveRowRights",
      "protocol": "REST",
      "method": "POST",
      "entitypath": "{base_path}/{version}/Acl/GetEffectiveRowRights?{query}",
      "requestSchema": "schema.json",
      "responseSchema": "schema.json",
      "timeout": 0,
      "sendEmpty": false,
      "requestDatatype": "JSON",
      "responseDatatype": "JSON",
      "headers": {},
      "responseObjects": [
        {
          "type": "default",
          "key": "",
          "mockFile": ""
        }
      ]
    },
    {
      "name": "baseUrlAclGetFileAces",
      "protocol": "REST",
      "method": "POST",
      "entitypath": "{base_path}/{version}/Acl/GetFileAces?{query}",
      "requestSchema": "schema.json",
      "responseSchema": "schema.json",
      "timeout": 0,
      "sendEmpty": false,
      "requestDatatype": "JSON",
      "responseDatatype": "JSON",
      "headers": {},
      "responseObjects": [
        {
          "type": "default",
          "key": "",
          "mockFile": ""
        }
      ]
    },
    {
      "name": "baseUrlAclGetRowAces",
      "protocol": "REST",
      "method": "POST",
      "entitypath": "{base_path}/{version}/Acl/GetRowAces?{query}",
      "requestSchema": "schema.json",
      "responseSchema": "schema.json",
      "timeout": 0,
      "sendEmpty": false,
      "requestDatatype": "JSON",
      "responseDatatype": "JSON",
      "headers": {},
      "responseObjects": [
        {
          "type": "default",
          "key": "",
          "mockFile": ""
        }
      ]
    },
    {
      "name": "baseUrlAclGetRowAcesHelper",
      "protocol": "REST",
      "method": "POST",
      "entitypath": "{base_path}/{version}/Acl/GetRowAcesHelper?{query}",
      "requestSchema": "schema.json",
      "responseSchema": "schema.json",
      "timeout": 0,
      "sendEmpty": false,
      "requestDatatype": "JSON",
      "responseDatatype": "JSON",
      "headers": {},
      "responseObjects": [
        {
          "type": "default",
          "key": "",
          "mockFile": ""
        }
      ]
    }
  ]
}