{
  "actions": [
    {
      "name": "getSecurityEvents",
      "protocol": "REST",
      "method": "GET",
      "entitypath": "{base_path}/{version}/PasswordVault/API/pta/API/Events?{query}",
      "requestSchema": "schema.json",
      "responseSchema": "schema.json",
      "timeout": 0,
      "sendEmpty": false,
      "sendGetBody": false,
      "requestDatatype": "JSON",
      "responseDatatype": "JSON",
      "headers": {},
      "responseObjects": [
        {
          "type": "default",
          "key": "",
          "mockFile": ""
        }
      ]
    },
    {
      "name": "getSecuritySettings",
      "protocol": "REST",
      "method": "GET",
      "entitypath": "{base_path}/{version}/PasswordVault/API/pta/API/Settings?{query}",
      "requestSchema": "schema.json",
      "responseSchema": "schema.json",
      "timeout": 0,
      "sendEmpty": false,
      "sendGetBody": false,
      "requestDatatype": "JSON",
      "responseDatatype": "JSON",
      "headers": {},
      "responseObjects": [
        {
          "type": "default",
          "key": "",
          "mockFile": ""
        }
      ]
    },
    {
      "name": "addRiskyCommandsRule",
      "protocol": "REST",
      "method": "POST",
      "entitypath": "{base_path}/{version}/PasswordVault/API/pta/API/Settings/RiskyActivity?{query}",
      "requestSchema": "schema.json",
      "responseSchema": "schema.json",
      "timeout": 0,
      "sendEmpty": false,
      "requestDatatype": "JSON",
      "responseDatatype": "JSON",
      "headers": {},
      "responseObjects": [
        {
          "type": "default",
          "key": "",
          "mockFile": ""
        }
      ]
    },
    {
      "name": "updateRiskyCommandsRule",
      "protocol": "REST",
      "method": "PUT",
      "entitypath": "{base_path}/{version}/PasswordVault/API/pta/API/Settings/RiskyActivity?{query}",
      "requestSchema": "schema.json",
      "responseSchema": "schema.json",
      "timeout": 0,
      "sendEmpty": false,
      "requestDatatype": "JSON",
      "responseDatatype": "JSON",
      "headers": {},
      "responseObjects": [
        {
          "type": "default",
          "key": "",
          "mockFile": ""
        }
      ]
    },
    {
      "name": "updateSecurityRemediationSettings",
      "protocol": "REST",
      "method": "PATCH",
      "entitypath": "{base_path}/{version}/PasswordVault/API/pta/API/Settings/AutomaticRemediations?{query}",
      "requestSchema": "schema.json",
      "responseSchema": "schema.json",
      "timeout": 0,
      "sendEmpty": false,
      "requestDatatype": "JSON",
      "responseDatatype": "JSON",
      "headers": {},
      "responseObjects": [
        {
          "type": "default",
          "key": "",
          "mockFile": ""
        }
      ]
    },
    {
      "name": "updateSecurityEvent",
      "protocol": "REST",
      "method": "PATCH",
      "entitypath": "{base_path}/{version}/PasswordVault/API/pta/API/Events/?{query}",
      "requestSchema": "schema.json",
      "responseSchema": "schema.json",
      "timeout": 0,
      "sendEmpty": false,
      "requestDatatype": "JSON",
      "responseDatatype": "JSON",
      "headers": {},
      "responseObjects": [
        {
          "type": "default",
          "key": "",
          "mockFile": ""
        }
      ]
    }
  ]
}