{
  "$id": "schema.json",
  "type": "object",
  "schema": "http://json-schema.org/draft-07/schema#",
  "translate": true,
  "dynamicfields": true,
  "properties": {
    "ph_request_type": {
      "type": "string",
      "description": "type of request (internal to adapter)",
      "default": "getPlatformDetails",
      "enum": [
        "getPlatformDetails",
        "getPlatforms",
        "exportPlatform",
        "importPlatform"
      ],
      "external_name": "ph_request_type"
    },
    "active": {
      "type": "boolean",
      "description": "Filter according to whether the platform is active or not. Valid values: true or false",
      "parse": false,
      "encode": false,
      "encrypt": {
        "type": "AES",
        "key": ""
      },
      "external_name": "Active"
    },
    "platformType": {
      "type": "string",
      "description": "Filter according to the platform type. Valid values: Group or Regular",
      "parse": false,
      "encode": false,
      "encrypt": {
        "type": "AES",
        "key": ""
      },
      "external_name": "PlatformType"
    },
    "platformName": {
      "type": "string",
      "description": "Searching according to the platform name.",
      "parse": false,
      "encode": false,
      "encrypt": {
        "type": "AES",
        "key": ""
      },
      "external_name": "PlatformName"
    },
    "body": {
      "type": "string",
      "description": "",
      "parse": false,
      "encode": false,
      "encrypt": {
        "type": "AES",
        "key": ""
      },
      "external_name": "Body"
    }
  },
  "definitions": {}
}