{
  "actions": [
    {
      "name": "getRotationalGroupPlatforms",
      "protocol": "REST",
      "method": "GET",
      "entitypath": "{base_path}/{version}/passwordvault/api/platforms/rotationalGroups?{query}",
      "requestSchema": "schema.json",
      "responseSchema": "schema.json",
      "timeout": 0,
      "sendEmpty": false,
      "sendGetBody": false,
      "requestDatatype": "JSON",
      "responseDatatype": "JSON",
      "headers": {},
      "responseObjects": [
        {
          "type": "default",
          "key": "",
          "mockFile": "mockdatafiles/getRotationalGroupPlatforms-default.json"
        }
      ]
    },
    {
      "name": "activateRotationalGroupPlatform",
      "protocol": "REST",
      "method": "POST",
      "entitypath": "{base_path}/{version}/passwordvault/api/platforms/rotationalGroups/activate?{query}",
      "requestSchema": "schema.json",
      "responseSchema": "schema.json",
      "timeout": 0,
      "sendEmpty": false,
      "requestDatatype": "JSON",
      "responseDatatype": "JSON",
      "headers": {},
      "responseObjects": [
        {
          "type": "default",
          "key": "",
          "mockFile": ""
        }
      ]
    },
    {
      "name": "deactivateRotationalGroupPlatform",
      "protocol": "REST",
      "method": "POST",
      "entitypath": "{base_path}/{version}/passwordvault/api/platforms/rotationalGroups/deactivate?{query}",
      "requestSchema": "schema.json",
      "responseSchema": "schema.json",
      "timeout": 0,
      "sendEmpty": false,
      "requestDatatype": "JSON",
      "responseDatatype": "JSON",
      "headers": {},
      "responseObjects": [
        {
          "type": "default",
          "key": "",
          "mockFile": ""
        }
      ]
    },
    {
      "name": "duplicateRotationalGroupPlatforms",
      "protocol": "REST",
      "method": "POST",
      "entitypath": "{base_path}/{version}/passwordvault/api/platforms/rotationalGroups/duplicate?{query}",
      "requestSchema": "schema.json",
      "responseSchema": "schema.json",
      "timeout": 0,
      "sendEmpty": false,
      "requestDatatype": "JSON",
      "responseDatatype": "JSON",
      "headers": {},
      "responseObjects": [
        {
          "type": "default",
          "key": "",
          "mockFile": ""
        }
      ]
    },
    {
      "name": "deleteRotationalGroupPlatform",
      "protocol": "REST",
      "method": "DELETE",
      "entitypath": "{base_path}/{version}/passwordvault/api/platforms/rotationalGroups/?{query}",
      "requestSchema": "schema.json",
      "responseSchema": "schema.json",
      "timeout": 0,
      "sendEmpty": false,
      "requestDatatype": "JSON",
      "responseDatatype": "JSON",
      "headers": {},
      "responseObjects": [
        {
          "type": "default",
          "key": "",
          "mockFile": ""
        }
      ]
    }
  ]
}