{
  "actions": [
    {
      "name": "getPublicSSHKey",
      "protocol": "REST",
      "method": "GET",
      "entitypath": "{base_path}/{version}/PasswordVault/WebServices/PIMServices.svc/Users/Svc_CybrAutomation/AuthenticationMethods/SSHKeyAuthentication/AuthorizedKeys?{query}",
      "requestSchema": "schema.json",
      "responseSchema": "schema.json",
      "timeout": 0,
      "sendEmpty": false,
      "sendGetBody": false,
      "requestDatatype": "JSON",
      "responseDatatype": "JSON",
      "headers": {},
      "responseObjects": [
        {
          "type": "default",
          "key": "",
          "mockFile": "mockdatafiles/getPublicSSHKey-default.json"
        }
      ]
    },
    {
      "name": "addaPublicSSHKey",
      "protocol": "REST",
      "method": "POST",
      "entitypath": "{base_path}/{version}/PasswordVault/WebServices/PIMServices.svc/Users/Svc_CybrAutomation/AuthenticationMethods/SSHKeyAuthentication/AuthorizedKeys?{query}",
      "requestSchema": "schema.json",
      "responseSchema": "schema.json",
      "timeout": 0,
      "sendEmpty": false,
      "requestDatatype": "JSON",
      "responseDatatype": "JSON",
      "headers": {},
      "responseObjects": [
        {
          "type": "default",
          "key": "",
          "mockFile": "mockdatafiles/addaPublicSSHKey-default.json"
        }
      ]
    },
    {
      "name": "deletePublicSSHKey",
      "protocol": "REST",
      "method": "DELETE",
      "entitypath": "{base_path}/{version}/PasswordVault/WebServices/PIMServices.svc/Users/Svc_CybrAutomation/AuthenticationMethods/SSHKeyAuthentication/AuthorizedKeys/?{query}",
      "requestSchema": "schema.json",
      "responseSchema": "schema.json",
      "timeout": 0,
      "sendEmpty": false,
      "requestDatatype": "JSON",
      "responseDatatype": "JSON",
      "headers": {},
      "responseObjects": [
        {
          "type": "default",
          "key": "",
          "mockFile": ""
        }
      ]
    }
  ]
}