{
  "Components": [
    {
      "ComponentID": "PVWA",
      "ComponentName": "PVWA",
      "Description": "Active Users",
      "ConnectedComponentCount": 1,
      "ComponentTotalCount": 1,
      "ComponentSpecificStat": 1
    },
    {
      "ComponentID": "PVWA",
      "ComponentName": "PVWA",
      "Description": "Active Users",
      "ConnectedComponentCount": 1,
      "ComponentTotalCount": 1,
      "ComponentSpecificStat": 1
    },
    {
      "ComponentID": "PVWA",
      "ComponentName": "PVWA",
      "Description": "Active Users",
      "ConnectedComponentCount": 1,
      "ComponentTotalCount": 1,
      "ComponentSpecificStat": 1
    },
    {
      "ComponentID": "PVWA",
      "ComponentName": "PVWA",
      "Description": "Active Users",
      "ConnectedComponentCount": 1,
      "ComponentTotalCount": 1,
      "ComponentSpecificStat": 1
    },
    {
      "ComponentID": "PVWA",
      "ComponentName": "PVWA",
      "Description": "Active Users",
      "ConnectedComponentCount": 1,
      "ComponentTotalCount": 1,
      "ComponentSpecificStat": 1
    },
    {
      "ComponentID": "PVWA",
      "ComponentName": "PVWA",
      "Description": "Active Users",
      "ConnectedComponentCount": 1,
      "ComponentTotalCount": 1,
      "ComponentSpecificStat": 1
    },
    {
      "ComponentID": "PVWA",
      "ComponentName": "PVWA",
      "Description": "Active Users",
      "ConnectedComponentCount": 1,
      "ComponentTotalCount": 1,
      "ComponentSpecificStat": 1
    },
    {
      "ComponentID": "PVWA",
      "ComponentName": "PVWA",
      "Description": "Active Users",
      "ConnectedComponentCount": 1,
      "ComponentTotalCount": 1,
      "ComponentSpecificStat": 1
    },
    {
      "ComponentID": "PVWA",
      "ComponentName": "PVWA",
      "Description": "Active Users",
      "ConnectedComponentCount": 1,
      "ComponentTotalCount": 1,
      "ComponentSpecificStat": 1
    },
    {
      "ComponentID": "PVWA",
      "ComponentName": "PVWA",
      "Description": "Active Users",
      "ConnectedComponentCount": 1,
      "ComponentTotalCount": 1,
      "ComponentSpecificStat": 1
    }
  ],
  "Vaults": [
    {
      "IP": "192.168.3.101",
      "Role": "Primary",
      "IsLoggedOn": true
    },
    {
      "IP": "192.168.3.101",
      "Role": "Primary",
      "IsLoggedOn": true
    },
    {
      "IP": "192.168.3.101",
      "Role": "Primary",
      "IsLoggedOn": true
    },
    {
      "IP": "192.168.3.101",
      "Role": "Primary",
      "IsLoggedOn": true
    }
  ]
}