{
  "$id": "schema.json",
  "type": "object",
  "schema": "http://json-schema.org/draft-07/schema#",
  "translate": true,
  "dynamicfields": true,
  "properties": {
    "ph_request_type": {
      "type": "string",
      "description": "type of request (internal to adapter)",
      "default": "baseUrlMobileDeleteDevice",
      "enum": [
        "baseUrlMobileDeleteDevice",
        "baseUrlMobileDisableSSO",
        "baseUrlMobileEnableSSO",
        "baseUrlMobileGetGlobalDevicePermissions",
        "baseUrlMobileKnoxResetContainerPassword",
        "baseUrlMobileLockClientApp",
        "baseUrlMobileLockDevice",
        "baseUrlMobilePingDevice",
        "baseUrlMobilePowerOff",
        "baseUrlMobileReapplyDevicePolicy",
        "baseUrlMobileReboot",
        "baseUrlMobileRemoveDeviceProfile",
        "baseUrlMobileResetClientAppLockPin",
        "baseUrlMobileSetDevicePermissions",
        "baseUrlMobileSetPrimaryDevice",
        "baseUrlMobileUnlockDevice",
        "baseUrlMobileUpdateDevicePolicy",
        "baseUrlMobileWipeDevice"
      ],
      "external_name": "ph_request_type"
    },
    "body": {
      "type": "object",
      "description": "",
      "parse": false,
      "encode": false,
      "encrypt": {
        "type": "AES",
        "key": ""
      },
      "external_name": "Body"
    }
  },
  "definitions": {}
}