{
  "GetSafesResult": [
    {
      "Description": null,
      "ManagingCPM": "PasswordManagerNG",
      "NumberOfDaysRetention": null,
      "NumberOfVersionsRetention": 0,
      "OLACEnabled": false,
      "SafeName": "AccountsFeedADAccounts"
    },
    {
      "Description": null,
      "ManagingCPM": "PasswordManagerNG",
      "NumberOfDaysRetention": null,
      "NumberOfVersionsRetention": 0,
      "OLACEnabled": false,
      "SafeName": "AccountsFeedADAccounts"
    },
    {
      "Description": null,
      "ManagingCPM": "PasswordManagerNG",
      "NumberOfDaysRetention": null,
      "NumberOfVersionsRetention": 0,
      "OLACEnabled": false,
      "SafeName": "AccountsFeedADAccounts"
    },
    {
      "Description": null,
      "ManagingCPM": "PasswordManagerNG",
      "NumberOfDaysRetention": null,
      "NumberOfVersionsRetention": 0,
      "OLACEnabled": false,
      "SafeName": "AccountsFeedADAccounts"
    },
    {
      "Description": null,
      "ManagingCPM": "PasswordManagerNG",
      "NumberOfDaysRetention": null,
      "NumberOfVersionsRetention": 0,
      "OLACEnabled": false,
      "SafeName": "AccountsFeedADAccounts"
    },
    {
      "Description": null,
      "ManagingCPM": "PasswordManagerNG",
      "NumberOfDaysRetention": null,
      "NumberOfVersionsRetention": 0,
      "OLACEnabled": false,
      "SafeName": "AccountsFeedADAccounts"
    },
    {
      "Description": null,
      "ManagingCPM": "PasswordManagerNG",
      "NumberOfDaysRetention": null,
      "NumberOfVersionsRetention": 0,
      "OLACEnabled": false,
      "SafeName": "AccountsFeedADAccounts"
    },
    {
      "Description": null,
      "ManagingCPM": "PasswordManagerNG",
      "NumberOfDaysRetention": null,
      "NumberOfVersionsRetention": 0,
      "OLACEnabled": false,
      "SafeName": "AccountsFeedADAccounts"
    },
    {
      "Description": null,
      "ManagingCPM": "PasswordManagerNG",
      "NumberOfDaysRetention": null,
      "NumberOfVersionsRetention": 0,
      "OLACEnabled": false,
      "SafeName": "AccountsFeedADAccounts"
    },
    {
      "Description": null,
      "ManagingCPM": "PasswordManagerNG",
      "NumberOfDaysRetention": null,
      "NumberOfVersionsRetention": 0,
      "OLACEnabled": false,
      "SafeName": "AccountsFeedADAccounts"
    }
  ]
}