{
  "$id": "schema.json",
  "type": "object",
  "schema": "http://json-schema.org/draft-07/schema#",
  "translate": true,
  "dynamicfields": true,
  "properties": {
    "ph_request_type": {
      "type": "string",
      "description": "type of request (internal to adapter)",
      "default": "getAccountDetailsV93",
      "enum": [
        "getAccountDetailsV93",
        "addAccountV90",
        "updateAccountDetailsV95",
        "deleteAccountV93",
        "getAccountValueV97910",
        "changeCredentialsandSetNextPasswordV10",
        "changeCredentialsintheVaultV10",
        "verifyCredentialsV97V995",
        "logon",
        "postLogoff",
        "getAllSafes1",
        "postAddSafe",
        "getSafeDetails1",
        "updateSafe",
        "getSafeMembers1",
        "updateSafeMember",
        "deleteSafeMember",
        "getUserDetails1",
        "putUpdateUser",
        "deleteUser1",
        "loggedOnUserDetails",
        "postAddUser",
        "putActivateUser",
        "postAddMembertoGroup"
      ],
      "external_name": "ph_request_type"
    },
    "keywords": {
      "type": "string",
      "description": "",
      "parse": false,
      "encode": false,
      "encrypt": {
        "type": "AES",
        "key": ""
      },
      "external_name": "Keywords"
    },
    "safe": {
      "type": "string",
      "description": "",
      "parse": false,
      "encode": false,
      "encrypt": {
        "type": "AES",
        "key": ""
      },
      "external_name": "Safe"
    },
    "body": {
      "type": "object",
      "description": "",
      "parse": false,
      "encode": false,
      "encrypt": {
        "type": "AES",
        "key": ""
      },
      "external_name": "Body"
    }
  },
  "definitions": {}
}