{
  "UpdateSafeResult": {
    "Description": "Production, Windows, Local Administrators",
    "ManagingCPM": "PasswordManagerNG",
    "NumberOfDaysRetention": null,
    "NumberOfVersionsRetention": 5,
    "OLACEnabled": false,
    "SafeName": "P-WIN-LOCAL-ADMIN"
  }
}