{
  "Users": [
    {
      "id": 29,
      "username": "jgarcia",
      "source": "LDAP",
      "userType": "EPVUser",
      "componentUser": false,
      "vaultAuthorization": [
        "AddUpdateUsers",
        "AddSafes",
        "AddNetworkAreas",
        "ManageServerFileCategories",
        "AuditUsers",
        "ResetUsersPasswords",
        "ActivateUsers"
      ],
      "location": "\\",
      "personalDetails": {
        "firstName": "Joe",
        "middleName": "",
        "lastName": "Garcia"
      }
    },
    {
      "id": 29,
      "username": "jgarcia",
      "source": "LDAP",
      "userType": "EPVUser",
      "componentUser": false,
      "vaultAuthorization": [
        "AddUpdateUsers",
        "AddSafes",
        "AddNetworkAreas",
        "ManageServerFileCategories",
        "AuditUsers",
        "ResetUsersPasswords",
        "ActivateUsers"
      ],
      "location": "\\",
      "personalDetails": {
        "firstName": "Joe",
        "middleName": "",
        "lastName": "Garcia"
      }
    },
    {
      "id": 29,
      "username": "jgarcia",
      "source": "LDAP",
      "userType": "EPVUser",
      "componentUser": false,
      "vaultAuthorization": [
        "AddUpdateUsers",
        "AddSafes",
        "AddNetworkAreas",
        "ManageServerFileCategories",
        "AuditUsers",
        "ResetUsersPasswords",
        "ActivateUsers"
      ],
      "location": "\\",
      "personalDetails": {
        "firstName": "Joe",
        "middleName": "",
        "lastName": "Garcia"
      }
    },
    {
      "id": 29,
      "username": "jgarcia",
      "source": "LDAP",
      "userType": "EPVUser",
      "componentUser": false,
      "vaultAuthorization": [
        "AddUpdateUsers",
        "AddSafes",
        "AddNetworkAreas",
        "ManageServerFileCategories",
        "AuditUsers",
        "ResetUsersPasswords",
        "ActivateUsers"
      ],
      "location": "\\",
      "personalDetails": {
        "firstName": "Joe",
        "middleName": "",
        "lastName": "Garcia"
      }
    },
    {
      "id": 29,
      "username": "jgarcia",
      "source": "LDAP",
      "userType": "EPVUser",
      "componentUser": false,
      "vaultAuthorization": [
        "AddUpdateUsers",
        "AddSafes",
        "AddNetworkAreas",
        "ManageServerFileCategories",
        "AuditUsers",
        "ResetUsersPasswords",
        "ActivateUsers"
      ],
      "location": "\\",
      "personalDetails": {
        "firstName": "Joe",
        "middleName": "",
        "lastName": "Garcia"
      }
    },
    {
      "id": 29,
      "username": "jgarcia",
      "source": "LDAP",
      "userType": "EPVUser",
      "componentUser": false,
      "vaultAuthorization": [
        "AddUpdateUsers",
        "AddSafes",
        "AddNetworkAreas",
        "ManageServerFileCategories",
        "AuditUsers",
        "ResetUsersPasswords",
        "ActivateUsers"
      ],
      "location": "\\",
      "personalDetails": {
        "firstName": "Joe",
        "middleName": "",
        "lastName": "Garcia"
      }
    }
  ],
  "Total": 1
}