{
  "$id": "schema.json",
  "type": "object",
  "schema": "http://json-schema.org/draft-07/schema#",
  "translate": true,
  "dynamicfields": true,
  "properties": {
    "ph_request_type": {
      "type": "string",
      "description": "type of request (internal to adapter)",
      "default": "baseUrlSocialAuthFacebookAuthCallback",
      "enum": [
        "baseUrlSocialAuthFacebookAuthCallback",
        "baseUrlSocialAuthGoogleAuthCallback",
        "baseUrlSocialAuthLinkedInAuthCallback",
        "baseUrlSocialAuthMicrosoftActAuthCallback",
        "baseUrlSocialAuthTwitterAuthCallback"
      ],
      "external_name": "ph_request_type"
    },
    "oauthToken": {
      "type": "string",
      "description": "(Required) Not used.",
      "parse": false,
      "encode": false,
      "encrypt": {
        "type": "AES",
        "key": ""
      },
      "external_name": "oauth_token"
    },
    "oauthVerifier": {
      "type": "string",
      "description": "(Required) Not used.",
      "parse": false,
      "encode": false,
      "encrypt": {
        "type": "AES",
        "key": ""
      },
      "external_name": "oauth_verifier"
    }
  },
  "definitions": {}
}