{
  "$id": "schema.json",
  "type": "object",
  "schema": "http://json-schema.org/draft-07/schema#",
  "translate": true,
  "dynamicfields": true,
  "properties": {
    "ph_request_type": {
      "type": "string",
      "description": "type of request (internal to adapter)",
      "default": "baseUrlCDirectoryServiceBulkDeleteUsers",
      "enum": [
        "baseUrlCDirectoryServiceBulkDeleteUsers",
        "baseUrlCDirectoryServiceChangeUser",
        "baseUrlCDirectoryServiceCreateUser",
        "baseUrlCDirectoryServiceCreateUserBulk",
        "baseUrlCDirectoryServiceCreateUserQuick",
        "baseUrlCDirectoryServiceCreateUsers",
        "baseUrlCDirectoryServiceDelete",
        "baseUrlCDirectoryServiceDeleteUser",
        "baseUrlCDirectoryServiceExemptUserFromMfa",
        "baseUrlCDirectoryServiceGetBulkImportWithExtAtt",
        "baseUrlCDirectoryServiceGetTechSupportUser",
        "baseUrlCDirectoryServiceGetUser",
        "baseUrlCDirectoryServiceGetUserAttributes",
        "baseUrlCDirectoryServiceGetUserByName",
        "baseUrlCDirectoryServiceGetUsers",
        "baseUrlCDirectoryServiceGetUsersFromCsvFile",
        "baseUrlCDirectoryServiceGrantAccess",
        "baseUrlCDirectoryServiceRefreshToken",
        "baseUrlCDirectoryServiceRemoveAuthSource",
        "baseUrlCDirectoryServiceRemoveFederationAuthSource",
        "baseUrlCDirectoryServiceSetUserPicture",
        "baseUrlCDirectoryServiceSetUserState",
        "baseUrlCDirectoryServiceStandardJsonResultWithPermissionCheck",
        "baseUrlCDirectoryServiceSubmitUploadedFile"
      ],
      "external_name": "ph_request_type"
    },
    "body": {
      "type": "object",
      "description": "",
      "parse": false,
      "encode": false,
      "encrypt": {
        "type": "AES",
        "key": ""
      },
      "external_name": "Body"
    },
    "iD": {
      "type": "string",
      "description": "(Required) User UUID",
      "parse": false,
      "encode": false,
      "encrypt": {
        "type": "AES",
        "key": ""
      },
      "external_name": "ID"
    }
  },
  "definitions": {}
}