{
  "actions": [
    {
      "name": "baseUrlServerManageAddAccount",
      "protocol": "REST",
      "method": "POST",
      "entitypath": "{base_path}/{version}/ServerManage/AddAccount?{query}",
      "requestSchema": "schema.json",
      "responseSchema": "schema.json",
      "timeout": 0,
      "sendEmpty": false,
      "requestDatatype": "JSON",
      "responseDatatype": "JSON",
      "headers": {},
      "responseObjects": [
        {
          "type": "default",
          "key": "",
          "mockFile": ""
        }
      ]
    },
    {
      "name": "baseUrlServerManageCheckinPassword",
      "protocol": "REST",
      "method": "POST",
      "entitypath": "{base_path}/{version}/ServerManage/CheckinPassword?{query}",
      "requestSchema": "schema.json",
      "responseSchema": "schema.json",
      "timeout": 0,
      "sendEmpty": false,
      "requestDatatype": "JSON",
      "responseDatatype": "JSON",
      "headers": {},
      "responseObjects": [
        {
          "type": "default",
          "key": "",
          "mockFile": ""
        }
      ]
    },
    {
      "name": "baseUrlServerManageCheckoutPassword",
      "protocol": "REST",
      "method": "POST",
      "entitypath": "{base_path}/{version}/ServerManage/CheckoutPassword?{query}",
      "requestSchema": "schema.json",
      "responseSchema": "schema.json",
      "timeout": 0,
      "sendEmpty": false,
      "requestDatatype": "JSON",
      "responseDatatype": "JSON",
      "headers": {},
      "responseObjects": [
        {
          "type": "default",
          "key": "",
          "mockFile": ""
        }
      ]
    },
    {
      "name": "baseUrlServerManageDeleteAccount",
      "protocol": "REST",
      "method": "POST",
      "entitypath": "{base_path}/{version}/ServerManage/DeleteAccount?{query}",
      "requestSchema": "schema.json",
      "responseSchema": "schema.json",
      "timeout": 0,
      "sendEmpty": false,
      "requestDatatype": "JSON",
      "responseDatatype": "JSON",
      "headers": {},
      "responseObjects": [
        {
          "type": "default",
          "key": "",
          "mockFile": ""
        }
      ]
    },
    {
      "name": "baseUrlServerManageExtendCheckout",
      "protocol": "REST",
      "method": "POST",
      "entitypath": "{base_path}/{version}/ServerManage/ExtendCheckout?{query}",
      "requestSchema": "schema.json",
      "responseSchema": "schema.json",
      "timeout": 0,
      "sendEmpty": false,
      "requestDatatype": "JSON",
      "responseDatatype": "JSON",
      "headers": {},
      "responseObjects": [
        {
          "type": "default",
          "key": "",
          "mockFile": ""
        }
      ]
    },
    {
      "name": "baseUrlServerManageGetAccountPermissions",
      "protocol": "REST",
      "method": "POST",
      "entitypath": "{base_path}/{version}/ServerManage/GetAccountPermissions?{query}",
      "requestSchema": "schema.json",
      "responseSchema": "schema.json",
      "timeout": 0,
      "sendEmpty": false,
      "requestDatatype": "JSON",
      "responseDatatype": "JSON",
      "headers": {},
      "responseObjects": [
        {
          "type": "default",
          "key": "",
          "mockFile": ""
        }
      ]
    },
    {
      "name": "baseUrlServerManageGetRetiredPassword",
      "protocol": "REST",
      "method": "POST",
      "entitypath": "{base_path}/{version}/ServerManage/GetRetiredPassword?{query}",
      "requestSchema": "schema.json",
      "responseSchema": "schema.json",
      "timeout": 0,
      "sendEmpty": false,
      "requestDatatype": "JSON",
      "responseDatatype": "JSON",
      "headers": {},
      "responseObjects": [
        {
          "type": "default",
          "key": "",
          "mockFile": ""
        }
      ]
    },
    {
      "name": "baseUrlServerManagePreCheckout",
      "protocol": "REST",
      "method": "POST",
      "entitypath": "{base_path}/{version}/ServerManage/PreCheckout?{query}",
      "requestSchema": "schema.json",
      "responseSchema": "schema.json",
      "timeout": 0,
      "sendEmpty": false,
      "requestDatatype": "JSON",
      "responseDatatype": "JSON",
      "headers": {},
      "responseObjects": [
        {
          "type": "default",
          "key": "",
          "mockFile": ""
        }
      ]
    },
    {
      "name": "baseUrlServerManageSetAccountPermissions",
      "protocol": "REST",
      "method": "POST",
      "entitypath": "{base_path}/{version}/ServerManage/SetAccountPermissions?{query}",
      "requestSchema": "schema.json",
      "responseSchema": "schema.json",
      "timeout": 0,
      "sendEmpty": false,
      "requestDatatype": "JSON",
      "responseDatatype": "JSON",
      "headers": {},
      "responseObjects": [
        {
          "type": "default",
          "key": "",
          "mockFile": ""
        }
      ]
    },
    {
      "name": "baseUrlServerManageSetDomainPermissions",
      "protocol": "REST",
      "method": "POST",
      "entitypath": "{base_path}/{version}/ServerManage/SetDomainPermissions?{query}",
      "requestSchema": "schema.json",
      "responseSchema": "schema.json",
      "timeout": 0,
      "sendEmpty": false,
      "requestDatatype": "JSON",
      "responseDatatype": "JSON",
      "headers": {},
      "responseObjects": [
        {
          "type": "default",
          "key": "",
          "mockFile": ""
        }
      ]
    },
    {
      "name": "baseUrlServerManageUpdateAccount",
      "protocol": "REST",
      "method": "POST",
      "entitypath": "{base_path}/{version}/ServerManage/UpdateAccount?{query}",
      "requestSchema": "schema.json",
      "responseSchema": "schema.json",
      "timeout": 0,
      "sendEmpty": false,
      "requestDatatype": "JSON",
      "responseDatatype": "JSON",
      "headers": {},
      "responseObjects": [
        {
          "type": "default",
          "key": "",
          "mockFile": ""
        }
      ]
    },
    {
      "name": "baseUrlServerManageUpdatePassword",
      "protocol": "REST",
      "method": "POST",
      "entitypath": "{base_path}/{version}/ServerManage/UpdatePassword?{query}",
      "requestSchema": "schema.json",
      "responseSchema": "schema.json",
      "timeout": 0,
      "sendEmpty": false,
      "requestDatatype": "JSON",
      "responseDatatype": "JSON",
      "headers": {},
      "responseObjects": [
        {
          "type": "default",
          "key": "",
          "mockFile": ""
        }
      ]
    }
  ]
}