{
  "name": "adapter-cyberark",
  "webName": "Adapter for Integration to CyberArk",
  "supportLevel": "community",
  "vendor": "CyberArk",
  "product": "CyberArk",
  "techAlliance": false,
  "osVersion": [],
  "apiVersions": [],
  "iapVersions": [
    "2021.1.x",
    "2021.2.x",
    "2022.1.x",
    "2023.1.x"
  ],
  "method": "REST",
  "type": "Adapter",
  "domains": [
    "Security (SASE)"
  ],
  "tags": [
    "Security Policy Management",
    "Configuration & Compliance",
    "Network Infrastructure Changes",
    "Software Upgrades & Device Maintenance"
  ],
  "useCases": [
    "Security Group updates",
    "Security Rule Removal",
    "Security Rule Creation",
    "Run network compliance checks and remediation",
    "Determine configuration drift",
    "Device Onboarding",
    "Software Upgrade",
    "Firewall Configuration backup or restore"
  ],
  "deprecated": {
    "isDeprecated": false
  },
  "brokerSince": "",
  "authMethods": [
    {
      "type": "Basic Auth",
      "primary": true
    },
    {
      "type": "API Key",
      "primary": true
    },
    {
      "type": "Token",
      "primary": true
    }
  ],
  "documentation": {
    "storeLink": "",
    "npmLink": "https://www.npmjs.com/package/@itentialopensource/adapter-cyberark",
    "repoLink": "https://gitlab.com/itentialopensource/adapters/adapter-cyberark",
    "docLink": "https://gitlab.com/itentialopensource/adapters/adapter-cyberark/-/blob/master/README.md?ref_type=heads",
    "demoLinks": [],
    "trainingLinks": [
      {
        "title": "Itential Academy",
        "link": "https://www.itential.com/itential-academy/"
      }
    ],
    "faqLink": "https://docs.itential.com/opensource/docs/troubleshooting-an-adapter",
    "contributeLink": "https://gitlab.com/itentialopensource/adapters/contributing-guide",
    "issueLink": "https://itential.atlassian.net/servicedesk/customer/portals",
    "webLink": "https://www.itential.com/adapters/cyberark-access-management/",
    "vendorLink": "https://www.cyberark.com/",
    "productLink": "https://www.cyberark.com/products/",
    "apiLinks": [
      {
        "title": "CyberArk REST API",
        "link": "https://docs.cyberark.com/conjur-enterprise/latest/en/Content/Developer/lp_REST_API.htm?tocpath=Developer%7CREST%C2%A0APIs%7C_____0",
        "public": true
      }
    ],
    "workshopLinks": [],
    "workshopHomePage": "https://www.itential.com/get-started/"
  },
  "assets": [],
  "relatedItems": {
    "adapters": [],
    "integrations": [],
    "ecosystemApplications": [],
    "workflowProjects": [],
    "transformationProjects": [],
    "exampleProjects": []
  }
}