{
  "actions": [
    {
      "name": "baseUrlOAuth2Authorize",
      "protocol": "REST",
      "method": "POST",
      "entitypath": "{base_path}/{version}/OAuth2/Authorize?{query}",
      "requestSchema": "schema.json",
      "responseSchema": "schema.json",
      "timeout": 0,
      "sendEmpty": false,
      "requestDatatype": "JSON",
      "responseDatatype": "JSON",
      "headers": {},
      "responseObjects": [
        {
          "type": "default",
          "key": "",
          "mockFile": ""
        }
      ]
    },
    {
      "name": "baseUrlOAuth2Confirm",
      "protocol": "REST",
      "method": "POST",
      "entitypath": "{base_path}/{version}/OAuth2/Confirm?{query}",
      "requestSchema": "schema.json",
      "responseSchema": "schema.json",
      "timeout": 0,
      "sendEmpty": false,
      "requestDatatype": "JSON",
      "responseDatatype": "JSON",
      "headers": {},
      "responseObjects": [
        {
          "type": "default",
          "key": "",
          "mockFile": ""
        }
      ]
    },
    {
      "name": "baseUrlOAuth2EndSession",
      "protocol": "REST",
      "method": "POST",
      "entitypath": "{base_path}/{version}/OAuth2/EndSession?{query}",
      "requestSchema": "schema.json",
      "responseSchema": "schema.json",
      "timeout": 0,
      "sendEmpty": false,
      "requestDatatype": "JSON",
      "responseDatatype": "JSON",
      "headers": {},
      "responseObjects": [
        {
          "type": "default",
          "key": "",
          "mockFile": ""
        }
      ]
    },
    {
      "name": "baseUrlOAuth2GetMeta",
      "protocol": "REST",
      "method": "POST",
      "entitypath": "{base_path}/{version}/OAuth2/GetMeta?{query}",
      "requestSchema": "schema.json",
      "responseSchema": "schema.json",
      "timeout": 0,
      "sendEmpty": false,
      "requestDatatype": "JSON",
      "responseDatatype": "JSON",
      "headers": {},
      "responseObjects": [
        {
          "type": "default",
          "key": "",
          "mockFile": ""
        }
      ]
    },
    {
      "name": "baseUrlOAuth2Introspect",
      "protocol": "REST",
      "method": "POST",
      "entitypath": "{base_path}/{version}/OAuth2/Introspect?{query}",
      "requestSchema": "schema.json",
      "responseSchema": "schema.json",
      "timeout": 0,
      "sendEmpty": false,
      "requestDatatype": "JSON",
      "responseDatatype": "JSON",
      "headers": {},
      "responseObjects": [
        {
          "type": "default",
          "key": "",
          "mockFile": ""
        }
      ]
    },
    {
      "name": "baseUrlOAuth2Keys",
      "protocol": "REST",
      "method": "POST",
      "entitypath": "{base_path}/{version}/OAuth2/Keys?{query}",
      "requestSchema": "schema.json",
      "responseSchema": "schema.json",
      "timeout": 0,
      "sendEmpty": false,
      "requestDatatype": "JSON",
      "responseDatatype": "JSON",
      "headers": {},
      "responseObjects": [
        {
          "type": "default",
          "key": "",
          "mockFile": ""
        }
      ]
    },
    {
      "name": "baseUrlOAuth2Revoke",
      "protocol": "REST",
      "method": "POST",
      "entitypath": "{base_path}/{version}/OAuth2/Revoke?{query}",
      "requestSchema": "schema.json",
      "responseSchema": "schema.json",
      "timeout": 0,
      "sendEmpty": false,
      "requestDatatype": "JSON",
      "responseDatatype": "JSON",
      "headers": {},
      "responseObjects": [
        {
          "type": "default",
          "key": "",
          "mockFile": ""
        }
      ]
    },
    {
      "name": "baseUrlOAuth2Token",
      "protocol": "REST",
      "method": "POST",
      "entitypath": "{base_path}/{version}/OAuth2/Token?{query}",
      "requestSchema": "schema.json",
      "responseSchema": "schema.json",
      "timeout": 0,
      "sendEmpty": false,
      "requestDatatype": "JSON",
      "responseDatatype": "JSON",
      "headers": {},
      "responseObjects": [
        {
          "type": "default",
          "key": "",
          "mockFile": ""
        }
      ]
    },
    {
      "name": "baseUrlOAuth2UserInfo",
      "protocol": "REST",
      "method": "POST",
      "entitypath": "{base_path}/{version}/OAuth2/UserInfo?{query}",
      "requestSchema": "schema.json",
      "responseSchema": "schema.json",
      "timeout": 0,
      "sendEmpty": false,
      "requestDatatype": "JSON",
      "responseDatatype": "JSON",
      "headers": {},
      "responseObjects": [
        {
          "type": "default",
          "key": "",
          "mockFile": ""
        }
      ]
    }
  ]
}