{
  "actions": [
    {
      "name": "inboxEventsintheLastDay",
      "protocol": "REST",
      "method": "GET",
      "entitypath": "{base_path}/{version}/EPM/API/Sets/Events/ApplicationEvents?{query}",
      "requestSchema": "schema.json",
      "responseSchema": "schema.json",
      "timeout": 0,
      "sendEmpty": false,
      "sendGetBody": false,
      "requestDatatype": "JSON",
      "responseDatatype": "JSON",
      "headers": {},
      "responseObjects": [
        {
          "type": "default",
          "key": "",
          "mockFile": ""
        }
      ]
    },
    {
      "name": "inboxFromSpecificDates",
      "protocol": "REST",
      "method": "GET",
      "entitypath": "{base_path}/{version}/Sets/Events/ApplicationEvents?{query}",
      "requestSchema": "schema.json",
      "responseSchema": "schema.json",
      "timeout": 0,
      "sendEmpty": false,
      "sendGetBody": false,
      "requestDatatype": "JSON",
      "responseDatatype": "JSON",
      "headers": {},
      "responseObjects": [
        {
          "type": "default",
          "key": "",
          "mockFile": ""
        }
      ]
    },
    {
      "name": "policyAuditFromDatePolicyName",
      "protocol": "REST",
      "method": "GET",
      "entitypath": "{base_path}/{version}/Sets/Events/PolicyAudit?{query}",
      "requestSchema": "schema.json",
      "responseSchema": "schema.json",
      "timeout": 0,
      "sendEmpty": false,
      "sendGetBody": false,
      "requestDatatype": "JSON",
      "responseDatatype": "JSON",
      "headers": {},
      "responseObjects": [
        {
          "type": "default",
          "key": "",
          "mockFile": ""
        }
      ]
    },
    {
      "name": "threatDetectionFromSpecificDates",
      "protocol": "REST",
      "method": "GET",
      "entitypath": "{base_path}/{version}/Sets/Events/ThreatDetection?{query}",
      "requestSchema": "schema.json",
      "responseSchema": "schema.json",
      "timeout": 0,
      "sendEmpty": false,
      "sendGetBody": false,
      "requestDatatype": "JSON",
      "responseDatatype": "JSON",
      "headers": {},
      "responseObjects": [
        {
          "type": "default",
          "key": "",
          "mockFile": ""
        }
      ]
    }
  ]
}