[
  {
    "created_at": "2019-09-25T16:38:16.426+00:00",
    "id": "cyberarkdemo:policy:root",
    "owner": "cyberarkdemo:user:admin",
    "permissions": [],
    "annotations": [],
    "policy_versions": [
      {
        "version": 1,
        "created_at": "2019-09-25T16:38:16.426+00:00",
        "policy_text": "- !policy\n  id: ec2_deploy\n",
        "policy_sha256": "074ae39f5be04db36ad2bb236c802963a4aa08d54501e941b99f8f2196bc2d62",
        "finished_at": "2019-09-25T16:38:16.559+00:00",
        "id": "cyberarkdemo:policy:root",
        "role": "cyberarkdemo:user:admin"
      }
    ]
  }
]