{
  "openapi": "3.0.2",
  "info": {
    "title": "Cisco ISE",
    "description": "Cisco ISE calls for network device.",
    "version": "1.0.0",
    "termsOfService": "http://swagger.io/terms/"
  },
  "servers": [
    {
      "url": "https://localhost:9060/ers"
    }
  ],
  "paths": {
    "/config/networkdevice": {
      "post": {
        "parameters": [],
        "requestBody": {
          "description": "Network Device Information",
          "required": true,
          "content": {
            "*/*": {
              "schema": {
                "type": "object"
              }
            }
          }
        },
        "tags": [
          "networkdevice"
        ],
        "operationId": "addNetworkDevice",
        "summary": "Add Network Device",
        "description": "Add a network device",
        "responses": {
          "200": {
            "description": "successful operation"
          },
          "400": {
            "description": "failed operation"
          }
        }
      },
      "put": {
        "parameters": [],
        "requestBody": {
          "description": "Network device object",
          "required": true,
          "content": {
            "*/*": {
              "schema": {
                "type": "object"
              }
            }
          }
        },
        "tags": [
          "networkdevice"
        ],
        "operationId": "updateNetworkDevice",
        "summary": "Update Network Device",
        "description": "Update a network device",
        "responses": {
          "200": {
            "description": "successful operation"
          },
          "400": {
            "description": "failed operation"
          }
        }
      },
      "get": {
        "parameters": [
          {
            "name": "filter",
            "in": "query",
            "description": "Network Device Filter",
            "schema": {
              "type": "string"
            }
          }
        ],
        "tags": [
          "networkdevice"
        ],
        "operationId": "searchNetworkDevice",
        "summary": "Search Network Devices",
        "description": "Search for a network device with a filter",
        "responses": {
          "200": {
            "description": "successful operation"
          },
          "400": {
            "description": "failed operation"
          }
        }
      }
    },
    "/config/networkdevice/{id}": {
      "delete": {
        "parameters": [
          {
            "name": "id",
            "in": "path",
            "description": "ID of network device",
            "required": true,
            "schema": {
              "type": "string"
            }
          }
        ],
        "tags": [
          "networkdevice"
        ],
        "operationId": "deleteNetworkDevice",
        "summary": "Delete Network Device",
        "description": "Delete a network device",
        "responses": {
          "200": {
            "description": "successful operation"
          },
          "400": {
            "description": "failed operation"
          }
        }
      },
      "get": {
        "parameters": [
          {
            "name": "id",
            "in": "path",
            "description": "Network Device ID",
            "schema": {
              "type": "string"
            },
            "required": true
          },
          {
            "name": "filter",
            "in": "query",
            "description": "Network Device Filter",
            "schema": {
              "type": "string"
            }
          }
        ],
        "tags": [
          "networkdevice"
        ],
        "operationId": "getNetworkDevice",
        "summary": "Get Network Device",
        "description": "Get network device with filter",
        "responses": {
          "200": {
            "description": "successful operation"
          },
          "400": {
            "description": "failed operation"
          }
        }
      }
    }
  },
  "externalDocs": {
    "description": "Find out more about the OpenAPI Initiative",
    "url": "https://www.openapis.org/"
  },
  "tags": [
    {
      "name": "networkdevice",
      "description": "Network Device Information"
    }
  ]
}