{
  "id": "string",
  "name": "string",
  "description": "string",
  "guestType": "string",
  "sponsorUserName": "string",
  "guestInfo": {
    "userName": "DS3ewdsa34wWE",
    "emailAddress": "email@some.uri.com",
    "phoneNumber": "3211239034",
    "password": "asdlkj324ew",
    "enabled": true,
    "smsServiceProvider": "GLobal Default"
  },
  "guestAccessInfo": {
    "validDays": 1,
    "fromDate": "string",
    "toDate": "string",
    "location": "string"
  },
  "portalId": "string",
  "customFields": {
    "another key": "string",
    "some key": "string"
  }
}