{
  "name": "adapter-cisco_ise_ers",
  "webName": "Adapter for Integration to Cisco ISE",
  "supportLevel": "community",
  "vendor": "Cisco Systems",
  "product": "ISE",
  "techAlliance": true,
  "osVersion": [],
  "apiVersions": [
    "v1"
  ],
  "iapVersions": [
    "2021.1.x",
    "2021.2.x",
    "2022.1.x",
    "2023.1.x"
  ],
  "method": "REST",
  "type": "Adapter",
  "domains": [
    "Security (SASE)"
  ],
  "tags": [
    "Security Policy Management",
    "Configuration & Compliance",
    "Network Infrastructure Changes",
    "Software Upgrades & Device Maintenance"
  ],
  "useCases": [
    "Security Group updates",
    "Security Rule Removal",
    "Security Rule Creation",
    "Run network compliance checks and remediation",
    "Determine configuration drift",
    "Device Onboarding",
    "Software Upgrade",
    "Firewall Configuration backup or restore"
  ],
  "deprecated": {
    "isDeprecated": false
  },
  "brokerSince": "0.6.5",
  "authMethods": [
    {
      "type": "Basic Auth",
      "primary": true
    }
  ],
  "documentation": {
    "storeLink": "",
    "npmLink": "https://www.npmjs.com/package/@itentialopensource/adapter-cisco_ise_ers",
    "repoLink": "https://gitlab.com/itentialopensource/adapters/adapter-cisco_ise_ers",
    "docLink": "https://gitlab.com/itentialopensource/adapters/adapter-cisco_ise_ers/-/blob/master/README.md?ref_type=heads",
    "demoLinks": [],
    "trainingLinks": [
      {
        "title": "Itential Academy",
        "link": "https://www.itential.com/itential-academy/"
      }
    ],
    "faqLink": "https://docs.itential.com/opensource/docs/troubleshooting-an-adapter",
    "contributeLink": "https://gitlab.com/itentialopensource/adapters/contributing-guide",
    "issueLink": "https://itential.atlassian.net/servicedesk/customer/portals",
    "webLink": "https://www.itential.com/adapters/cisco-identity-services-engine-ise-external-restful-services-ers/",
    "vendorLink": "https://www.cisco.com/",
    "productLink": "https://www.cisco.com/site/us/en/products/security/identity-services-engine/index.html",
    "apiLinks": [
      {
        "title": "Cisco ISE API Framework",
        "link": "https://developer.cisco.com/docs/identity-services-engine/latest/"
      }
    ],
    "workshopLinks": [],
    "workshopHomePage": "https://www.itential.com/get-started/"
  },
  "assets": [],
  "relatedItems": {
    "adapters": [],
    "integrations": [],
    "ecosystemApplications": [],
    "workflowProjects": [],
    "transformationProjects": [],
    "exampleProjects": []
  }
}