{
  "items": [
    {
      "version": "string",
      "name": "string",
      "updateFrequency": "FOUR_HOURS",
      "lastUpdate": "string",
      "id": "string",
      "type": "systemfeedobject",
      "links": {
        "self": "string"
      }
    },
    {
      "version": "string",
      "name": "string",
      "updateFrequency": "SIX_HOURS",
      "lastUpdate": "string",
      "id": "string",
      "type": "systemfeedobject",
      "links": {
        "self": "string"
      }
    },
    {
      "version": "string",
      "name": "string",
      "updateFrequency": "THIRTY_MINS",
      "lastUpdate": "string",
      "id": "string",
      "type": "systemfeedobject",
      "links": {
        "self": "string"
      }
    },
    {
      "version": "string",
      "name": "string",
      "updateFrequency": "EIGHT_HOURS",
      "lastUpdate": "string",
      "id": "string",
      "type": "systemfeedobject",
      "links": {
        "self": "string"
      }
    },
    {
      "version": "string",
      "name": "string",
      "updateFrequency": "TWO_HOURS",
      "lastUpdate": "string",
      "id": "string",
      "type": "systemfeedobject",
      "links": {
        "self": "string"
      }
    },
    {
      "version": "string",
      "name": "string",
      "updateFrequency": "FOUR_HOURS",
      "lastUpdate": "string",
      "id": "string",
      "type": "systemfeedobject",
      "links": {
        "self": "string"
      }
    },
    {
      "version": "string",
      "name": "string",
      "updateFrequency": "ONE_DAY",
      "lastUpdate": "string",
      "id": "string",
      "type": "systemfeedobject",
      "links": {
        "self": "string"
      }
    }
  ],
  "paging": {
    "prev": [
      "string",
      "string",
      "string",
      "string",
      "string",
      "string",
      "string",
      "string"
    ],
    "next": [
      "string",
      "string",
      "string",
      "string"
    ],
    "limit": 2,
    "offset": 8,
    "count": 10,
    "pages": 10
  }
}