{
  "actions": [
    {
      "name": "getNTPList",
      "protocol": "REST",
      "method": "GET",
      "entitypath": "{base_path}/{version}/devicesettings/default/ntp?{query}",
      "requestSchema": "schema.json",
      "responseSchema": "schema.json",
      "timeout": 0,
      "sendEmpty": false,
      "sendGetBody": false,
      "requestDatatype": "JSON",
      "responseDatatype": "JSON",
      "headers": {},
      "responseObjects": [
        {
          "type": "default",
          "key": "",
          "mockFile": "mockdatafiles/getNTPList-default.json"
        }
      ]
    },
    {
      "name": "getNTP",
      "protocol": "REST",
      "method": "GET",
      "entitypath": "{base_path}/{version}/devicesettings/default/ntp/{pathv1}?{query}",
      "requestSchema": "schema.json",
      "responseSchema": "schema.json",
      "timeout": 0,
      "sendEmpty": false,
      "sendGetBody": false,
      "requestDatatype": "JSON",
      "responseDatatype": "JSON",
      "headers": {},
      "responseObjects": [
        {
          "type": "default",
          "key": "",
          "mockFile": "mockdatafiles/getNTP-default.json"
        }
      ]
    },
    {
      "name": "editNTP",
      "protocol": "REST",
      "method": "PUT",
      "entitypath": "{base_path}/{version}/devicesettings/default/ntp/{pathv1}?{query}",
      "requestSchema": "schema.json",
      "responseSchema": "schema.json",
      "timeout": 0,
      "sendEmpty": false,
      "requestDatatype": "JSON",
      "responseDatatype": "JSON",
      "headers": {},
      "responseObjects": [
        {
          "type": "default",
          "key": "",
          "mockFile": "mockdatafiles/editNTP-default.json"
        }
      ]
    }
  ]
}