{
  "version": "string",
  "name": "string",
  "messagesCriteria": [
    {
      "messageStartId": 9,
      "messageEndId": 3,
      "type": "customlogginglistmessage"
    },
    {
      "messageStartId": 6,
      "messageEndId": 10,
      "type": "customlogginglistmessage"
    },
    {
      "messageStartId": 1,
      "messageEndId": 2,
      "type": "customlogginglistmessage"
    }
  ],
  "logClassCriteria": [
    {
      "severityLogLevel": "INFORMATIONAL",
      "className": "SSL_VPN_CLIENT",
      "type": "customlogginglistloglevel"
    },
    {
      "severityLogLevel": "INFORMATIONAL",
      "className": "VPN_CLIENT",
      "type": "customlogginglistloglevel"
    },
    {
      "severityLogLevel": "ALERT",
      "className": "OSPF_ROUTING",
      "type": "customlogginglistloglevel"
    },
    {
      "severityLogLevel": "EMERGENCY",
      "className": "IKE_AND_IPSEC",
      "type": "customlogginglistloglevel"
    },
    {
      "severityLogLevel": "ERROR",
      "className": "IP_ADDRESS_ASSIGNMENT",
      "type": "customlogginglistloglevel"
    },
    {
      "severityLogLevel": "INFORMATIONAL",
      "className": "INTRUSION_DETECTION_SYSTEM",
      "type": "customlogginglistloglevel"
    }
  ],
  "description": "string",
  "id": "string",
  "type": "customlogginglist",
  "links": {
    "self": "string"
  }
}