{
  "version": "string",
  "scheduleType": "MONTHLY",
  "user": "string",
  "forceOperation": true,
  "jobHistoryUuid": "string",
  "ipAddress": "string",
  "jobName": "string",
  "id": "string",
  "type": "scheduletroubleshoot",
  "links": {
    "self": "string"
  }
}