{
  "version": "string",
  "name": "string",
  "description": "string",
  "isSystemDefined": true,
  "icmpv4Type": "TIME_EXCEEDED",
  "icmpv4Code": "PROTOCOL_UNREACHABLE",
  "id": "string",
  "type": "icmpv4portobject",
  "links": {
    "self": "string"
  }
}