{
  "version": "string",
  "name": "string",
  "description": "string",
  "processId": "string",
  "logAdjacencyChanges": {
    "logType": "DETAILED",
    "type": "logadjacencychanges"
  },
  "processConfiguration": {
    "routerId": "string",
    "rfc1583Compatible": false,
    "ignoreLsaMospf": false,
    "administrativeDistance": {
      "interArea": 10,
      "intraArea": 1,
      "external": 2,
      "type": "administrativedistance"
    },
    "timers": {
      "lsaArrival": 1,
      "floodPacing": 4,
      "lsaGroup": 7,
      "retransmission": 10,
      "lsaThrottleTimer": {
        "initialDelay": 6,
        "minimumDelay": 4,
        "maximumDelay": 1,
        "type": "lsathrottletimer"
      },
      "spfThrottleTimer": {
        "initialDelay": 10,
        "minimumHoldTime": 6,
        "maximumWaitTime": 10,
        "type": "spfthrottletimer"
      },
      "type": "timers"
    },
    "defaultInformationOriginate": {
      "always": false,
      "routeMetric": {
        "metricValue": 6,
        "metricType": {},
        "type": "routemetric"
      },
      "routeMap": {
        "id": "string",
        "type": "string",
        "version": "string",
        "name": "string"
      },
      "type": "defaultinformationoriginate"
    },
    "nsfGracefulRestart": {
      "nsfMechanism": "BOTH",
      "ietfStrictLsaChecking": true,
      "type": "nsfgracefulrestart"
    },
    "type": "processconfiguration"
  },
  "areas": [
    {
      "areaId": "string",
      "areaNetworks": [
        {
          "ipv4Network": {
            "id": "string",
            "type": "string",
            "version": "string",
            "name": "string"
          },
          "tagInterface": {
            "id": "string",
            "type": "string",
            "version": "string",
            "name": "string"
          },
          "type": "areanetwork"
        },
        {
          "ipv4Network": {
            "id": "string",
            "type": "string",
            "version": "string",
            "name": "string"
          },
          "tagInterface": {
            "id": "string",
            "type": "string",
            "version": "string",
            "name": "string"
          },
          "type": "areanetwork"
        },
        {
          "ipv4Network": {
            "id": "string",
            "type": "string",
            "version": "string",
            "name": "string"
          },
          "tagInterface": {
            "id": "string",
            "type": "string",
            "version": "string",
            "name": "string"
          },
          "type": "areanetwork"
        },
        {
          "ipv4Network": {
            "id": "string",
            "type": "string",
            "version": "string",
            "name": "string"
          },
          "tagInterface": {
            "id": "string",
            "type": "string",
            "version": "string",
            "name": "string"
          },
          "type": "areanetwork"
        },
        {
          "ipv4Network": {
            "id": "string",
            "type": "string",
            "version": "string",
            "name": "string"
          },
          "tagInterface": {
            "id": "string",
            "type": "string",
            "version": "string",
            "name": "string"
          },
          "type": "areanetwork"
        },
        {
          "ipv4Network": {
            "id": "string",
            "type": "string",
            "version": "string",
            "name": "string"
          },
          "tagInterface": {
            "id": "string",
            "type": "string",
            "version": "string",
            "name": "string"
          },
          "type": "areanetwork"
        },
        {
          "ipv4Network": {
            "id": "string",
            "type": "string",
            "version": "string",
            "name": "string"
          },
          "tagInterface": {
            "id": "string",
            "type": "string",
            "version": "string",
            "name": "string"
          },
          "type": "areanetwork"
        },
        {
          "ipv4Network": {
            "id": "string",
            "type": "string",
            "version": "string",
            "name": "string"
          },
          "tagInterface": {
            "id": "string",
            "type": "string",
            "version": "string",
            "name": "string"
          },
          "type": "areanetwork"
        }
      ],
      "authentication": "NONE",
      "defaultCost": 7,
      "filterList": [
        {
          "prefixList": {
            "id": "string",
            "type": "string",
            "version": "string",
            "name": "string"
          },
          "filterDirection": "IN",
          "type": "prefixfilter"
        },
        {
          "prefixList": {
            "id": "string",
            "type": "string",
            "version": "string",
            "name": "string"
          },
          "filterDirection": "OUT",
          "type": "prefixfilter"
        },
        {
          "prefixList": {
            "id": "string",
            "type": "string",
            "version": "string",
            "name": "string"
          },
          "filterDirection": "OUT",
          "type": "prefixfilter"
        },
        {
          "prefixList": {
            "id": "string",
            "type": "string",
            "version": "string",
            "name": "string"
          },
          "filterDirection": "IN",
          "type": "prefixfilter"
        },
        {
          "prefixList": {
            "id": "string",
            "type": "string",
            "version": "string",
            "name": "string"
          },
          "filterDirection": "OUT",
          "type": "prefixfilter"
        },
        {
          "prefixList": {
            "id": "string",
            "type": "string",
            "version": "string",
            "name": "string"
          },
          "filterDirection": "OUT",
          "type": "prefixfilter"
        },
        {
          "prefixList": {
            "id": "string",
            "type": "string",
            "version": "string",
            "name": "string"
          },
          "filterDirection": "OUT",
          "type": "prefixfilter"
        },
        {
          "prefixList": {
            "id": "string",
            "type": "string",
            "version": "string",
            "name": "string"
          },
          "filterDirection": "OUT",
          "type": "prefixfilter"
        },
        {
          "prefixList": {
            "id": "string",
            "type": "string",
            "version": "string",
            "name": "string"
          },
          "filterDirection": "OUT",
          "type": "prefixfilter"
        }
      ],
      "areaType": {},
      "virtualLinks": [
        {
          "routerId": "string",
          "authentication": {},
          "helloInterval": 7,
          "deadInterval": 5,
          "retransmitInterval": 1,
          "transmitDelay": 2,
          "type": "virtuallink"
        },
        {
          "routerId": "string",
          "authentication": {},
          "helloInterval": 1,
          "deadInterval": 8,
          "retransmitInterval": 4,
          "transmitDelay": 9,
          "type": "virtuallink"
        }
      ],
      "areaRanges": [
        {
          "addressNetwork": {
            "id": "string",
            "type": "string",
            "version": "string",
            "name": "string"
          },
          "advertise": true,
          "type": "arearange"
        },
        {
          "addressNetwork": {
            "id": "string",
            "type": "string",
            "version": "string",
            "name": "string"
          },
          "advertise": true,
          "type": "arearange"
        },
        {
          "addressNetwork": {
            "id": "string",
            "type": "string",
            "version": "string",
            "name": "string"
          },
          "advertise": true,
          "type": "arearange"
        },
        {
          "addressNetwork": {
            "id": "string",
            "type": "string",
            "version": "string",
            "name": "string"
          },
          "advertise": false,
          "type": "arearange"
        }
      ],
      "type": "area"
    },
    {
      "areaId": "string",
      "areaNetworks": [
        {
          "ipv4Network": {
            "id": "string",
            "type": "string",
            "version": "string",
            "name": "string"
          },
          "tagInterface": {
            "id": "string",
            "type": "string",
            "version": "string",
            "name": "string"
          },
          "type": "areanetwork"
        },
        {
          "ipv4Network": {
            "id": "string",
            "type": "string",
            "version": "string",
            "name": "string"
          },
          "tagInterface": {
            "id": "string",
            "type": "string",
            "version": "string",
            "name": "string"
          },
          "type": "areanetwork"
        },
        {
          "ipv4Network": {
            "id": "string",
            "type": "string",
            "version": "string",
            "name": "string"
          },
          "tagInterface": {
            "id": "string",
            "type": "string",
            "version": "string",
            "name": "string"
          },
          "type": "areanetwork"
        },
        {
          "ipv4Network": {
            "id": "string",
            "type": "string",
            "version": "string",
            "name": "string"
          },
          "tagInterface": {
            "id": "string",
            "type": "string",
            "version": "string",
            "name": "string"
          },
          "type": "areanetwork"
        },
        {
          "ipv4Network": {
            "id": "string",
            "type": "string",
            "version": "string",
            "name": "string"
          },
          "tagInterface": {
            "id": "string",
            "type": "string",
            "version": "string",
            "name": "string"
          },
          "type": "areanetwork"
        },
        {
          "ipv4Network": {
            "id": "string",
            "type": "string",
            "version": "string",
            "name": "string"
          },
          "tagInterface": {
            "id": "string",
            "type": "string",
            "version": "string",
            "name": "string"
          },
          "type": "areanetwork"
        },
        {
          "ipv4Network": {
            "id": "string",
            "type": "string",
            "version": "string",
            "name": "string"
          },
          "tagInterface": {
            "id": "string",
            "type": "string",
            "version": "string",
            "name": "string"
          },
          "type": "areanetwork"
        },
        {
          "ipv4Network": {
            "id": "string",
            "type": "string",
            "version": "string",
            "name": "string"
          },
          "tagInterface": {
            "id": "string",
            "type": "string",
            "version": "string",
            "name": "string"
          },
          "type": "areanetwork"
        }
      ],
      "authentication": "MESSAGE_DIGEST",
      "defaultCost": 10,
      "filterList": [
        {
          "prefixList": {
            "id": "string",
            "type": "string",
            "version": "string",
            "name": "string"
          },
          "filterDirection": "OUT",
          "type": "prefixfilter"
        },
        {
          "prefixList": {
            "id": "string",
            "type": "string",
            "version": "string",
            "name": "string"
          },
          "filterDirection": "IN",
          "type": "prefixfilter"
        },
        {
          "prefixList": {
            "id": "string",
            "type": "string",
            "version": "string",
            "name": "string"
          },
          "filterDirection": "OUT",
          "type": "prefixfilter"
        }
      ],
      "areaType": {},
      "virtualLinks": [
        {
          "routerId": "string",
          "authentication": {},
          "helloInterval": 4,
          "deadInterval": 7,
          "retransmitInterval": 8,
          "transmitDelay": 10,
          "type": "virtuallink"
        },
        {
          "routerId": "string",
          "authentication": {},
          "helloInterval": 3,
          "deadInterval": 1,
          "retransmitInterval": 4,
          "transmitDelay": 3,
          "type": "virtuallink"
        },
        {
          "routerId": "string",
          "authentication": {},
          "helloInterval": 8,
          "deadInterval": 5,
          "retransmitInterval": 8,
          "transmitDelay": 9,
          "type": "virtuallink"
        },
        {
          "routerId": "string",
          "authentication": {},
          "helloInterval": 7,
          "deadInterval": 3,
          "retransmitInterval": 1,
          "transmitDelay": 3,
          "type": "virtuallink"
        },
        {
          "routerId": "string",
          "authentication": {},
          "helloInterval": 10,
          "deadInterval": 6,
          "retransmitInterval": 9,
          "transmitDelay": 3,
          "type": "virtuallink"
        }
      ],
      "areaRanges": [
        {
          "addressNetwork": {
            "id": "string",
            "type": "string",
            "version": "string",
            "name": "string"
          },
          "advertise": true,
          "type": "arearange"
        },
        {
          "addressNetwork": {
            "id": "string",
            "type": "string",
            "version": "string",
            "name": "string"
          },
          "advertise": false,
          "type": "arearange"
        }
      ],
      "type": "area"
    },
    {
      "areaId": "string",
      "areaNetworks": [
        {
          "ipv4Network": {
            "id": "string",
            "type": "string",
            "version": "string",
            "name": "string"
          },
          "tagInterface": {
            "id": "string",
            "type": "string",
            "version": "string",
            "name": "string"
          },
          "type": "areanetwork"
        },
        {
          "ipv4Network": {
            "id": "string",
            "type": "string",
            "version": "string",
            "name": "string"
          },
          "tagInterface": {
            "id": "string",
            "type": "string",
            "version": "string",
            "name": "string"
          },
          "type": "areanetwork"
        },
        {
          "ipv4Network": {
            "id": "string",
            "type": "string",
            "version": "string",
            "name": "string"
          },
          "tagInterface": {
            "id": "string",
            "type": "string",
            "version": "string",
            "name": "string"
          },
          "type": "areanetwork"
        },
        {
          "ipv4Network": {
            "id": "string",
            "type": "string",
            "version": "string",
            "name": "string"
          },
          "tagInterface": {
            "id": "string",
            "type": "string",
            "version": "string",
            "name": "string"
          },
          "type": "areanetwork"
        },
        {
          "ipv4Network": {
            "id": "string",
            "type": "string",
            "version": "string",
            "name": "string"
          },
          "tagInterface": {
            "id": "string",
            "type": "string",
            "version": "string",
            "name": "string"
          },
          "type": "areanetwork"
        },
        {
          "ipv4Network": {
            "id": "string",
            "type": "string",
            "version": "string",
            "name": "string"
          },
          "tagInterface": {
            "id": "string",
            "type": "string",
            "version": "string",
            "name": "string"
          },
          "type": "areanetwork"
        },
        {
          "ipv4Network": {
            "id": "string",
            "type": "string",
            "version": "string",
            "name": "string"
          },
          "tagInterface": {
            "id": "string",
            "type": "string",
            "version": "string",
            "name": "string"
          },
          "type": "areanetwork"
        }
      ],
      "authentication": "PASSWORD",
      "defaultCost": 4,
      "filterList": [
        {
          "prefixList": {
            "id": "string",
            "type": "string",
            "version": "string",
            "name": "string"
          },
          "filterDirection": "IN",
          "type": "prefixfilter"
        },
        {
          "prefixList": {
            "id": "string",
            "type": "string",
            "version": "string",
            "name": "string"
          },
          "filterDirection": "IN",
          "type": "prefixfilter"
        },
        {
          "prefixList": {
            "id": "string",
            "type": "string",
            "version": "string",
            "name": "string"
          },
          "filterDirection": "OUT",
          "type": "prefixfilter"
        },
        {
          "prefixList": {
            "id": "string",
            "type": "string",
            "version": "string",
            "name": "string"
          },
          "filterDirection": "IN",
          "type": "prefixfilter"
        },
        {
          "prefixList": {
            "id": "string",
            "type": "string",
            "version": "string",
            "name": "string"
          },
          "filterDirection": "IN",
          "type": "prefixfilter"
        }
      ],
      "areaType": {},
      "virtualLinks": [
        {
          "routerId": "string",
          "authentication": {},
          "helloInterval": 5,
          "deadInterval": 10,
          "retransmitInterval": 4,
          "transmitDelay": 5,
          "type": "virtuallink"
        },
        {
          "routerId": "string",
          "authentication": {},
          "helloInterval": 4,
          "deadInterval": 4,
          "retransmitInterval": 7,
          "transmitDelay": 10,
          "type": "virtuallink"
        },
        {
          "routerId": "string",
          "authentication": {},
          "helloInterval": 9,
          "deadInterval": 7,
          "retransmitInterval": 1,
          "transmitDelay": 8,
          "type": "virtuallink"
        }
      ],
      "areaRanges": [
        {
          "addressNetwork": {
            "id": "string",
            "type": "string",
            "version": "string",
            "name": "string"
          },
          "advertise": true,
          "type": "arearange"
        },
        {
          "addressNetwork": {
            "id": "string",
            "type": "string",
            "version": "string",
            "name": "string"
          },
          "advertise": false,
          "type": "arearange"
        },
        {
          "addressNetwork": {
            "id": "string",
            "type": "string",
            "version": "string",
            "name": "string"
          },
          "advertise": true,
          "type": "arearange"
        },
        {
          "addressNetwork": {
            "id": "string",
            "type": "string",
            "version": "string",
            "name": "string"
          },
          "advertise": true,
          "type": "arearange"
        },
        {
          "addressNetwork": {
            "id": "string",
            "type": "string",
            "version": "string",
            "name": "string"
          },
          "advertise": false,
          "type": "arearange"
        },
        {
          "addressNetwork": {
            "id": "string",
            "type": "string",
            "version": "string",
            "name": "string"
          },
          "advertise": false,
          "type": "arearange"
        },
        {
          "addressNetwork": {
            "id": "string",
            "type": "string",
            "version": "string",
            "name": "string"
          },
          "advertise": false,
          "type": "arearange"
        }
      ],
      "type": "area"
    },
    {
      "areaId": "string",
      "areaNetworks": [
        {
          "ipv4Network": {
            "id": "string",
            "type": "string",
            "version": "string",
            "name": "string"
          },
          "tagInterface": {
            "id": "string",
            "type": "string",
            "version": "string",
            "name": "string"
          },
          "type": "areanetwork"
        },
        {
          "ipv4Network": {
            "id": "string",
            "type": "string",
            "version": "string",
            "name": "string"
          },
          "tagInterface": {
            "id": "string",
            "type": "string",
            "version": "string",
            "name": "string"
          },
          "type": "areanetwork"
        },
        {
          "ipv4Network": {
            "id": "string",
            "type": "string",
            "version": "string",
            "name": "string"
          },
          "tagInterface": {
            "id": "string",
            "type": "string",
            "version": "string",
            "name": "string"
          },
          "type": "areanetwork"
        },
        {
          "ipv4Network": {
            "id": "string",
            "type": "string",
            "version": "string",
            "name": "string"
          },
          "tagInterface": {
            "id": "string",
            "type": "string",
            "version": "string",
            "name": "string"
          },
          "type": "areanetwork"
        },
        {
          "ipv4Network": {
            "id": "string",
            "type": "string",
            "version": "string",
            "name": "string"
          },
          "tagInterface": {
            "id": "string",
            "type": "string",
            "version": "string",
            "name": "string"
          },
          "type": "areanetwork"
        },
        {
          "ipv4Network": {
            "id": "string",
            "type": "string",
            "version": "string",
            "name": "string"
          },
          "tagInterface": {
            "id": "string",
            "type": "string",
            "version": "string",
            "name": "string"
          },
          "type": "areanetwork"
        },
        {
          "ipv4Network": {
            "id": "string",
            "type": "string",
            "version": "string",
            "name": "string"
          },
          "tagInterface": {
            "id": "string",
            "type": "string",
            "version": "string",
            "name": "string"
          },
          "type": "areanetwork"
        },
        {
          "ipv4Network": {
            "id": "string",
            "type": "string",
            "version": "string",
            "name": "string"
          },
          "tagInterface": {
            "id": "string",
            "type": "string",
            "version": "string",
            "name": "string"
          },
          "type": "areanetwork"
        },
        {
          "ipv4Network": {
            "id": "string",
            "type": "string",
            "version": "string",
            "name": "string"
          },
          "tagInterface": {
            "id": "string",
            "type": "string",
            "version": "string",
            "name": "string"
          },
          "type": "areanetwork"
        },
        {
          "ipv4Network": {
            "id": "string",
            "type": "string",
            "version": "string",
            "name": "string"
          },
          "tagInterface": {
            "id": "string",
            "type": "string",
            "version": "string",
            "name": "string"
          },
          "type": "areanetwork"
        }
      ],
      "authentication": "MESSAGE_DIGEST",
      "defaultCost": 10,
      "filterList": [
        {
          "prefixList": {
            "id": "string",
            "type": "string",
            "version": "string",
            "name": "string"
          },
          "filterDirection": "IN",
          "type": "prefixfilter"
        },
        {
          "prefixList": {
            "id": "string",
            "type": "string",
            "version": "string",
            "name": "string"
          },
          "filterDirection": "OUT",
          "type": "prefixfilter"
        },
        {
          "prefixList": {
            "id": "string",
            "type": "string",
            "version": "string",
            "name": "string"
          },
          "filterDirection": "IN",
          "type": "prefixfilter"
        }
      ],
      "areaType": {},
      "virtualLinks": [
        {
          "routerId": "string",
          "authentication": {},
          "helloInterval": 8,
          "deadInterval": 4,
          "retransmitInterval": 6,
          "transmitDelay": 7,
          "type": "virtuallink"
        },
        {
          "routerId": "string",
          "authentication": {},
          "helloInterval": 10,
          "deadInterval": 6,
          "retransmitInterval": 10,
          "transmitDelay": 5,
          "type": "virtuallink"
        },
        {
          "routerId": "string",
          "authentication": {},
          "helloInterval": 7,
          "deadInterval": 7,
          "retransmitInterval": 10,
          "transmitDelay": 6,
          "type": "virtuallink"
        },
        {
          "routerId": "string",
          "authentication": {},
          "helloInterval": 6,
          "deadInterval": 2,
          "retransmitInterval": 8,
          "transmitDelay": 7,
          "type": "virtuallink"
        },
        {
          "routerId": "string",
          "authentication": {},
          "helloInterval": 2,
          "deadInterval": 2,
          "retransmitInterval": 5,
          "transmitDelay": 7,
          "type": "virtuallink"
        }
      ],
      "areaRanges": [
        {
          "addressNetwork": {
            "id": "string",
            "type": "string",
            "version": "string",
            "name": "string"
          },
          "advertise": true,
          "type": "arearange"
        },
        {
          "addressNetwork": {
            "id": "string",
            "type": "string",
            "version": "string",
            "name": "string"
          },
          "advertise": true,
          "type": "arearange"
        },
        {
          "addressNetwork": {
            "id": "string",
            "type": "string",
            "version": "string",
            "name": "string"
          },
          "advertise": false,
          "type": "arearange"
        },
        {
          "addressNetwork": {
            "id": "string",
            "type": "string",
            "version": "string",
            "name": "string"
          },
          "advertise": false,
          "type": "arearange"
        },
        {
          "addressNetwork": {
            "id": "string",
            "type": "string",
            "version": "string",
            "name": "string"
          },
          "advertise": true,
          "type": "arearange"
        },
        {
          "addressNetwork": {
            "id": "string",
            "type": "string",
            "version": "string",
            "name": "string"
          },
          "advertise": false,
          "type": "arearange"
        },
        {
          "addressNetwork": {
            "id": "string",
            "type": "string",
            "version": "string",
            "name": "string"
          },
          "advertise": true,
          "type": "arearange"
        },
        {
          "addressNetwork": {
            "id": "string",
            "type": "string",
            "version": "string",
            "name": "string"
          },
          "advertise": true,
          "type": "arearange"
        },
        {
          "addressNetwork": {
            "id": "string",
            "type": "string",
            "version": "string",
            "name": "string"
          },
          "advertise": true,
          "type": "arearange"
        }
      ],
      "type": "area"
    },
    {
      "areaId": "string",
      "areaNetworks": [
        {
          "ipv4Network": {
            "id": "string",
            "type": "string",
            "version": "string",
            "name": "string"
          },
          "tagInterface": {
            "id": "string",
            "type": "string",
            "version": "string",
            "name": "string"
          },
          "type": "areanetwork"
        },
        {
          "ipv4Network": {
            "id": "string",
            "type": "string",
            "version": "string",
            "name": "string"
          },
          "tagInterface": {
            "id": "string",
            "type": "string",
            "version": "string",
            "name": "string"
          },
          "type": "areanetwork"
        },
        {
          "ipv4Network": {
            "id": "string",
            "type": "string",
            "version": "string",
            "name": "string"
          },
          "tagInterface": {
            "id": "string",
            "type": "string",
            "version": "string",
            "name": "string"
          },
          "type": "areanetwork"
        },
        {
          "ipv4Network": {
            "id": "string",
            "type": "string",
            "version": "string",
            "name": "string"
          },
          "tagInterface": {
            "id": "string",
            "type": "string",
            "version": "string",
            "name": "string"
          },
          "type": "areanetwork"
        },
        {
          "ipv4Network": {
            "id": "string",
            "type": "string",
            "version": "string",
            "name": "string"
          },
          "tagInterface": {
            "id": "string",
            "type": "string",
            "version": "string",
            "name": "string"
          },
          "type": "areanetwork"
        },
        {
          "ipv4Network": {
            "id": "string",
            "type": "string",
            "version": "string",
            "name": "string"
          },
          "tagInterface": {
            "id": "string",
            "type": "string",
            "version": "string",
            "name": "string"
          },
          "type": "areanetwork"
        },
        {
          "ipv4Network": {
            "id": "string",
            "type": "string",
            "version": "string",
            "name": "string"
          },
          "tagInterface": {
            "id": "string",
            "type": "string",
            "version": "string",
            "name": "string"
          },
          "type": "areanetwork"
        }
      ],
      "authentication": "PASSWORD",
      "defaultCost": 7,
      "filterList": [
        {
          "prefixList": {
            "id": "string",
            "type": "string",
            "version": "string",
            "name": "string"
          },
          "filterDirection": "IN",
          "type": "prefixfilter"
        },
        {
          "prefixList": {
            "id": "string",
            "type": "string",
            "version": "string",
            "name": "string"
          },
          "filterDirection": "IN",
          "type": "prefixfilter"
        }
      ],
      "areaType": {},
      "virtualLinks": [
        {
          "routerId": "string",
          "authentication": {},
          "helloInterval": 1,
          "deadInterval": 5,
          "retransmitInterval": 1,
          "transmitDelay": 10,
          "type": "virtuallink"
        }
      ],
      "areaRanges": [
        {
          "addressNetwork": {
            "id": "string",
            "type": "string",
            "version": "string",
            "name": "string"
          },
          "advertise": true,
          "type": "arearange"
        },
        {
          "addressNetwork": {
            "id": "string",
            "type": "string",
            "version": "string",
            "name": "string"
          },
          "advertise": true,
          "type": "arearange"
        },
        {
          "addressNetwork": {
            "id": "string",
            "type": "string",
            "version": "string",
            "name": "string"
          },
          "advertise": true,
          "type": "arearange"
        }
      ],
      "type": "area"
    },
    {
      "areaId": "string",
      "areaNetworks": [
        {
          "ipv4Network": {
            "id": "string",
            "type": "string",
            "version": "string",
            "name": "string"
          },
          "tagInterface": {
            "id": "string",
            "type": "string",
            "version": "string",
            "name": "string"
          },
          "type": "areanetwork"
        },
        {
          "ipv4Network": {
            "id": "string",
            "type": "string",
            "version": "string",
            "name": "string"
          },
          "tagInterface": {
            "id": "string",
            "type": "string",
            "version": "string",
            "name": "string"
          },
          "type": "areanetwork"
        },
        {
          "ipv4Network": {
            "id": "string",
            "type": "string",
            "version": "string",
            "name": "string"
          },
          "tagInterface": {
            "id": "string",
            "type": "string",
            "version": "string",
            "name": "string"
          },
          "type": "areanetwork"
        },
        {
          "ipv4Network": {
            "id": "string",
            "type": "string",
            "version": "string",
            "name": "string"
          },
          "tagInterface": {
            "id": "string",
            "type": "string",
            "version": "string",
            "name": "string"
          },
          "type": "areanetwork"
        },
        {
          "ipv4Network": {
            "id": "string",
            "type": "string",
            "version": "string",
            "name": "string"
          },
          "tagInterface": {
            "id": "string",
            "type": "string",
            "version": "string",
            "name": "string"
          },
          "type": "areanetwork"
        },
        {
          "ipv4Network": {
            "id": "string",
            "type": "string",
            "version": "string",
            "name": "string"
          },
          "tagInterface": {
            "id": "string",
            "type": "string",
            "version": "string",
            "name": "string"
          },
          "type": "areanetwork"
        },
        {
          "ipv4Network": {
            "id": "string",
            "type": "string",
            "version": "string",
            "name": "string"
          },
          "tagInterface": {
            "id": "string",
            "type": "string",
            "version": "string",
            "name": "string"
          },
          "type": "areanetwork"
        },
        {
          "ipv4Network": {
            "id": "string",
            "type": "string",
            "version": "string",
            "name": "string"
          },
          "tagInterface": {
            "id": "string",
            "type": "string",
            "version": "string",
            "name": "string"
          },
          "type": "areanetwork"
        }
      ],
      "authentication": "PASSWORD",
      "defaultCost": 9,
      "filterList": [
        {
          "prefixList": {
            "id": "string",
            "type": "string",
            "version": "string",
            "name": "string"
          },
          "filterDirection": "OUT",
          "type": "prefixfilter"
        },
        {
          "prefixList": {
            "id": "string",
            "type": "string",
            "version": "string",
            "name": "string"
          },
          "filterDirection": "OUT",
          "type": "prefixfilter"
        },
        {
          "prefixList": {
            "id": "string",
            "type": "string",
            "version": "string",
            "name": "string"
          },
          "filterDirection": "OUT",
          "type": "prefixfilter"
        },
        {
          "prefixList": {
            "id": "string",
            "type": "string",
            "version": "string",
            "name": "string"
          },
          "filterDirection": "IN",
          "type": "prefixfilter"
        },
        {
          "prefixList": {
            "id": "string",
            "type": "string",
            "version": "string",
            "name": "string"
          },
          "filterDirection": "OUT",
          "type": "prefixfilter"
        }
      ],
      "areaType": {},
      "virtualLinks": [
        {
          "routerId": "string",
          "authentication": {},
          "helloInterval": 4,
          "deadInterval": 2,
          "retransmitInterval": 6,
          "transmitDelay": 9,
          "type": "virtuallink"
        },
        {
          "routerId": "string",
          "authentication": {},
          "helloInterval": 7,
          "deadInterval": 10,
          "retransmitInterval": 9,
          "transmitDelay": 2,
          "type": "virtuallink"
        },
        {
          "routerId": "string",
          "authentication": {},
          "helloInterval": 9,
          "deadInterval": 5,
          "retransmitInterval": 5,
          "transmitDelay": 7,
          "type": "virtuallink"
        },
        {
          "routerId": "string",
          "authentication": {},
          "helloInterval": 10,
          "deadInterval": 5,
          "retransmitInterval": 5,
          "transmitDelay": 10,
          "type": "virtuallink"
        },
        {
          "routerId": "string",
          "authentication": {},
          "helloInterval": 4,
          "deadInterval": 4,
          "retransmitInterval": 7,
          "transmitDelay": 4,
          "type": "virtuallink"
        },
        {
          "routerId": "string",
          "authentication": {},
          "helloInterval": 7,
          "deadInterval": 7,
          "retransmitInterval": 9,
          "transmitDelay": 9,
          "type": "virtuallink"
        },
        {
          "routerId": "string",
          "authentication": {},
          "helloInterval": 1,
          "deadInterval": 4,
          "retransmitInterval": 3,
          "transmitDelay": 6,
          "type": "virtuallink"
        },
        {
          "routerId": "string",
          "authentication": {},
          "helloInterval": 8,
          "deadInterval": 8,
          "retransmitInterval": 1,
          "transmitDelay": 2,
          "type": "virtuallink"
        },
        {
          "routerId": "string",
          "authentication": {},
          "helloInterval": 3,
          "deadInterval": 3,
          "retransmitInterval": 6,
          "transmitDelay": 5,
          "type": "virtuallink"
        }
      ],
      "areaRanges": [
        {
          "addressNetwork": {
            "id": "string",
            "type": "string",
            "version": "string",
            "name": "string"
          },
          "advertise": true,
          "type": "arearange"
        },
        {
          "addressNetwork": {
            "id": "string",
            "type": "string",
            "version": "string",
            "name": "string"
          },
          "advertise": false,
          "type": "arearange"
        },
        {
          "addressNetwork": {
            "id": "string",
            "type": "string",
            "version": "string",
            "name": "string"
          },
          "advertise": true,
          "type": "arearange"
        },
        {
          "addressNetwork": {
            "id": "string",
            "type": "string",
            "version": "string",
            "name": "string"
          },
          "advertise": true,
          "type": "arearange"
        },
        {
          "addressNetwork": {
            "id": "string",
            "type": "string",
            "version": "string",
            "name": "string"
          },
          "advertise": false,
          "type": "arearange"
        },
        {
          "addressNetwork": {
            "id": "string",
            "type": "string",
            "version": "string",
            "name": "string"
          },
          "advertise": true,
          "type": "arearange"
        },
        {
          "addressNetwork": {
            "id": "string",
            "type": "string",
            "version": "string",
            "name": "string"
          },
          "advertise": true,
          "type": "arearange"
        },
        {
          "addressNetwork": {
            "id": "string",
            "type": "string",
            "version": "string",
            "name": "string"
          },
          "advertise": false,
          "type": "arearange"
        },
        {
          "addressNetwork": {
            "id": "string",
            "type": "string",
            "version": "string",
            "name": "string"
          },
          "advertise": false,
          "type": "arearange"
        },
        {
          "addressNetwork": {
            "id": "string",
            "type": "string",
            "version": "string",
            "name": "string"
          },
          "advertise": false,
          "type": "arearange"
        }
      ],
      "type": "area"
    }
  ],
  "neighbors": [
    {
      "ipAddress": "string",
      "neighborInterface": {
        "id": "string",
        "type": "string",
        "version": "string",
        "name": "string"
      },
      "type": "neighbor"
    },
    {
      "ipAddress": "string",
      "neighborInterface": {
        "id": "string",
        "type": "string",
        "version": "string",
        "name": "string"
      },
      "type": "neighbor"
    },
    {
      "ipAddress": "string",
      "neighborInterface": {
        "id": "string",
        "type": "string",
        "version": "string",
        "name": "string"
      },
      "type": "neighbor"
    },
    {
      "ipAddress": "string",
      "neighborInterface": {
        "id": "string",
        "type": "string",
        "version": "string",
        "name": "string"
      },
      "type": "neighbor"
    },
    {
      "ipAddress": "string",
      "neighborInterface": {
        "id": "string",
        "type": "string",
        "version": "string",
        "name": "string"
      },
      "type": "neighbor"
    },
    {
      "ipAddress": "string",
      "neighborInterface": {
        "id": "string",
        "type": "string",
        "version": "string",
        "name": "string"
      },
      "type": "neighbor"
    },
    {
      "ipAddress": "string",
      "neighborInterface": {
        "id": "string",
        "type": "string",
        "version": "string",
        "name": "string"
      },
      "type": "neighbor"
    },
    {
      "ipAddress": "string",
      "neighborInterface": {
        "id": "string",
        "type": "string",
        "version": "string",
        "name": "string"
      },
      "type": "neighbor"
    },
    {
      "ipAddress": "string",
      "neighborInterface": {
        "id": "string",
        "type": "string",
        "version": "string",
        "name": "string"
      },
      "type": "neighbor"
    },
    {
      "ipAddress": "string",
      "neighborInterface": {
        "id": "string",
        "type": "string",
        "version": "string",
        "name": "string"
      },
      "type": "neighbor"
    }
  ],
  "summaryAddresses": [
    {
      "summaryNetwork": {
        "id": "string",
        "type": "string",
        "version": "string",
        "name": "string"
      },
      "advertise": false,
      "tagNumber": 9,
      "type": "summaryaddress"
    },
    {
      "summaryNetwork": {
        "id": "string",
        "type": "string",
        "version": "string",
        "name": "string"
      },
      "advertise": false,
      "tagNumber": 10,
      "type": "summaryaddress"
    },
    {
      "summaryNetwork": {
        "id": "string",
        "type": "string",
        "version": "string",
        "name": "string"
      },
      "advertise": true,
      "tagNumber": 8,
      "type": "summaryaddress"
    },
    {
      "summaryNetwork": {
        "id": "string",
        "type": "string",
        "version": "string",
        "name": "string"
      },
      "advertise": false,
      "tagNumber": 2,
      "type": "summaryaddress"
    },
    {
      "summaryNetwork": {
        "id": "string",
        "type": "string",
        "version": "string",
        "name": "string"
      },
      "advertise": true,
      "tagNumber": 7,
      "type": "summaryaddress"
    }
  ],
  "filterRules": [
    {},
    {},
    {},
    {}
  ],
  "redistributeProtocols": [
    {},
    {},
    {},
    {},
    {},
    {},
    {}
  ],
  "id": "string",
  "type": "ospf",
  "links": {
    "self": "string"
  }
}