{
  "actions": [
    {
      "name": "getActiveDirectoryRealmList",
      "protocol": "REST",
      "method": "GET",
      "entitypath": "{base_path}/{version}/object/realms?{query}",
      "requestSchema": "schema.json",
      "responseSchema": "schema.json",
      "timeout": 0,
      "sendEmpty": false,
      "sendGetBody": false,
      "requestDatatype": "JSON",
      "responseDatatype": "JSON",
      "headers": {},
      "responseObjects": [
        {
          "type": "default",
          "key": "",
          "mockFile": "mockdatafiles/getActiveDirectoryRealmList-default.json"
        }
      ]
    },
    {
      "name": "addActiveDirectoryRealm",
      "protocol": "REST",
      "method": "POST",
      "entitypath": "{base_path}/{version}/object/realms?{query}",
      "requestSchema": "schema.json",
      "responseSchema": "schema.json",
      "timeout": 0,
      "sendEmpty": false,
      "requestDatatype": "JSON",
      "responseDatatype": "JSON",
      "headers": {},
      "responseObjects": [
        {
          "type": "default",
          "key": "",
          "mockFile": "mockdatafiles/addActiveDirectoryRealm-default.json"
        }
      ]
    },
    {
      "name": "getActiveDirectoryRealm",
      "protocol": "REST",
      "method": "GET",
      "entitypath": "{base_path}/{version}/object/realms/{pathv1}?{query}",
      "requestSchema": "schema.json",
      "responseSchema": "schema.json",
      "timeout": 0,
      "sendEmpty": false,
      "sendGetBody": false,
      "requestDatatype": "JSON",
      "responseDatatype": "JSON",
      "headers": {},
      "responseObjects": [
        {
          "type": "default",
          "key": "",
          "mockFile": "mockdatafiles/getActiveDirectoryRealm-default.json"
        }
      ]
    },
    {
      "name": "editActiveDirectoryRealm",
      "protocol": "REST",
      "method": "PUT",
      "entitypath": "{base_path}/{version}/object/realms/{pathv1}?{query}",
      "requestSchema": "schema.json",
      "responseSchema": "schema.json",
      "timeout": 0,
      "sendEmpty": false,
      "requestDatatype": "JSON",
      "responseDatatype": "JSON",
      "headers": {},
      "responseObjects": [
        {
          "type": "default",
          "key": "",
          "mockFile": "mockdatafiles/editActiveDirectoryRealm-default.json"
        }
      ]
    },
    {
      "name": "deleteActiveDirectoryRealm",
      "protocol": "REST",
      "method": "DELETE",
      "entitypath": "{base_path}/{version}/object/realms/{pathv1}?{query}",
      "requestSchema": "schema.json",
      "responseSchema": "schema.json",
      "timeout": 0,
      "sendEmpty": false,
      "requestDatatype": "JSON",
      "responseDatatype": "JSON",
      "headers": {},
      "responseObjects": [
        {
          "type": "default",
          "key": "",
          "mockFile": ""
        }
      ]
    }
  ]
}