{
  "version": "string",
  "name": "string",
  "description": "string",
  "asNumber": "string",
  "routerId": "string",
  "addressFamilyIPv4": {
    "distance": {
      "externalDistance": 9,
      "internalDistance": 2,
      "localDistance": 8,
      "type": "afbgpdistance"
    },
    "defaultInformationOrginate": false,
    "bgpSupressInactive": false,
    "synchronization": true,
    "bgpRedistributeInternal": true,
    "scanTime": 9,
    "aggregateTimer": 6,
    "maximumPaths": {
      "value": 1,
      "ibgpValue": 9,
      "type": "afmaximumpaths"
    },
    "redistributeProtocols": [
      {},
      {},
      {},
      {},
      {},
      {},
      {}
    ],
    "injectMaps": [
      {
        "injectMap": {
          "id": "string",
          "type": "string",
          "version": "string",
          "name": "string"
        },
        "existMap": {
          "id": "string",
          "type": "string",
          "version": "string",
          "name": "string"
        },
        "copyAttributes": true,
        "type": "afinjectmap"
      },
      {
        "injectMap": {
          "id": "string",
          "type": "string",
          "version": "string",
          "name": "string"
        },
        "existMap": {
          "id": "string",
          "type": "string",
          "version": "string",
          "name": "string"
        },
        "copyAttributes": false,
        "type": "afinjectmap"
      }
    ],
    "afTableMap": {
      "routeMap": {
        "id": "string",
        "type": "string",
        "version": "string",
        "name": "string"
      },
      "filter": true,
      "type": "aftablemap"
    },
    "autoSummary": true,
    "bgpNextHopTriggerDelay": 10,
    "bgpNextHopTriggerEnable": false,
    "aggregateAddressesIPv4s": [
      {
        "advertiseMap": {
          "id": "string",
          "type": "string",
          "version": "string",
          "name": "string"
        },
        "attributeMap": {
          "id": "string",
          "type": "string",
          "version": "string",
          "name": "string"
        },
        "suppressMap": {
          "id": "string",
          "type": "string",
          "version": "string",
          "name": "string"
        },
        "asSet": false,
        "summaryOnly": false,
        "ipv4AggregateNetwork": {
          "id": "string",
          "type": "string",
          "version": "string",
          "name": "string"
        },
        "type": "afaggregateaddressipv4"
      },
      {
        "advertiseMap": {
          "id": "string",
          "type": "string",
          "version": "string",
          "name": "string"
        },
        "attributeMap": {
          "id": "string",
          "type": "string",
          "version": "string",
          "name": "string"
        },
        "suppressMap": {
          "id": "string",
          "type": "string",
          "version": "string",
          "name": "string"
        },
        "asSet": true,
        "summaryOnly": false,
        "ipv4AggregateNetwork": {
          "id": "string",
          "type": "string",
          "version": "string",
          "name": "string"
        },
        "type": "afaggregateaddressipv4"
      },
      {
        "advertiseMap": {
          "id": "string",
          "type": "string",
          "version": "string",
          "name": "string"
        },
        "attributeMap": {
          "id": "string",
          "type": "string",
          "version": "string",
          "name": "string"
        },
        "suppressMap": {
          "id": "string",
          "type": "string",
          "version": "string",
          "name": "string"
        },
        "asSet": true,
        "summaryOnly": true,
        "ipv4AggregateNetwork": {
          "id": "string",
          "type": "string",
          "version": "string",
          "name": "string"
        },
        "type": "afaggregateaddressipv4"
      },
      {
        "advertiseMap": {
          "id": "string",
          "type": "string",
          "version": "string",
          "name": "string"
        },
        "attributeMap": {
          "id": "string",
          "type": "string",
          "version": "string",
          "name": "string"
        },
        "suppressMap": {
          "id": "string",
          "type": "string",
          "version": "string",
          "name": "string"
        },
        "asSet": false,
        "summaryOnly": true,
        "ipv4AggregateNetwork": {
          "id": "string",
          "type": "string",
          "version": "string",
          "name": "string"
        },
        "type": "afaggregateaddressipv4"
      },
      {
        "advertiseMap": {
          "id": "string",
          "type": "string",
          "version": "string",
          "name": "string"
        },
        "attributeMap": {
          "id": "string",
          "type": "string",
          "version": "string",
          "name": "string"
        },
        "suppressMap": {
          "id": "string",
          "type": "string",
          "version": "string",
          "name": "string"
        },
        "asSet": true,
        "summaryOnly": false,
        "ipv4AggregateNetwork": {
          "id": "string",
          "type": "string",
          "version": "string",
          "name": "string"
        },
        "type": "afaggregateaddressipv4"
      },
      {
        "advertiseMap": {
          "id": "string",
          "type": "string",
          "version": "string",
          "name": "string"
        },
        "attributeMap": {
          "id": "string",
          "type": "string",
          "version": "string",
          "name": "string"
        },
        "suppressMap": {
          "id": "string",
          "type": "string",
          "version": "string",
          "name": "string"
        },
        "asSet": false,
        "summaryOnly": true,
        "ipv4AggregateNetwork": {
          "id": "string",
          "type": "string",
          "version": "string",
          "name": "string"
        },
        "type": "afaggregateaddressipv4"
      },
      {
        "advertiseMap": {
          "id": "string",
          "type": "string",
          "version": "string",
          "name": "string"
        },
        "attributeMap": {
          "id": "string",
          "type": "string",
          "version": "string",
          "name": "string"
        },
        "suppressMap": {
          "id": "string",
          "type": "string",
          "version": "string",
          "name": "string"
        },
        "asSet": false,
        "summaryOnly": true,
        "ipv4AggregateNetwork": {
          "id": "string",
          "type": "string",
          "version": "string",
          "name": "string"
        },
        "type": "afaggregateaddressipv4"
      },
      {
        "advertiseMap": {
          "id": "string",
          "type": "string",
          "version": "string",
          "name": "string"
        },
        "attributeMap": {
          "id": "string",
          "type": "string",
          "version": "string",
          "name": "string"
        },
        "suppressMap": {
          "id": "string",
          "type": "string",
          "version": "string",
          "name": "string"
        },
        "asSet": false,
        "summaryOnly": true,
        "ipv4AggregateNetwork": {
          "id": "string",
          "type": "string",
          "version": "string",
          "name": "string"
        },
        "type": "afaggregateaddressipv4"
      },
      {
        "advertiseMap": {
          "id": "string",
          "type": "string",
          "version": "string",
          "name": "string"
        },
        "attributeMap": {
          "id": "string",
          "type": "string",
          "version": "string",
          "name": "string"
        },
        "suppressMap": {
          "id": "string",
          "type": "string",
          "version": "string",
          "name": "string"
        },
        "asSet": false,
        "summaryOnly": true,
        "ipv4AggregateNetwork": {
          "id": "string",
          "type": "string",
          "version": "string",
          "name": "string"
        },
        "type": "afaggregateaddressipv4"
      }
    ],
    "distributeLists": [
      {},
      {},
      {},
      {},
      {},
      {},
      {},
      {},
      {},
      {}
    ],
    "neighbors": [
      {
        "remoteAs": "string",
        "activate": true,
        "neighborGeneral": {
          "description": "string",
          "shutdown": true,
          "fallOverBFD": {},
          "type": "neighborgeneral"
        },
        "neighborAdvanced": {
          "neighborSecret": {},
          "neighborHops": {},
          "neighborVersion": 7,
          "nextHopSelf": true,
          "neighborWeight": 6,
          "sendCommunity": true,
          "neighborTransportConnectionMode": {},
          "neighborTransportPathMTUDiscovery": {},
          "type": "neighboradvanced"
        },
        "neighborRoutes": {
          "advertisementInterval": 9,
          "neighborAdvertiseMaps": [
            {},
            {},
            {},
            {},
            {},
            {},
            {},
            {}
          ],
          "neighborDefaultOriginate": {},
          "removePrivateAs": true,
          "type": "neighborroutes"
        },
        "neighborRouteMap": [
          {
            "routeMap": {},
            "filterUpdateAction": {},
            "type": "neighborroutemap"
          },
          {
            "routeMap": {},
            "filterUpdateAction": {},
            "type": "neighborroutemap"
          },
          {
            "routeMap": {},
            "filterUpdateAction": {},
            "type": "neighborroutemap"
          },
          {
            "routeMap": {},
            "filterUpdateAction": {},
            "type": "neighborroutemap"
          },
          {
            "routeMap": {},
            "filterUpdateAction": {},
            "type": "neighborroutemap"
          },
          {
            "routeMap": {},
            "filterUpdateAction": {},
            "type": "neighborroutemap"
          },
          {
            "routeMap": {},
            "filterUpdateAction": {},
            "type": "neighborroutemap"
          },
          {
            "routeMap": {},
            "filterUpdateAction": {},
            "type": "neighborroutemap"
          },
          {
            "routeMap": {},
            "filterUpdateAction": {},
            "type": "neighborroutemap"
          }
        ],
        "neighborFilterList": [
          {
            "asPathList": {},
            "filterUpdateAction": {},
            "type": "neighborfilterlist"
          }
        ],
        "neighborMaximumPrefix": {
          "maxPrefixLimit": 7,
          "thresholdValue": 10,
          "restartInterval": 9,
          "neighborMaximumPrefixOption": {},
          "type": "neighbormaximumprefix"
        },
        "haModeGracefulRestart": false,
        "neighborTimers": {
          "keepAliveInterval": 4,
          "holdTime": 7,
          "minimumHoldTime": 6,
          "type": "neighbortimers"
        },
        "neighborLocalAs": {
          "localAsNumber": "string",
          "neighborLocalAsOption": {},
          "type": "neighborlocalas"
        },
        "ipv4Address": "string",
        "neighborDistributeLists": [
          {
            "accessListName": {},
            "filterUpdateAction": {},
            "type": "neighbordistributelist"
          },
          {
            "accessListName": {},
            "filterUpdateAction": {},
            "type": "neighbordistributelist"
          }
        ],
        "ipv4PrefixListFilter": [
          {
            "filterDirection": {},
            "prefixList": {},
            "type": "ipv4prefixlistfilter"
          },
          {
            "filterDirection": {},
            "prefixList": {},
            "type": "ipv4prefixlistfilter"
          },
          {
            "filterDirection": {},
            "prefixList": {},
            "type": "ipv4prefixlistfilter"
          },
          {
            "filterDirection": {},
            "prefixList": {},
            "type": "ipv4prefixlistfilter"
          }
        ],
        "neighborHAMode": {
          "disable": false,
          "type": "neighborhamode"
        },
        "type": "neighboripv4"
      },
      {
        "remoteAs": "string",
        "activate": true,
        "neighborGeneral": {
          "description": "string",
          "shutdown": false,
          "fallOverBFD": {},
          "type": "neighborgeneral"
        },
        "neighborAdvanced": {
          "neighborSecret": {},
          "neighborHops": {},
          "neighborVersion": 1,
          "nextHopSelf": true,
          "neighborWeight": 8,
          "sendCommunity": true,
          "neighborTransportConnectionMode": {},
          "neighborTransportPathMTUDiscovery": {},
          "type": "neighboradvanced"
        },
        "neighborRoutes": {
          "advertisementInterval": 6,
          "neighborAdvertiseMaps": [
            {},
            {},
            {},
            {},
            {},
            {},
            {},
            {},
            {}
          ],
          "neighborDefaultOriginate": {},
          "removePrivateAs": true,
          "type": "neighborroutes"
        },
        "neighborRouteMap": [
          {
            "routeMap": {},
            "filterUpdateAction": {},
            "type": "neighborroutemap"
          },
          {
            "routeMap": {},
            "filterUpdateAction": {},
            "type": "neighborroutemap"
          },
          {
            "routeMap": {},
            "filterUpdateAction": {},
            "type": "neighborroutemap"
          },
          {
            "routeMap": {},
            "filterUpdateAction": {},
            "type": "neighborroutemap"
          },
          {
            "routeMap": {},
            "filterUpdateAction": {},
            "type": "neighborroutemap"
          },
          {
            "routeMap": {},
            "filterUpdateAction": {},
            "type": "neighborroutemap"
          },
          {
            "routeMap": {},
            "filterUpdateAction": {},
            "type": "neighborroutemap"
          },
          {
            "routeMap": {},
            "filterUpdateAction": {},
            "type": "neighborroutemap"
          }
        ],
        "neighborFilterList": [
          {
            "asPathList": {},
            "filterUpdateAction": {},
            "type": "neighborfilterlist"
          },
          {
            "asPathList": {},
            "filterUpdateAction": {},
            "type": "neighborfilterlist"
          },
          {
            "asPathList": {},
            "filterUpdateAction": {},
            "type": "neighborfilterlist"
          },
          {
            "asPathList": {},
            "filterUpdateAction": {},
            "type": "neighborfilterlist"
          },
          {
            "asPathList": {},
            "filterUpdateAction": {},
            "type": "neighborfilterlist"
          }
        ],
        "neighborMaximumPrefix": {
          "maxPrefixLimit": 10,
          "thresholdValue": 6,
          "restartInterval": 3,
          "neighborMaximumPrefixOption": {},
          "type": "neighbormaximumprefix"
        },
        "haModeGracefulRestart": false,
        "neighborTimers": {
          "keepAliveInterval": 3,
          "holdTime": 7,
          "minimumHoldTime": 2,
          "type": "neighbortimers"
        },
        "neighborLocalAs": {
          "localAsNumber": "string",
          "neighborLocalAsOption": {},
          "type": "neighborlocalas"
        },
        "ipv4Address": "string",
        "neighborDistributeLists": [
          {
            "accessListName": {},
            "filterUpdateAction": {},
            "type": "neighbordistributelist"
          },
          {
            "accessListName": {},
            "filterUpdateAction": {},
            "type": "neighbordistributelist"
          },
          {
            "accessListName": {},
            "filterUpdateAction": {},
            "type": "neighbordistributelist"
          },
          {
            "accessListName": {},
            "filterUpdateAction": {},
            "type": "neighbordistributelist"
          },
          {
            "accessListName": {},
            "filterUpdateAction": {},
            "type": "neighbordistributelist"
          },
          {
            "accessListName": {},
            "filterUpdateAction": {},
            "type": "neighbordistributelist"
          },
          {
            "accessListName": {},
            "filterUpdateAction": {},
            "type": "neighbordistributelist"
          }
        ],
        "ipv4PrefixListFilter": [
          {
            "filterDirection": {},
            "prefixList": {},
            "type": "ipv4prefixlistfilter"
          },
          {
            "filterDirection": {},
            "prefixList": {},
            "type": "ipv4prefixlistfilter"
          },
          {
            "filterDirection": {},
            "prefixList": {},
            "type": "ipv4prefixlistfilter"
          },
          {
            "filterDirection": {},
            "prefixList": {},
            "type": "ipv4prefixlistfilter"
          }
        ],
        "neighborHAMode": {
          "disable": true,
          "type": "neighborhamode"
        },
        "type": "neighboripv4"
      },
      {
        "remoteAs": "string",
        "activate": true,
        "neighborGeneral": {
          "description": "string",
          "shutdown": false,
          "fallOverBFD": {},
          "type": "neighborgeneral"
        },
        "neighborAdvanced": {
          "neighborSecret": {},
          "neighborHops": {},
          "neighborVersion": 1,
          "nextHopSelf": true,
          "neighborWeight": 1,
          "sendCommunity": true,
          "neighborTransportConnectionMode": {},
          "neighborTransportPathMTUDiscovery": {},
          "type": "neighboradvanced"
        },
        "neighborRoutes": {
          "advertisementInterval": 9,
          "neighborAdvertiseMaps": [
            {},
            {},
            {},
            {},
            {}
          ],
          "neighborDefaultOriginate": {},
          "removePrivateAs": true,
          "type": "neighborroutes"
        },
        "neighborRouteMap": [
          {
            "routeMap": {},
            "filterUpdateAction": {},
            "type": "neighborroutemap"
          },
          {
            "routeMap": {},
            "filterUpdateAction": {},
            "type": "neighborroutemap"
          }
        ],
        "neighborFilterList": [
          {
            "asPathList": {},
            "filterUpdateAction": {},
            "type": "neighborfilterlist"
          },
          {
            "asPathList": {},
            "filterUpdateAction": {},
            "type": "neighborfilterlist"
          },
          {
            "asPathList": {},
            "filterUpdateAction": {},
            "type": "neighborfilterlist"
          },
          {
            "asPathList": {},
            "filterUpdateAction": {},
            "type": "neighborfilterlist"
          },
          {
            "asPathList": {},
            "filterUpdateAction": {},
            "type": "neighborfilterlist"
          },
          {
            "asPathList": {},
            "filterUpdateAction": {},
            "type": "neighborfilterlist"
          },
          {
            "asPathList": {},
            "filterUpdateAction": {},
            "type": "neighborfilterlist"
          },
          {
            "asPathList": {},
            "filterUpdateAction": {},
            "type": "neighborfilterlist"
          },
          {
            "asPathList": {},
            "filterUpdateAction": {},
            "type": "neighborfilterlist"
          },
          {
            "asPathList": {},
            "filterUpdateAction": {},
            "type": "neighborfilterlist"
          }
        ],
        "neighborMaximumPrefix": {
          "maxPrefixLimit": 4,
          "thresholdValue": 3,
          "restartInterval": 6,
          "neighborMaximumPrefixOption": {},
          "type": "neighbormaximumprefix"
        },
        "haModeGracefulRestart": true,
        "neighborTimers": {
          "keepAliveInterval": 8,
          "holdTime": 4,
          "minimumHoldTime": 10,
          "type": "neighbortimers"
        },
        "neighborLocalAs": {
          "localAsNumber": "string",
          "neighborLocalAsOption": {},
          "type": "neighborlocalas"
        },
        "ipv4Address": "string",
        "neighborDistributeLists": [
          {
            "accessListName": {},
            "filterUpdateAction": {},
            "type": "neighbordistributelist"
          },
          {
            "accessListName": {},
            "filterUpdateAction": {},
            "type": "neighbordistributelist"
          }
        ],
        "ipv4PrefixListFilter": [
          {
            "filterDirection": {},
            "prefixList": {},
            "type": "ipv4prefixlistfilter"
          },
          {
            "filterDirection": {},
            "prefixList": {},
            "type": "ipv4prefixlistfilter"
          },
          {
            "filterDirection": {},
            "prefixList": {},
            "type": "ipv4prefixlistfilter"
          },
          {
            "filterDirection": {},
            "prefixList": {},
            "type": "ipv4prefixlistfilter"
          },
          {
            "filterDirection": {},
            "prefixList": {},
            "type": "ipv4prefixlistfilter"
          },
          {
            "filterDirection": {},
            "prefixList": {},
            "type": "ipv4prefixlistfilter"
          }
        ],
        "neighborHAMode": {
          "disable": true,
          "type": "neighborhamode"
        },
        "type": "neighboripv4"
      },
      {
        "remoteAs": "string",
        "activate": false,
        "neighborGeneral": {
          "description": "string",
          "shutdown": true,
          "fallOverBFD": {},
          "type": "neighborgeneral"
        },
        "neighborAdvanced": {
          "neighborSecret": {},
          "neighborHops": {},
          "neighborVersion": 3,
          "nextHopSelf": true,
          "neighborWeight": 10,
          "sendCommunity": true,
          "neighborTransportConnectionMode": {},
          "neighborTransportPathMTUDiscovery": {},
          "type": "neighboradvanced"
        },
        "neighborRoutes": {
          "advertisementInterval": 6,
          "neighborAdvertiseMaps": [
            {},
            {},
            {},
            {},
            {},
            {},
            {},
            {},
            {},
            {}
          ],
          "neighborDefaultOriginate": {},
          "removePrivateAs": true,
          "type": "neighborroutes"
        },
        "neighborRouteMap": [
          {
            "routeMap": {},
            "filterUpdateAction": {},
            "type": "neighborroutemap"
          },
          {
            "routeMap": {},
            "filterUpdateAction": {},
            "type": "neighborroutemap"
          },
          {
            "routeMap": {},
            "filterUpdateAction": {},
            "type": "neighborroutemap"
          }
        ],
        "neighborFilterList": [
          {
            "asPathList": {},
            "filterUpdateAction": {},
            "type": "neighborfilterlist"
          },
          {
            "asPathList": {},
            "filterUpdateAction": {},
            "type": "neighborfilterlist"
          },
          {
            "asPathList": {},
            "filterUpdateAction": {},
            "type": "neighborfilterlist"
          },
          {
            "asPathList": {},
            "filterUpdateAction": {},
            "type": "neighborfilterlist"
          },
          {
            "asPathList": {},
            "filterUpdateAction": {},
            "type": "neighborfilterlist"
          },
          {
            "asPathList": {},
            "filterUpdateAction": {},
            "type": "neighborfilterlist"
          },
          {
            "asPathList": {},
            "filterUpdateAction": {},
            "type": "neighborfilterlist"
          },
          {
            "asPathList": {},
            "filterUpdateAction": {},
            "type": "neighborfilterlist"
          },
          {
            "asPathList": {},
            "filterUpdateAction": {},
            "type": "neighborfilterlist"
          },
          {
            "asPathList": {},
            "filterUpdateAction": {},
            "type": "neighborfilterlist"
          }
        ],
        "neighborMaximumPrefix": {
          "maxPrefixLimit": 5,
          "thresholdValue": 7,
          "restartInterval": 6,
          "neighborMaximumPrefixOption": {},
          "type": "neighbormaximumprefix"
        },
        "haModeGracefulRestart": true,
        "neighborTimers": {
          "keepAliveInterval": 4,
          "holdTime": 10,
          "minimumHoldTime": 8,
          "type": "neighbortimers"
        },
        "neighborLocalAs": {
          "localAsNumber": "string",
          "neighborLocalAsOption": {},
          "type": "neighborlocalas"
        },
        "ipv4Address": "string",
        "neighborDistributeLists": [
          {
            "accessListName": {},
            "filterUpdateAction": {},
            "type": "neighbordistributelist"
          },
          {
            "accessListName": {},
            "filterUpdateAction": {},
            "type": "neighbordistributelist"
          },
          {
            "accessListName": {},
            "filterUpdateAction": {},
            "type": "neighbordistributelist"
          },
          {
            "accessListName": {},
            "filterUpdateAction": {},
            "type": "neighbordistributelist"
          }
        ],
        "ipv4PrefixListFilter": [
          {
            "filterDirection": {},
            "prefixList": {},
            "type": "ipv4prefixlistfilter"
          },
          {
            "filterDirection": {},
            "prefixList": {},
            "type": "ipv4prefixlistfilter"
          },
          {
            "filterDirection": {},
            "prefixList": {},
            "type": "ipv4prefixlistfilter"
          },
          {
            "filterDirection": {},
            "prefixList": {},
            "type": "ipv4prefixlistfilter"
          },
          {
            "filterDirection": {},
            "prefixList": {},
            "type": "ipv4prefixlistfilter"
          },
          {
            "filterDirection": {},
            "prefixList": {},
            "type": "ipv4prefixlistfilter"
          },
          {
            "filterDirection": {},
            "prefixList": {},
            "type": "ipv4prefixlistfilter"
          },
          {
            "filterDirection": {},
            "prefixList": {},
            "type": "ipv4prefixlistfilter"
          },
          {
            "filterDirection": {},
            "prefixList": {},
            "type": "ipv4prefixlistfilter"
          }
        ],
        "neighborHAMode": {
          "disable": true,
          "type": "neighborhamode"
        },
        "type": "neighboripv4"
      },
      {
        "remoteAs": "string",
        "activate": false,
        "neighborGeneral": {
          "description": "string",
          "shutdown": true,
          "fallOverBFD": {},
          "type": "neighborgeneral"
        },
        "neighborAdvanced": {
          "neighborSecret": {},
          "neighborHops": {},
          "neighborVersion": 2,
          "nextHopSelf": false,
          "neighborWeight": 5,
          "sendCommunity": false,
          "neighborTransportConnectionMode": {},
          "neighborTransportPathMTUDiscovery": {},
          "type": "neighboradvanced"
        },
        "neighborRoutes": {
          "advertisementInterval": 3,
          "neighborAdvertiseMaps": [
            {},
            {},
            {},
            {},
            {},
            {},
            {},
            {},
            {}
          ],
          "neighborDefaultOriginate": {},
          "removePrivateAs": false,
          "type": "neighborroutes"
        },
        "neighborRouteMap": [
          {
            "routeMap": {},
            "filterUpdateAction": {},
            "type": "neighborroutemap"
          },
          {
            "routeMap": {},
            "filterUpdateAction": {},
            "type": "neighborroutemap"
          },
          {
            "routeMap": {},
            "filterUpdateAction": {},
            "type": "neighborroutemap"
          },
          {
            "routeMap": {},
            "filterUpdateAction": {},
            "type": "neighborroutemap"
          },
          {
            "routeMap": {},
            "filterUpdateAction": {},
            "type": "neighborroutemap"
          },
          {
            "routeMap": {},
            "filterUpdateAction": {},
            "type": "neighborroutemap"
          }
        ],
        "neighborFilterList": [
          {
            "asPathList": {},
            "filterUpdateAction": {},
            "type": "neighborfilterlist"
          },
          {
            "asPathList": {},
            "filterUpdateAction": {},
            "type": "neighborfilterlist"
          },
          {
            "asPathList": {},
            "filterUpdateAction": {},
            "type": "neighborfilterlist"
          },
          {
            "asPathList": {},
            "filterUpdateAction": {},
            "type": "neighborfilterlist"
          },
          {
            "asPathList": {},
            "filterUpdateAction": {},
            "type": "neighborfilterlist"
          },
          {
            "asPathList": {},
            "filterUpdateAction": {},
            "type": "neighborfilterlist"
          }
        ],
        "neighborMaximumPrefix": {
          "maxPrefixLimit": 6,
          "thresholdValue": 2,
          "restartInterval": 10,
          "neighborMaximumPrefixOption": {},
          "type": "neighbormaximumprefix"
        },
        "haModeGracefulRestart": true,
        "neighborTimers": {
          "keepAliveInterval": 1,
          "holdTime": 10,
          "minimumHoldTime": 2,
          "type": "neighbortimers"
        },
        "neighborLocalAs": {
          "localAsNumber": "string",
          "neighborLocalAsOption": {},
          "type": "neighborlocalas"
        },
        "ipv4Address": "string",
        "neighborDistributeLists": [
          {
            "accessListName": {},
            "filterUpdateAction": {},
            "type": "neighbordistributelist"
          },
          {
            "accessListName": {},
            "filterUpdateAction": {},
            "type": "neighbordistributelist"
          }
        ],
        "ipv4PrefixListFilter": [
          {
            "filterDirection": {},
            "prefixList": {},
            "type": "ipv4prefixlistfilter"
          },
          {
            "filterDirection": {},
            "prefixList": {},
            "type": "ipv4prefixlistfilter"
          },
          {
            "filterDirection": {},
            "prefixList": {},
            "type": "ipv4prefixlistfilter"
          }
        ],
        "neighborHAMode": {
          "disable": false,
          "type": "neighborhamode"
        },
        "type": "neighboripv4"
      },
      {
        "remoteAs": "string",
        "activate": true,
        "neighborGeneral": {
          "description": "string",
          "shutdown": false,
          "fallOverBFD": {},
          "type": "neighborgeneral"
        },
        "neighborAdvanced": {
          "neighborSecret": {},
          "neighborHops": {},
          "neighborVersion": 8,
          "nextHopSelf": true,
          "neighborWeight": 5,
          "sendCommunity": false,
          "neighborTransportConnectionMode": {},
          "neighborTransportPathMTUDiscovery": {},
          "type": "neighboradvanced"
        },
        "neighborRoutes": {
          "advertisementInterval": 4,
          "neighborAdvertiseMaps": [
            {},
            {},
            {}
          ],
          "neighborDefaultOriginate": {},
          "removePrivateAs": false,
          "type": "neighborroutes"
        },
        "neighborRouteMap": [
          {
            "routeMap": {},
            "filterUpdateAction": {},
            "type": "neighborroutemap"
          },
          {
            "routeMap": {},
            "filterUpdateAction": {},
            "type": "neighborroutemap"
          },
          {
            "routeMap": {},
            "filterUpdateAction": {},
            "type": "neighborroutemap"
          },
          {
            "routeMap": {},
            "filterUpdateAction": {},
            "type": "neighborroutemap"
          },
          {
            "routeMap": {},
            "filterUpdateAction": {},
            "type": "neighborroutemap"
          },
          {
            "routeMap": {},
            "filterUpdateAction": {},
            "type": "neighborroutemap"
          },
          {
            "routeMap": {},
            "filterUpdateAction": {},
            "type": "neighborroutemap"
          },
          {
            "routeMap": {},
            "filterUpdateAction": {},
            "type": "neighborroutemap"
          },
          {
            "routeMap": {},
            "filterUpdateAction": {},
            "type": "neighborroutemap"
          },
          {
            "routeMap": {},
            "filterUpdateAction": {},
            "type": "neighborroutemap"
          }
        ],
        "neighborFilterList": [
          {
            "asPathList": {},
            "filterUpdateAction": {},
            "type": "neighborfilterlist"
          },
          {
            "asPathList": {},
            "filterUpdateAction": {},
            "type": "neighborfilterlist"
          },
          {
            "asPathList": {},
            "filterUpdateAction": {},
            "type": "neighborfilterlist"
          },
          {
            "asPathList": {},
            "filterUpdateAction": {},
            "type": "neighborfilterlist"
          },
          {
            "asPathList": {},
            "filterUpdateAction": {},
            "type": "neighborfilterlist"
          },
          {
            "asPathList": {},
            "filterUpdateAction": {},
            "type": "neighborfilterlist"
          },
          {
            "asPathList": {},
            "filterUpdateAction": {},
            "type": "neighborfilterlist"
          },
          {
            "asPathList": {},
            "filterUpdateAction": {},
            "type": "neighborfilterlist"
          }
        ],
        "neighborMaximumPrefix": {
          "maxPrefixLimit": 1,
          "thresholdValue": 1,
          "restartInterval": 4,
          "neighborMaximumPrefixOption": {},
          "type": "neighbormaximumprefix"
        },
        "haModeGracefulRestart": false,
        "neighborTimers": {
          "keepAliveInterval": 7,
          "holdTime": 7,
          "minimumHoldTime": 3,
          "type": "neighbortimers"
        },
        "neighborLocalAs": {
          "localAsNumber": "string",
          "neighborLocalAsOption": {},
          "type": "neighborlocalas"
        },
        "ipv4Address": "string",
        "neighborDistributeLists": [
          {
            "accessListName": {},
            "filterUpdateAction": {},
            "type": "neighbordistributelist"
          },
          {
            "accessListName": {},
            "filterUpdateAction": {},
            "type": "neighbordistributelist"
          },
          {
            "accessListName": {},
            "filterUpdateAction": {},
            "type": "neighbordistributelist"
          }
        ],
        "ipv4PrefixListFilter": [
          {
            "filterDirection": {},
            "prefixList": {},
            "type": "ipv4prefixlistfilter"
          },
          {
            "filterDirection": {},
            "prefixList": {},
            "type": "ipv4prefixlistfilter"
          },
          {
            "filterDirection": {},
            "prefixList": {},
            "type": "ipv4prefixlistfilter"
          },
          {
            "filterDirection": {},
            "prefixList": {},
            "type": "ipv4prefixlistfilter"
          },
          {
            "filterDirection": {},
            "prefixList": {},
            "type": "ipv4prefixlistfilter"
          },
          {
            "filterDirection": {},
            "prefixList": {},
            "type": "ipv4prefixlistfilter"
          },
          {
            "filterDirection": {},
            "prefixList": {},
            "type": "ipv4prefixlistfilter"
          },
          {
            "filterDirection": {},
            "prefixList": {},
            "type": "ipv4prefixlistfilter"
          }
        ],
        "neighborHAMode": {
          "disable": false,
          "type": "neighborhamode"
        },
        "type": "neighboripv4"
      }
    ],
    "networks": [
      {
        "routeMap": {
          "id": "string",
          "type": "string",
          "version": "string",
          "name": "string"
        },
        "ipv4Network": {
          "id": "string",
          "type": "string",
          "version": "string",
          "name": "string"
        },
        "type": "afipv4network"
      },
      {
        "routeMap": {
          "id": "string",
          "type": "string",
          "version": "string",
          "name": "string"
        },
        "ipv4Network": {
          "id": "string",
          "type": "string",
          "version": "string",
          "name": "string"
        },
        "type": "afipv4network"
      },
      {
        "routeMap": {
          "id": "string",
          "type": "string",
          "version": "string",
          "name": "string"
        },
        "ipv4Network": {
          "id": "string",
          "type": "string",
          "version": "string",
          "name": "string"
        },
        "type": "afipv4network"
      },
      {
        "routeMap": {
          "id": "string",
          "type": "string",
          "version": "string",
          "name": "string"
        },
        "ipv4Network": {
          "id": "string",
          "type": "string",
          "version": "string",
          "name": "string"
        },
        "type": "afipv4network"
      },
      {
        "routeMap": {
          "id": "string",
          "type": "string",
          "version": "string",
          "name": "string"
        },
        "ipv4Network": {
          "id": "string",
          "type": "string",
          "version": "string",
          "name": "string"
        },
        "type": "afipv4network"
      },
      {
        "routeMap": {
          "id": "string",
          "type": "string",
          "version": "string",
          "name": "string"
        },
        "ipv4Network": {
          "id": "string",
          "type": "string",
          "version": "string",
          "name": "string"
        },
        "type": "afipv4network"
      },
      {
        "routeMap": {
          "id": "string",
          "type": "string",
          "version": "string",
          "name": "string"
        },
        "ipv4Network": {
          "id": "string",
          "type": "string",
          "version": "string",
          "name": "string"
        },
        "type": "afipv4network"
      },
      {
        "routeMap": {
          "id": "string",
          "type": "string",
          "version": "string",
          "name": "string"
        },
        "ipv4Network": {
          "id": "string",
          "type": "string",
          "version": "string",
          "name": "string"
        },
        "type": "afipv4network"
      }
    ],
    "type": "afipv4"
  },
  "addressFamilyIPv6": {
    "distance": {
      "externalDistance": 10,
      "internalDistance": 9,
      "localDistance": 9,
      "type": "afbgpdistance"
    },
    "defaultInformationOrginate": false,
    "bgpSupressInactive": false,
    "synchronization": true,
    "bgpRedistributeInternal": true,
    "scanTime": 1,
    "aggregateTimer": 5,
    "maximumPaths": {
      "value": 4,
      "ibgpValue": 8,
      "type": "afmaximumpaths"
    },
    "redistributeProtocols": [
      {},
      {},
      {},
      {},
      {},
      {},
      {},
      {},
      {}
    ],
    "injectMaps": [
      {
        "injectMap": {
          "id": "string",
          "type": "string",
          "version": "string",
          "name": "string"
        },
        "existMap": {
          "id": "string",
          "type": "string",
          "version": "string",
          "name": "string"
        },
        "copyAttributes": false,
        "type": "afinjectmap"
      },
      {
        "injectMap": {
          "id": "string",
          "type": "string",
          "version": "string",
          "name": "string"
        },
        "existMap": {
          "id": "string",
          "type": "string",
          "version": "string",
          "name": "string"
        },
        "copyAttributes": true,
        "type": "afinjectmap"
      },
      {
        "injectMap": {
          "id": "string",
          "type": "string",
          "version": "string",
          "name": "string"
        },
        "existMap": {
          "id": "string",
          "type": "string",
          "version": "string",
          "name": "string"
        },
        "copyAttributes": true,
        "type": "afinjectmap"
      },
      {
        "injectMap": {
          "id": "string",
          "type": "string",
          "version": "string",
          "name": "string"
        },
        "existMap": {
          "id": "string",
          "type": "string",
          "version": "string",
          "name": "string"
        },
        "copyAttributes": true,
        "type": "afinjectmap"
      }
    ],
    "aggregateAddressesIPv6": [
      {
        "advertiseMap": {
          "id": "string",
          "type": "string",
          "version": "string",
          "name": "string"
        },
        "attributeMap": {
          "id": "string",
          "type": "string",
          "version": "string",
          "name": "string"
        },
        "suppressMap": {
          "id": "string",
          "type": "string",
          "version": "string",
          "name": "string"
        },
        "asSet": false,
        "summaryOnly": false,
        "ipv6AggregateNetwork": {
          "id": "string",
          "type": "string",
          "version": "string",
          "name": "string"
        },
        "type": "afaggregateaddressipv6"
      },
      {
        "advertiseMap": {
          "id": "string",
          "type": "string",
          "version": "string",
          "name": "string"
        },
        "attributeMap": {
          "id": "string",
          "type": "string",
          "version": "string",
          "name": "string"
        },
        "suppressMap": {
          "id": "string",
          "type": "string",
          "version": "string",
          "name": "string"
        },
        "asSet": true,
        "summaryOnly": false,
        "ipv6AggregateNetwork": {
          "id": "string",
          "type": "string",
          "version": "string",
          "name": "string"
        },
        "type": "afaggregateaddressipv6"
      },
      {
        "advertiseMap": {
          "id": "string",
          "type": "string",
          "version": "string",
          "name": "string"
        },
        "attributeMap": {
          "id": "string",
          "type": "string",
          "version": "string",
          "name": "string"
        },
        "suppressMap": {
          "id": "string",
          "type": "string",
          "version": "string",
          "name": "string"
        },
        "asSet": true,
        "summaryOnly": false,
        "ipv6AggregateNetwork": {
          "id": "string",
          "type": "string",
          "version": "string",
          "name": "string"
        },
        "type": "afaggregateaddressipv6"
      },
      {
        "advertiseMap": {
          "id": "string",
          "type": "string",
          "version": "string",
          "name": "string"
        },
        "attributeMap": {
          "id": "string",
          "type": "string",
          "version": "string",
          "name": "string"
        },
        "suppressMap": {
          "id": "string",
          "type": "string",
          "version": "string",
          "name": "string"
        },
        "asSet": false,
        "summaryOnly": true,
        "ipv6AggregateNetwork": {
          "id": "string",
          "type": "string",
          "version": "string",
          "name": "string"
        },
        "type": "afaggregateaddressipv6"
      },
      {
        "advertiseMap": {
          "id": "string",
          "type": "string",
          "version": "string",
          "name": "string"
        },
        "attributeMap": {
          "id": "string",
          "type": "string",
          "version": "string",
          "name": "string"
        },
        "suppressMap": {
          "id": "string",
          "type": "string",
          "version": "string",
          "name": "string"
        },
        "asSet": true,
        "summaryOnly": true,
        "ipv6AggregateNetwork": {
          "id": "string",
          "type": "string",
          "version": "string",
          "name": "string"
        },
        "type": "afaggregateaddressipv6"
      }
    ],
    "neighbors": [
      {
        "remoteAs": "string",
        "activate": false,
        "neighborGeneral": {
          "description": "string",
          "shutdown": false,
          "fallOverBFD": {},
          "type": "neighborgeneral"
        },
        "neighborAdvanced": {
          "neighborSecret": {},
          "neighborHops": {},
          "neighborVersion": 8,
          "nextHopSelf": true,
          "neighborWeight": 3,
          "sendCommunity": true,
          "neighborTransportConnectionMode": {},
          "neighborTransportPathMTUDiscovery": {},
          "type": "neighboradvanced"
        },
        "neighborRoutes": {
          "advertisementInterval": 6,
          "neighborAdvertiseMaps": [
            {},
            {},
            {}
          ],
          "neighborDefaultOriginate": {},
          "removePrivateAs": false,
          "type": "neighborroutes"
        },
        "neighborRouteMap": [
          {
            "routeMap": {},
            "filterUpdateAction": {},
            "type": "neighborroutemap"
          },
          {
            "routeMap": {},
            "filterUpdateAction": {},
            "type": "neighborroutemap"
          }
        ],
        "neighborFilterList": [
          {
            "asPathList": {},
            "filterUpdateAction": {},
            "type": "neighborfilterlist"
          },
          {
            "asPathList": {},
            "filterUpdateAction": {},
            "type": "neighborfilterlist"
          },
          {
            "asPathList": {},
            "filterUpdateAction": {},
            "type": "neighborfilterlist"
          }
        ],
        "neighborMaximumPrefix": {
          "maxPrefixLimit": 8,
          "thresholdValue": 9,
          "restartInterval": 4,
          "neighborMaximumPrefixOption": {},
          "type": "neighbormaximumprefix"
        },
        "haModeGracefulRestart": true,
        "neighborTimers": {
          "keepAliveInterval": 2,
          "holdTime": 9,
          "minimumHoldTime": 8,
          "type": "neighbortimers"
        },
        "neighborLocalAs": {
          "localAsNumber": "string",
          "neighborLocalAsOption": {},
          "type": "neighborlocalas"
        },
        "ipv6Address": "string",
        "ipv6Prefix": 8,
        "ipv6PrefixListFilter": [
          {
            "filterDirection": {},
            "prefixList": {},
            "type": "ipv6prefixlistfilter"
          }
        ],
        "type": "neighboripv6"
      },
      {
        "remoteAs": "string",
        "activate": true,
        "neighborGeneral": {
          "description": "string",
          "shutdown": true,
          "fallOverBFD": {},
          "type": "neighborgeneral"
        },
        "neighborAdvanced": {
          "neighborSecret": {},
          "neighborHops": {},
          "neighborVersion": 9,
          "nextHopSelf": false,
          "neighborWeight": 4,
          "sendCommunity": true,
          "neighborTransportConnectionMode": {},
          "neighborTransportPathMTUDiscovery": {},
          "type": "neighboradvanced"
        },
        "neighborRoutes": {
          "advertisementInterval": 9,
          "neighborAdvertiseMaps": [
            {},
            {},
            {},
            {},
            {},
            {},
            {}
          ],
          "neighborDefaultOriginate": {},
          "removePrivateAs": true,
          "type": "neighborroutes"
        },
        "neighborRouteMap": [
          {
            "routeMap": {},
            "filterUpdateAction": {},
            "type": "neighborroutemap"
          },
          {
            "routeMap": {},
            "filterUpdateAction": {},
            "type": "neighborroutemap"
          },
          {
            "routeMap": {},
            "filterUpdateAction": {},
            "type": "neighborroutemap"
          },
          {
            "routeMap": {},
            "filterUpdateAction": {},
            "type": "neighborroutemap"
          },
          {
            "routeMap": {},
            "filterUpdateAction": {},
            "type": "neighborroutemap"
          },
          {
            "routeMap": {},
            "filterUpdateAction": {},
            "type": "neighborroutemap"
          },
          {
            "routeMap": {},
            "filterUpdateAction": {},
            "type": "neighborroutemap"
          },
          {
            "routeMap": {},
            "filterUpdateAction": {},
            "type": "neighborroutemap"
          },
          {
            "routeMap": {},
            "filterUpdateAction": {},
            "type": "neighborroutemap"
          },
          {
            "routeMap": {},
            "filterUpdateAction": {},
            "type": "neighborroutemap"
          }
        ],
        "neighborFilterList": [
          {
            "asPathList": {},
            "filterUpdateAction": {},
            "type": "neighborfilterlist"
          },
          {
            "asPathList": {},
            "filterUpdateAction": {},
            "type": "neighborfilterlist"
          },
          {
            "asPathList": {},
            "filterUpdateAction": {},
            "type": "neighborfilterlist"
          },
          {
            "asPathList": {},
            "filterUpdateAction": {},
            "type": "neighborfilterlist"
          },
          {
            "asPathList": {},
            "filterUpdateAction": {},
            "type": "neighborfilterlist"
          },
          {
            "asPathList": {},
            "filterUpdateAction": {},
            "type": "neighborfilterlist"
          }
        ],
        "neighborMaximumPrefix": {
          "maxPrefixLimit": 1,
          "thresholdValue": 9,
          "restartInterval": 2,
          "neighborMaximumPrefixOption": {},
          "type": "neighbormaximumprefix"
        },
        "haModeGracefulRestart": false,
        "neighborTimers": {
          "keepAliveInterval": 7,
          "holdTime": 7,
          "minimumHoldTime": 8,
          "type": "neighbortimers"
        },
        "neighborLocalAs": {
          "localAsNumber": "string",
          "neighborLocalAsOption": {},
          "type": "neighborlocalas"
        },
        "ipv6Address": "string",
        "ipv6Prefix": 3,
        "ipv6PrefixListFilter": [
          {
            "filterDirection": {},
            "prefixList": {},
            "type": "ipv6prefixlistfilter"
          },
          {
            "filterDirection": {},
            "prefixList": {},
            "type": "ipv6prefixlistfilter"
          },
          {
            "filterDirection": {},
            "prefixList": {},
            "type": "ipv6prefixlistfilter"
          },
          {
            "filterDirection": {},
            "prefixList": {},
            "type": "ipv6prefixlistfilter"
          },
          {
            "filterDirection": {},
            "prefixList": {},
            "type": "ipv6prefixlistfilter"
          },
          {
            "filterDirection": {},
            "prefixList": {},
            "type": "ipv6prefixlistfilter"
          }
        ],
        "type": "neighboripv6"
      },
      {
        "remoteAs": "string",
        "activate": false,
        "neighborGeneral": {
          "description": "string",
          "shutdown": true,
          "fallOverBFD": {},
          "type": "neighborgeneral"
        },
        "neighborAdvanced": {
          "neighborSecret": {},
          "neighborHops": {},
          "neighborVersion": 3,
          "nextHopSelf": false,
          "neighborWeight": 9,
          "sendCommunity": true,
          "neighborTransportConnectionMode": {},
          "neighborTransportPathMTUDiscovery": {},
          "type": "neighboradvanced"
        },
        "neighborRoutes": {
          "advertisementInterval": 3,
          "neighborAdvertiseMaps": [
            {}
          ],
          "neighborDefaultOriginate": {},
          "removePrivateAs": false,
          "type": "neighborroutes"
        },
        "neighborRouteMap": [
          {
            "routeMap": {},
            "filterUpdateAction": {},
            "type": "neighborroutemap"
          },
          {
            "routeMap": {},
            "filterUpdateAction": {},
            "type": "neighborroutemap"
          },
          {
            "routeMap": {},
            "filterUpdateAction": {},
            "type": "neighborroutemap"
          },
          {
            "routeMap": {},
            "filterUpdateAction": {},
            "type": "neighborroutemap"
          },
          {
            "routeMap": {},
            "filterUpdateAction": {},
            "type": "neighborroutemap"
          },
          {
            "routeMap": {},
            "filterUpdateAction": {},
            "type": "neighborroutemap"
          },
          {
            "routeMap": {},
            "filterUpdateAction": {},
            "type": "neighborroutemap"
          },
          {
            "routeMap": {},
            "filterUpdateAction": {},
            "type": "neighborroutemap"
          },
          {
            "routeMap": {},
            "filterUpdateAction": {},
            "type": "neighborroutemap"
          },
          {
            "routeMap": {},
            "filterUpdateAction": {},
            "type": "neighborroutemap"
          }
        ],
        "neighborFilterList": [
          {
            "asPathList": {},
            "filterUpdateAction": {},
            "type": "neighborfilterlist"
          },
          {
            "asPathList": {},
            "filterUpdateAction": {},
            "type": "neighborfilterlist"
          }
        ],
        "neighborMaximumPrefix": {
          "maxPrefixLimit": 9,
          "thresholdValue": 9,
          "restartInterval": 3,
          "neighborMaximumPrefixOption": {},
          "type": "neighbormaximumprefix"
        },
        "haModeGracefulRestart": false,
        "neighborTimers": {
          "keepAliveInterval": 9,
          "holdTime": 9,
          "minimumHoldTime": 8,
          "type": "neighbortimers"
        },
        "neighborLocalAs": {
          "localAsNumber": "string",
          "neighborLocalAsOption": {},
          "type": "neighborlocalas"
        },
        "ipv6Address": "string",
        "ipv6Prefix": 7,
        "ipv6PrefixListFilter": [
          {
            "filterDirection": {},
            "prefixList": {},
            "type": "ipv6prefixlistfilter"
          },
          {
            "filterDirection": {},
            "prefixList": {},
            "type": "ipv6prefixlistfilter"
          },
          {
            "filterDirection": {},
            "prefixList": {},
            "type": "ipv6prefixlistfilter"
          },
          {
            "filterDirection": {},
            "prefixList": {},
            "type": "ipv6prefixlistfilter"
          },
          {
            "filterDirection": {},
            "prefixList": {},
            "type": "ipv6prefixlistfilter"
          }
        ],
        "type": "neighboripv6"
      },
      {
        "remoteAs": "string",
        "activate": true,
        "neighborGeneral": {
          "description": "string",
          "shutdown": false,
          "fallOverBFD": {},
          "type": "neighborgeneral"
        },
        "neighborAdvanced": {
          "neighborSecret": {},
          "neighborHops": {},
          "neighborVersion": 9,
          "nextHopSelf": false,
          "neighborWeight": 6,
          "sendCommunity": true,
          "neighborTransportConnectionMode": {},
          "neighborTransportPathMTUDiscovery": {},
          "type": "neighboradvanced"
        },
        "neighborRoutes": {
          "advertisementInterval": 1,
          "neighborAdvertiseMaps": [
            {},
            {},
            {},
            {},
            {},
            {},
            {},
            {},
            {}
          ],
          "neighborDefaultOriginate": {},
          "removePrivateAs": true,
          "type": "neighborroutes"
        },
        "neighborRouteMap": [
          {
            "routeMap": {},
            "filterUpdateAction": {},
            "type": "neighborroutemap"
          },
          {
            "routeMap": {},
            "filterUpdateAction": {},
            "type": "neighborroutemap"
          },
          {
            "routeMap": {},
            "filterUpdateAction": {},
            "type": "neighborroutemap"
          },
          {
            "routeMap": {},
            "filterUpdateAction": {},
            "type": "neighborroutemap"
          },
          {
            "routeMap": {},
            "filterUpdateAction": {},
            "type": "neighborroutemap"
          },
          {
            "routeMap": {},
            "filterUpdateAction": {},
            "type": "neighborroutemap"
          },
          {
            "routeMap": {},
            "filterUpdateAction": {},
            "type": "neighborroutemap"
          },
          {
            "routeMap": {},
            "filterUpdateAction": {},
            "type": "neighborroutemap"
          },
          {
            "routeMap": {},
            "filterUpdateAction": {},
            "type": "neighborroutemap"
          }
        ],
        "neighborFilterList": [
          {
            "asPathList": {},
            "filterUpdateAction": {},
            "type": "neighborfilterlist"
          },
          {
            "asPathList": {},
            "filterUpdateAction": {},
            "type": "neighborfilterlist"
          },
          {
            "asPathList": {},
            "filterUpdateAction": {},
            "type": "neighborfilterlist"
          }
        ],
        "neighborMaximumPrefix": {
          "maxPrefixLimit": 3,
          "thresholdValue": 7,
          "restartInterval": 5,
          "neighborMaximumPrefixOption": {},
          "type": "neighbormaximumprefix"
        },
        "haModeGracefulRestart": false,
        "neighborTimers": {
          "keepAliveInterval": 6,
          "holdTime": 2,
          "minimumHoldTime": 5,
          "type": "neighbortimers"
        },
        "neighborLocalAs": {
          "localAsNumber": "string",
          "neighborLocalAsOption": {},
          "type": "neighborlocalas"
        },
        "ipv6Address": "string",
        "ipv6Prefix": 5,
        "ipv6PrefixListFilter": [
          {
            "filterDirection": {},
            "prefixList": {},
            "type": "ipv6prefixlistfilter"
          },
          {
            "filterDirection": {},
            "prefixList": {},
            "type": "ipv6prefixlistfilter"
          }
        ],
        "type": "neighboripv6"
      },
      {
        "remoteAs": "string",
        "activate": false,
        "neighborGeneral": {
          "description": "string",
          "shutdown": true,
          "fallOverBFD": {},
          "type": "neighborgeneral"
        },
        "neighborAdvanced": {
          "neighborSecret": {},
          "neighborHops": {},
          "neighborVersion": 10,
          "nextHopSelf": false,
          "neighborWeight": 2,
          "sendCommunity": true,
          "neighborTransportConnectionMode": {},
          "neighborTransportPathMTUDiscovery": {},
          "type": "neighboradvanced"
        },
        "neighborRoutes": {
          "advertisementInterval": 2,
          "neighborAdvertiseMaps": [
            {},
            {},
            {},
            {},
            {}
          ],
          "neighborDefaultOriginate": {},
          "removePrivateAs": false,
          "type": "neighborroutes"
        },
        "neighborRouteMap": [
          {
            "routeMap": {},
            "filterUpdateAction": {},
            "type": "neighborroutemap"
          },
          {
            "routeMap": {},
            "filterUpdateAction": {},
            "type": "neighborroutemap"
          },
          {
            "routeMap": {},
            "filterUpdateAction": {},
            "type": "neighborroutemap"
          },
          {
            "routeMap": {},
            "filterUpdateAction": {},
            "type": "neighborroutemap"
          },
          {
            "routeMap": {},
            "filterUpdateAction": {},
            "type": "neighborroutemap"
          },
          {
            "routeMap": {},
            "filterUpdateAction": {},
            "type": "neighborroutemap"
          }
        ],
        "neighborFilterList": [
          {
            "asPathList": {},
            "filterUpdateAction": {},
            "type": "neighborfilterlist"
          },
          {
            "asPathList": {},
            "filterUpdateAction": {},
            "type": "neighborfilterlist"
          },
          {
            "asPathList": {},
            "filterUpdateAction": {},
            "type": "neighborfilterlist"
          },
          {
            "asPathList": {},
            "filterUpdateAction": {},
            "type": "neighborfilterlist"
          },
          {
            "asPathList": {},
            "filterUpdateAction": {},
            "type": "neighborfilterlist"
          },
          {
            "asPathList": {},
            "filterUpdateAction": {},
            "type": "neighborfilterlist"
          },
          {
            "asPathList": {},
            "filterUpdateAction": {},
            "type": "neighborfilterlist"
          },
          {
            "asPathList": {},
            "filterUpdateAction": {},
            "type": "neighborfilterlist"
          }
        ],
        "neighborMaximumPrefix": {
          "maxPrefixLimit": 9,
          "thresholdValue": 4,
          "restartInterval": 2,
          "neighborMaximumPrefixOption": {},
          "type": "neighbormaximumprefix"
        },
        "haModeGracefulRestart": false,
        "neighborTimers": {
          "keepAliveInterval": 7,
          "holdTime": 2,
          "minimumHoldTime": 1,
          "type": "neighbortimers"
        },
        "neighborLocalAs": {
          "localAsNumber": "string",
          "neighborLocalAsOption": {},
          "type": "neighborlocalas"
        },
        "ipv6Address": "string",
        "ipv6Prefix": 7,
        "ipv6PrefixListFilter": [
          {
            "filterDirection": {},
            "prefixList": {},
            "type": "ipv6prefixlistfilter"
          },
          {
            "filterDirection": {},
            "prefixList": {},
            "type": "ipv6prefixlistfilter"
          },
          {
            "filterDirection": {},
            "prefixList": {},
            "type": "ipv6prefixlistfilter"
          },
          {
            "filterDirection": {},
            "prefixList": {},
            "type": "ipv6prefixlistfilter"
          },
          {
            "filterDirection": {},
            "prefixList": {},
            "type": "ipv6prefixlistfilter"
          },
          {
            "filterDirection": {},
            "prefixList": {},
            "type": "ipv6prefixlistfilter"
          }
        ],
        "type": "neighboripv6"
      }
    ],
    "networks": [
      {
        "routeMap": {
          "id": "string",
          "type": "string",
          "version": "string",
          "name": "string"
        },
        "prefixName": "string",
        "ipv6Network": {
          "id": "string",
          "type": "string",
          "version": "string",
          "name": "string"
        },
        "type": "afipv6network"
      },
      {
        "routeMap": {
          "id": "string",
          "type": "string",
          "version": "string",
          "name": "string"
        },
        "prefixName": "string",
        "ipv6Network": {
          "id": "string",
          "type": "string",
          "version": "string",
          "name": "string"
        },
        "type": "afipv6network"
      },
      {
        "routeMap": {
          "id": "string",
          "type": "string",
          "version": "string",
          "name": "string"
        },
        "prefixName": "string",
        "ipv6Network": {
          "id": "string",
          "type": "string",
          "version": "string",
          "name": "string"
        },
        "type": "afipv6network"
      },
      {
        "routeMap": {
          "id": "string",
          "type": "string",
          "version": "string",
          "name": "string"
        },
        "prefixName": "string",
        "ipv6Network": {
          "id": "string",
          "type": "string",
          "version": "string",
          "name": "string"
        },
        "type": "afipv6network"
      },
      {
        "routeMap": {
          "id": "string",
          "type": "string",
          "version": "string",
          "name": "string"
        },
        "prefixName": "string",
        "ipv6Network": {
          "id": "string",
          "type": "string",
          "version": "string",
          "name": "string"
        },
        "type": "afipv6network"
      },
      {
        "routeMap": {
          "id": "string",
          "type": "string",
          "version": "string",
          "name": "string"
        },
        "prefixName": "string",
        "ipv6Network": {
          "id": "string",
          "type": "string",
          "version": "string",
          "name": "string"
        },
        "type": "afipv6network"
      },
      {
        "routeMap": {
          "id": "string",
          "type": "string",
          "version": "string",
          "name": "string"
        },
        "prefixName": "string",
        "ipv6Network": {
          "id": "string",
          "type": "string",
          "version": "string",
          "name": "string"
        },
        "type": "afipv6network"
      },
      {
        "routeMap": {
          "id": "string",
          "type": "string",
          "version": "string",
          "name": "string"
        },
        "prefixName": "string",
        "ipv6Network": {
          "id": "string",
          "type": "string",
          "version": "string",
          "name": "string"
        },
        "type": "afipv6network"
      },
      {
        "routeMap": {
          "id": "string",
          "type": "string",
          "version": "string",
          "name": "string"
        },
        "prefixName": "string",
        "ipv6Network": {
          "id": "string",
          "type": "string",
          "version": "string",
          "name": "string"
        },
        "type": "afipv6network"
      },
      {
        "routeMap": {
          "id": "string",
          "type": "string",
          "version": "string",
          "name": "string"
        },
        "prefixName": "string",
        "ipv6Network": {
          "id": "string",
          "type": "string",
          "version": "string",
          "name": "string"
        },
        "type": "afipv6network"
      }
    ],
    "type": "afipv6"
  },
  "id": "string",
  "type": "bgp",
  "links": {
    "self": "string"
  }
}