{
  "version": "string",
  "name": "string",
  "applications": [
    {
      "id": "string",
      "type": "string",
      "version": "string",
      "name": "string"
    },
    {
      "id": "string",
      "type": "string",
      "version": "string",
      "name": "string"
    }
  ],
  "isSystemDefined": true,
  "id": "string",
  "conditions": [
    {
      "risks": [
        {
          "risk": "CRITICAL",
          "type": "riskcondition"
        }
      ],
      "productivities": [
        {
          "productivity": "VERY_LOW",
          "type": "productivitycondition"
        },
        {
          "productivity": "VERY_HIGH",
          "type": "productivitycondition"
        },
        {
          "productivity": "LOW",
          "type": "productivitycondition"
        },
        {
          "productivity": "HIGH",
          "type": "productivitycondition"
        },
        {
          "productivity": "VERY_HIGH",
          "type": "productivitycondition"
        },
        {
          "productivity": "LOW",
          "type": "productivitycondition"
        },
        {
          "productivity": "MEDIUM",
          "type": "productivitycondition"
        },
        {
          "productivity": "VERY_LOW",
          "type": "productivitycondition"
        },
        {
          "productivity": "UNKNOWN",
          "type": "productivitycondition"
        }
      ],
      "tags": [
        {
          "id": "string",
          "type": "string",
          "version": "string",
          "name": "string"
        },
        {
          "id": "string",
          "type": "string",
          "version": "string",
          "name": "string"
        }
      ],
      "categories": [
        {
          "id": "string",
          "type": "string",
          "version": "string",
          "name": "string"
        },
        {
          "id": "string",
          "type": "string",
          "version": "string",
          "name": "string"
        },
        {
          "id": "string",
          "type": "string",
          "version": "string",
          "name": "string"
        },
        {
          "id": "string",
          "type": "string",
          "version": "string",
          "name": "string"
        },
        {
          "id": "string",
          "type": "string",
          "version": "string",
          "name": "string"
        }
      ],
      "filter": "string",
      "applicationTypes": [
        {
          "applicationType": "SERVER",
          "type": "typecondition"
        },
        {
          "applicationType": "WEBAPP",
          "type": "typecondition"
        },
        {
          "applicationType": "WEBAPP",
          "type": "typecondition"
        },
        {
          "applicationType": "SERVER",
          "type": "typecondition"
        },
        {
          "applicationType": "CLIENT",
          "type": "typecondition"
        },
        {
          "applicationType": "SERVER",
          "type": "typecondition"
        }
      ],
      "type": "applicationfiltercondition"
    },
    {
      "risks": [
        {
          "risk": "LOW",
          "type": "riskcondition"
        },
        {
          "risk": "MEDIUM",
          "type": "riskcondition"
        },
        {
          "risk": "UNKNOWN",
          "type": "riskcondition"
        },
        {
          "risk": "MEDIUM",
          "type": "riskcondition"
        },
        {
          "risk": "CRITICAL",
          "type": "riskcondition"
        }
      ],
      "productivities": [
        {
          "productivity": "LOW",
          "type": "productivitycondition"
        },
        {
          "productivity": "VERY_HIGH",
          "type": "productivitycondition"
        },
        {
          "productivity": "LOW",
          "type": "productivitycondition"
        },
        {
          "productivity": "UNKNOWN",
          "type": "productivitycondition"
        },
        {
          "productivity": "UNKNOWN",
          "type": "productivitycondition"
        }
      ],
      "tags": [
        {
          "id": "string",
          "type": "string",
          "version": "string",
          "name": "string"
        },
        {
          "id": "string",
          "type": "string",
          "version": "string",
          "name": "string"
        },
        {
          "id": "string",
          "type": "string",
          "version": "string",
          "name": "string"
        },
        {
          "id": "string",
          "type": "string",
          "version": "string",
          "name": "string"
        },
        {
          "id": "string",
          "type": "string",
          "version": "string",
          "name": "string"
        },
        {
          "id": "string",
          "type": "string",
          "version": "string",
          "name": "string"
        }
      ],
      "categories": [
        {
          "id": "string",
          "type": "string",
          "version": "string",
          "name": "string"
        },
        {
          "id": "string",
          "type": "string",
          "version": "string",
          "name": "string"
        },
        {
          "id": "string",
          "type": "string",
          "version": "string",
          "name": "string"
        },
        {
          "id": "string",
          "type": "string",
          "version": "string",
          "name": "string"
        },
        {
          "id": "string",
          "type": "string",
          "version": "string",
          "name": "string"
        },
        {
          "id": "string",
          "type": "string",
          "version": "string",
          "name": "string"
        },
        {
          "id": "string",
          "type": "string",
          "version": "string",
          "name": "string"
        },
        {
          "id": "string",
          "type": "string",
          "version": "string",
          "name": "string"
        },
        {
          "id": "string",
          "type": "string",
          "version": "string",
          "name": "string"
        }
      ],
      "filter": "string",
      "applicationTypes": [
        {
          "applicationType": "SERVER",
          "type": "typecondition"
        },
        {
          "applicationType": "WEBAPP",
          "type": "typecondition"
        },
        {
          "applicationType": "SERVER",
          "type": "typecondition"
        },
        {
          "applicationType": "CLIENT",
          "type": "typecondition"
        },
        {
          "applicationType": "WEBAPP",
          "type": "typecondition"
        },
        {
          "applicationType": "SERVER",
          "type": "typecondition"
        },
        {
          "applicationType": "CLIENT",
          "type": "typecondition"
        },
        {
          "applicationType": "WEBAPP",
          "type": "typecondition"
        },
        {
          "applicationType": "SERVER",
          "type": "typecondition"
        },
        {
          "applicationType": "WEBAPP",
          "type": "typecondition"
        }
      ],
      "type": "applicationfiltercondition"
    },
    {
      "risks": [
        {
          "risk": "VERY_LOW",
          "type": "riskcondition"
        },
        {
          "risk": "MEDIUM",
          "type": "riskcondition"
        }
      ],
      "productivities": [
        {
          "productivity": "MEDIUM",
          "type": "productivitycondition"
        },
        {
          "productivity": "VERY_HIGH",
          "type": "productivitycondition"
        },
        {
          "productivity": "MEDIUM",
          "type": "productivitycondition"
        },
        {
          "productivity": "HIGH",
          "type": "productivitycondition"
        },
        {
          "productivity": "UNKNOWN",
          "type": "productivitycondition"
        }
      ],
      "tags": [
        {
          "id": "string",
          "type": "string",
          "version": "string",
          "name": "string"
        },
        {
          "id": "string",
          "type": "string",
          "version": "string",
          "name": "string"
        },
        {
          "id": "string",
          "type": "string",
          "version": "string",
          "name": "string"
        }
      ],
      "categories": [
        {
          "id": "string",
          "type": "string",
          "version": "string",
          "name": "string"
        },
        {
          "id": "string",
          "type": "string",
          "version": "string",
          "name": "string"
        }
      ],
      "filter": "string",
      "applicationTypes": [
        {
          "applicationType": "SERVER",
          "type": "typecondition"
        },
        {
          "applicationType": "SERVER",
          "type": "typecondition"
        },
        {
          "applicationType": "WEBAPP",
          "type": "typecondition"
        },
        {
          "applicationType": "SERVER",
          "type": "typecondition"
        },
        {
          "applicationType": "SERVER",
          "type": "typecondition"
        },
        {
          "applicationType": "SERVER",
          "type": "typecondition"
        },
        {
          "applicationType": "SERVER",
          "type": "typecondition"
        },
        {
          "applicationType": "CLIENT",
          "type": "typecondition"
        }
      ],
      "type": "applicationfiltercondition"
    },
    {
      "risks": [
        {
          "risk": "CRITICAL",
          "type": "riskcondition"
        },
        {
          "risk": "MEDIUM",
          "type": "riskcondition"
        },
        {
          "risk": "MEDIUM",
          "type": "riskcondition"
        },
        {
          "risk": "VERY_LOW",
          "type": "riskcondition"
        },
        {
          "risk": "MEDIUM",
          "type": "riskcondition"
        },
        {
          "risk": "CRITICAL",
          "type": "riskcondition"
        },
        {
          "risk": "LOW",
          "type": "riskcondition"
        },
        {
          "risk": "HIGH",
          "type": "riskcondition"
        },
        {
          "risk": "LOW",
          "type": "riskcondition"
        },
        {
          "risk": "VERY_LOW",
          "type": "riskcondition"
        }
      ],
      "productivities": [
        {
          "productivity": "MEDIUM",
          "type": "productivitycondition"
        }
      ],
      "tags": [
        {
          "id": "string",
          "type": "string",
          "version": "string",
          "name": "string"
        },
        {
          "id": "string",
          "type": "string",
          "version": "string",
          "name": "string"
        },
        {
          "id": "string",
          "type": "string",
          "version": "string",
          "name": "string"
        },
        {
          "id": "string",
          "type": "string",
          "version": "string",
          "name": "string"
        },
        {
          "id": "string",
          "type": "string",
          "version": "string",
          "name": "string"
        },
        {
          "id": "string",
          "type": "string",
          "version": "string",
          "name": "string"
        },
        {
          "id": "string",
          "type": "string",
          "version": "string",
          "name": "string"
        },
        {
          "id": "string",
          "type": "string",
          "version": "string",
          "name": "string"
        }
      ],
      "categories": [
        {
          "id": "string",
          "type": "string",
          "version": "string",
          "name": "string"
        },
        {
          "id": "string",
          "type": "string",
          "version": "string",
          "name": "string"
        },
        {
          "id": "string",
          "type": "string",
          "version": "string",
          "name": "string"
        },
        {
          "id": "string",
          "type": "string",
          "version": "string",
          "name": "string"
        }
      ],
      "filter": "string",
      "applicationTypes": [
        {
          "applicationType": "WEBAPP",
          "type": "typecondition"
        },
        {
          "applicationType": "WEBAPP",
          "type": "typecondition"
        },
        {
          "applicationType": "WEBAPP",
          "type": "typecondition"
        },
        {
          "applicationType": "SERVER",
          "type": "typecondition"
        },
        {
          "applicationType": "SERVER",
          "type": "typecondition"
        },
        {
          "applicationType": "SERVER",
          "type": "typecondition"
        },
        {
          "applicationType": "CLIENT",
          "type": "typecondition"
        },
        {
          "applicationType": "WEBAPP",
          "type": "typecondition"
        }
      ],
      "type": "applicationfiltercondition"
    },
    {
      "risks": [
        {
          "risk": "UNKNOWN",
          "type": "riskcondition"
        },
        {
          "risk": "CRITICAL",
          "type": "riskcondition"
        },
        {
          "risk": "MEDIUM",
          "type": "riskcondition"
        },
        {
          "risk": "MEDIUM",
          "type": "riskcondition"
        },
        {
          "risk": "CRITICAL",
          "type": "riskcondition"
        },
        {
          "risk": "HIGH",
          "type": "riskcondition"
        },
        {
          "risk": "LOW",
          "type": "riskcondition"
        },
        {
          "risk": "VERY_LOW",
          "type": "riskcondition"
        },
        {
          "risk": "CRITICAL",
          "type": "riskcondition"
        },
        {
          "risk": "VERY_LOW",
          "type": "riskcondition"
        }
      ],
      "productivities": [
        {
          "productivity": "HIGH",
          "type": "productivitycondition"
        },
        {
          "productivity": "UNKNOWN",
          "type": "productivitycondition"
        },
        {
          "productivity": "VERY_LOW",
          "type": "productivitycondition"
        },
        {
          "productivity": "VERY_LOW",
          "type": "productivitycondition"
        },
        {
          "productivity": "LOW",
          "type": "productivitycondition"
        },
        {
          "productivity": "UNKNOWN",
          "type": "productivitycondition"
        },
        {
          "productivity": "HIGH",
          "type": "productivitycondition"
        },
        {
          "productivity": "VERY_LOW",
          "type": "productivitycondition"
        },
        {
          "productivity": "VERY_HIGH",
          "type": "productivitycondition"
        }
      ],
      "tags": [
        {
          "id": "string",
          "type": "string",
          "version": "string",
          "name": "string"
        },
        {
          "id": "string",
          "type": "string",
          "version": "string",
          "name": "string"
        },
        {
          "id": "string",
          "type": "string",
          "version": "string",
          "name": "string"
        },
        {
          "id": "string",
          "type": "string",
          "version": "string",
          "name": "string"
        },
        {
          "id": "string",
          "type": "string",
          "version": "string",
          "name": "string"
        },
        {
          "id": "string",
          "type": "string",
          "version": "string",
          "name": "string"
        },
        {
          "id": "string",
          "type": "string",
          "version": "string",
          "name": "string"
        },
        {
          "id": "string",
          "type": "string",
          "version": "string",
          "name": "string"
        }
      ],
      "categories": [
        {
          "id": "string",
          "type": "string",
          "version": "string",
          "name": "string"
        },
        {
          "id": "string",
          "type": "string",
          "version": "string",
          "name": "string"
        },
        {
          "id": "string",
          "type": "string",
          "version": "string",
          "name": "string"
        },
        {
          "id": "string",
          "type": "string",
          "version": "string",
          "name": "string"
        },
        {
          "id": "string",
          "type": "string",
          "version": "string",
          "name": "string"
        },
        {
          "id": "string",
          "type": "string",
          "version": "string",
          "name": "string"
        },
        {
          "id": "string",
          "type": "string",
          "version": "string",
          "name": "string"
        }
      ],
      "filter": "string",
      "applicationTypes": [
        {
          "applicationType": "WEBAPP",
          "type": "typecondition"
        },
        {
          "applicationType": "WEBAPP",
          "type": "typecondition"
        },
        {
          "applicationType": "SERVER",
          "type": "typecondition"
        }
      ],
      "type": "applicationfiltercondition"
    },
    {
      "risks": [
        {
          "risk": "LOW",
          "type": "riskcondition"
        },
        {
          "risk": "LOW",
          "type": "riskcondition"
        },
        {
          "risk": "VERY_LOW",
          "type": "riskcondition"
        },
        {
          "risk": "CRITICAL",
          "type": "riskcondition"
        },
        {
          "risk": "LOW",
          "type": "riskcondition"
        }
      ],
      "productivities": [
        {
          "productivity": "MEDIUM",
          "type": "productivitycondition"
        },
        {
          "productivity": "LOW",
          "type": "productivitycondition"
        },
        {
          "productivity": "LOW",
          "type": "productivitycondition"
        },
        {
          "productivity": "MEDIUM",
          "type": "productivitycondition"
        },
        {
          "productivity": "HIGH",
          "type": "productivitycondition"
        },
        {
          "productivity": "LOW",
          "type": "productivitycondition"
        },
        {
          "productivity": "LOW",
          "type": "productivitycondition"
        },
        {
          "productivity": "VERY_HIGH",
          "type": "productivitycondition"
        }
      ],
      "tags": [
        {
          "id": "string",
          "type": "string",
          "version": "string",
          "name": "string"
        },
        {
          "id": "string",
          "type": "string",
          "version": "string",
          "name": "string"
        },
        {
          "id": "string",
          "type": "string",
          "version": "string",
          "name": "string"
        },
        {
          "id": "string",
          "type": "string",
          "version": "string",
          "name": "string"
        },
        {
          "id": "string",
          "type": "string",
          "version": "string",
          "name": "string"
        },
        {
          "id": "string",
          "type": "string",
          "version": "string",
          "name": "string"
        },
        {
          "id": "string",
          "type": "string",
          "version": "string",
          "name": "string"
        },
        {
          "id": "string",
          "type": "string",
          "version": "string",
          "name": "string"
        }
      ],
      "categories": [
        {
          "id": "string",
          "type": "string",
          "version": "string",
          "name": "string"
        },
        {
          "id": "string",
          "type": "string",
          "version": "string",
          "name": "string"
        },
        {
          "id": "string",
          "type": "string",
          "version": "string",
          "name": "string"
        },
        {
          "id": "string",
          "type": "string",
          "version": "string",
          "name": "string"
        }
      ],
      "filter": "string",
      "applicationTypes": [
        {
          "applicationType": "SERVER",
          "type": "typecondition"
        },
        {
          "applicationType": "CLIENT",
          "type": "typecondition"
        },
        {
          "applicationType": "CLIENT",
          "type": "typecondition"
        },
        {
          "applicationType": "WEBAPP",
          "type": "typecondition"
        },
        {
          "applicationType": "WEBAPP",
          "type": "typecondition"
        },
        {
          "applicationType": "WEBAPP",
          "type": "typecondition"
        },
        {
          "applicationType": "WEBAPP",
          "type": "typecondition"
        },
        {
          "applicationType": "CLIENT",
          "type": "typecondition"
        },
        {
          "applicationType": "SERVER",
          "type": "typecondition"
        },
        {
          "applicationType": "CLIENT",
          "type": "typecondition"
        }
      ],
      "type": "applicationfiltercondition"
    },
    {
      "risks": [
        {
          "risk": "CRITICAL",
          "type": "riskcondition"
        },
        {
          "risk": "CRITICAL",
          "type": "riskcondition"
        },
        {
          "risk": "HIGH",
          "type": "riskcondition"
        },
        {
          "risk": "MEDIUM",
          "type": "riskcondition"
        }
      ],
      "productivities": [
        {
          "productivity": "MEDIUM",
          "type": "productivitycondition"
        },
        {
          "productivity": "LOW",
          "type": "productivitycondition"
        },
        {
          "productivity": "MEDIUM",
          "type": "productivitycondition"
        },
        {
          "productivity": "LOW",
          "type": "productivitycondition"
        }
      ],
      "tags": [
        {
          "id": "string",
          "type": "string",
          "version": "string",
          "name": "string"
        },
        {
          "id": "string",
          "type": "string",
          "version": "string",
          "name": "string"
        },
        {
          "id": "string",
          "type": "string",
          "version": "string",
          "name": "string"
        },
        {
          "id": "string",
          "type": "string",
          "version": "string",
          "name": "string"
        }
      ],
      "categories": [
        {
          "id": "string",
          "type": "string",
          "version": "string",
          "name": "string"
        },
        {
          "id": "string",
          "type": "string",
          "version": "string",
          "name": "string"
        },
        {
          "id": "string",
          "type": "string",
          "version": "string",
          "name": "string"
        },
        {
          "id": "string",
          "type": "string",
          "version": "string",
          "name": "string"
        },
        {
          "id": "string",
          "type": "string",
          "version": "string",
          "name": "string"
        },
        {
          "id": "string",
          "type": "string",
          "version": "string",
          "name": "string"
        },
        {
          "id": "string",
          "type": "string",
          "version": "string",
          "name": "string"
        },
        {
          "id": "string",
          "type": "string",
          "version": "string",
          "name": "string"
        }
      ],
      "filter": "string",
      "applicationTypes": [
        {
          "applicationType": "SERVER",
          "type": "typecondition"
        },
        {
          "applicationType": "WEBAPP",
          "type": "typecondition"
        },
        {
          "applicationType": "SERVER",
          "type": "typecondition"
        },
        {
          "applicationType": "WEBAPP",
          "type": "typecondition"
        }
      ],
      "type": "applicationfiltercondition"
    }
  ],
  "type": "applicationfilter",
  "links": {
    "self": "string"
  }
}