{
  "version": "string",
  "scheduleType": "SINGLE",
  "user": "string",
  "forceOperation": true,
  "jobHistoryUuid": "string",
  "ipAddress": "string",
  "jobName": "string",
  "id": "string",
  "type": "securityintelligenceupdatefeedsimmediate",
  "links": {
    "self": "string"
  }
}