{
  "actions": [
    {
      "name": "getNetworkObjectList",
      "protocol": "REST",
      "method": "GET",
      "entitypath": "{base_path}/{version}/object/networks?{query}",
      "requestSchema": "schema.json",
      "responseSchema": "schema.json",
      "timeout": 0,
      "sendEmpty": false,
      "sendGetBody": false,
      "requestDatatype": "JSON",
      "responseDatatype": "JSON",
      "headers": {},
      "responseObjects": [
        {
          "type": "default",
          "key": "",
          "mockFile": "mockdatafiles/getNetworkObjectList-default.json"
        }
      ]
    },
    {
      "name": "addNetworkObject",
      "protocol": "REST",
      "method": "POST",
      "entitypath": "{base_path}/{version}/object/networks?{query}",
      "requestSchema": "schema.json",
      "responseSchema": "schema.json",
      "timeout": 0,
      "sendEmpty": false,
      "requestDatatype": "JSON",
      "responseDatatype": "JSON",
      "headers": {},
      "responseObjects": [
        {
          "type": "default",
          "key": "",
          "mockFile": "mockdatafiles/addNetworkObject-default.json"
        }
      ]
    },
    {
      "name": "getNetworkObject",
      "protocol": "REST",
      "method": "GET",
      "entitypath": "{base_path}/{version}/object/networks/{pathv1}?{query}",
      "requestSchema": "schema.json",
      "responseSchema": "schema.json",
      "timeout": 0,
      "sendEmpty": false,
      "sendGetBody": false,
      "requestDatatype": "JSON",
      "responseDatatype": "JSON",
      "headers": {},
      "responseObjects": [
        {
          "type": "default",
          "key": "",
          "mockFile": "mockdatafiles/getNetworkObject-default.json"
        }
      ]
    },
    {
      "name": "editNetworkObject",
      "protocol": "REST",
      "method": "PUT",
      "entitypath": "{base_path}/{version}/object/networks/{pathv1}?{query}",
      "requestSchema": "schema.json",
      "responseSchema": "schema.json",
      "timeout": 0,
      "sendEmpty": false,
      "requestDatatype": "JSON",
      "responseDatatype": "JSON",
      "headers": {},
      "responseObjects": [
        {
          "type": "default",
          "key": "",
          "mockFile": "mockdatafiles/editNetworkObject-default.json"
        }
      ]
    },
    {
      "name": "deleteNetworkObject",
      "protocol": "REST",
      "method": "DELETE",
      "entitypath": "{base_path}/{version}/object/networks/{pathv1}?{query}",
      "requestSchema": "schema.json",
      "responseSchema": "schema.json",
      "timeout": 0,
      "sendEmpty": false,
      "requestDatatype": "JSON",
      "responseDatatype": "JSON",
      "headers": {},
      "responseObjects": [
        {
          "type": "default",
          "key": "",
          "mockFile": ""
        }
      ]
    },
    {
      "name": "getNetworkObjectGroupList",
      "protocol": "REST",
      "method": "GET",
      "entitypath": "{base_path}/{version}/object/networkgroups?{query}",
      "requestSchema": "schema.json",
      "responseSchema": "schema.json",
      "timeout": 0,
      "sendEmpty": false,
      "sendGetBody": false,
      "requestDatatype": "JSON",
      "responseDatatype": "JSON",
      "headers": {},
      "responseObjects": [
        {
          "type": "default",
          "key": "",
          "mockFile": "mockdatafiles/getNetworkObjectGroupList-default.json"
        }
      ]
    },
    {
      "name": "addNetworkObjectGroup",
      "protocol": "REST",
      "method": "POST",
      "entitypath": "{base_path}/{version}/object/networkgroups?{query}",
      "requestSchema": "schema.json",
      "responseSchema": "schema.json",
      "timeout": 0,
      "sendEmpty": false,
      "requestDatatype": "JSON",
      "responseDatatype": "JSON",
      "headers": {},
      "responseObjects": [
        {
          "type": "default",
          "key": "",
          "mockFile": "mockdatafiles/addNetworkObjectGroup-default.json"
        }
      ]
    },
    {
      "name": "getNetworkObjectGroup",
      "protocol": "REST",
      "method": "GET",
      "entitypath": "{base_path}/{version}/object/networkgroups/{pathv1}?{query}",
      "requestSchema": "schema.json",
      "responseSchema": "schema.json",
      "timeout": 0,
      "sendEmpty": false,
      "sendGetBody": false,
      "requestDatatype": "JSON",
      "responseDatatype": "JSON",
      "headers": {},
      "responseObjects": [
        {
          "type": "default",
          "key": "",
          "mockFile": "mockdatafiles/getNetworkObjectGroup-default.json"
        }
      ]
    },
    {
      "name": "editNetworkObjectGroup",
      "protocol": "REST",
      "method": "PUT",
      "entitypath": "{base_path}/{version}/object/networkgroups/{pathv1}?{query}",
      "requestSchema": "schema.json",
      "responseSchema": "schema.json",
      "timeout": 0,
      "sendEmpty": false,
      "requestDatatype": "JSON",
      "responseDatatype": "JSON",
      "headers": {},
      "responseObjects": [
        {
          "type": "default",
          "key": "",
          "mockFile": "mockdatafiles/editNetworkObjectGroup-default.json"
        }
      ]
    },
    {
      "name": "deleteNetworkObjectGroup",
      "protocol": "REST",
      "method": "DELETE",
      "entitypath": "{base_path}/{version}/object/networkgroups/{pathv1}?{query}",
      "requestSchema": "schema.json",
      "responseSchema": "schema.json",
      "timeout": 0,
      "sendEmpty": false,
      "requestDatatype": "JSON",
      "responseDatatype": "JSON",
      "headers": {},
      "responseObjects": [
        {
          "type": "default",
          "key": "",
          "mockFile": ""
        }
      ]
    }
  ]
}