{
  "items": [
    {
      "version": "string",
      "scheduleType": "MONTHLY",
      "user": "string",
      "forceOperation": false,
      "jobHistoryUuid": "string",
      "ipAddress": "string",
      "url": "string",
      "jobName": "string",
      "id": "string",
      "type": "pullupgradeimmediate",
      "links": {
        "self": "string"
      }
    },
    {
      "version": "string",
      "scheduleType": "NONE",
      "user": "string",
      "forceOperation": true,
      "jobHistoryUuid": "string",
      "ipAddress": "string",
      "url": "string",
      "jobName": "string",
      "id": "string",
      "type": "pullupgradeimmediate",
      "links": {
        "self": "string"
      }
    },
    {
      "version": "string",
      "scheduleType": "NONE",
      "user": "string",
      "forceOperation": true,
      "jobHistoryUuid": "string",
      "ipAddress": "string",
      "url": "string",
      "jobName": "string",
      "id": "string",
      "type": "pullupgradeimmediate",
      "links": {
        "self": "string"
      }
    },
    {
      "version": "string",
      "scheduleType": "WEEKLY",
      "user": "string",
      "forceOperation": false,
      "jobHistoryUuid": "string",
      "ipAddress": "string",
      "url": "string",
      "jobName": "string",
      "id": "string",
      "type": "pullupgradeimmediate",
      "links": {
        "self": "string"
      }
    },
    {
      "version": "string",
      "scheduleType": "SINGLE",
      "user": "string",
      "forceOperation": true,
      "jobHistoryUuid": "string",
      "ipAddress": "string",
      "url": "string",
      "jobName": "string",
      "id": "string",
      "type": "pullupgradeimmediate",
      "links": {
        "self": "string"
      }
    }
  ],
  "paging": {
    "prev": [
      "string"
    ],
    "next": [
      "string",
      "string"
    ],
    "limit": 6,
    "offset": 6,
    "count": 5,
    "pages": 5
  }
}