{
  "items": [
    {
      "version": "string",
      "name": "string",
      "description": "string",
      "isSystemDefined": true,
      "protocol": "AH",
      "id": "string",
      "type": "protocolobject",
      "links": {
        "self": "string"
      }
    },
    {
      "version": "string",
      "name": "string",
      "description": "string",
      "isSystemDefined": false,
      "protocol": "CFTP",
      "id": "string",
      "type": "protocolobject",
      "links": {
        "self": "string"
      }
    },
    {
      "version": "string",
      "name": "string",
      "description": "string",
      "isSystemDefined": false,
      "protocol": "DIVERT",
      "id": "string",
      "type": "protocolobject",
      "links": {
        "self": "string"
      }
    },
    {
      "version": "string",
      "name": "string",
      "description": "string",
      "isSystemDefined": false,
      "protocol": "IPIP",
      "id": "string",
      "type": "protocolobject",
      "links": {
        "self": "string"
      }
    },
    {
      "version": "string",
      "name": "string",
      "description": "string",
      "isSystemDefined": true,
      "protocol": "SEP",
      "id": "string",
      "type": "protocolobject",
      "links": {
        "self": "string"
      }
    },
    {
      "version": "string",
      "name": "string",
      "description": "string",
      "isSystemDefined": true,
      "protocol": "SPRITERPC",
      "id": "string",
      "type": "protocolobject",
      "links": {
        "self": "string"
      }
    },
    {
      "version": "string",
      "name": "string",
      "description": "string",
      "isSystemDefined": true,
      "protocol": "CFTP",
      "id": "string",
      "type": "protocolobject",
      "links": {
        "self": "string"
      }
    },
    {
      "version": "string",
      "name": "string",
      "description": "string",
      "isSystemDefined": true,
      "protocol": "PGM",
      "id": "string",
      "type": "protocolobject",
      "links": {
        "self": "string"
      }
    },
    {
      "version": "string",
      "name": "string",
      "description": "string",
      "isSystemDefined": true,
      "protocol": "MERITINP",
      "id": "string",
      "type": "protocolobject",
      "links": {
        "self": "string"
      }
    },
    {
      "version": "string",
      "name": "string",
      "description": "string",
      "isSystemDefined": true,
      "protocol": "DDP",
      "id": "string",
      "type": "protocolobject",
      "links": {
        "self": "string"
      }
    }
  ],
  "paging": {
    "prev": [
      "string",
      "string",
      "string",
      "string",
      "string",
      "string",
      "string",
      "string"
    ],
    "next": [
      "string",
      "string",
      "string"
    ],
    "limit": 6,
    "offset": 6,
    "count": 7,
    "pages": 5
  }
}