{
  "version": "string",
  "acceptEULA": false,
  "eulaText": "string",
  "currentPassword": "*********",
  "newPassword": "*********",
  "id": "string",
  "type": "initialprovision",
  "links": {
    "self": "string"
  }
}