{
  "version": "string",
  "name": "string",
  "description": "string",
  "subType": "NETWORK",
  "value": "string",
  "isSystemDefined": false,
  "dnsResolution": "IPV6_ONLY",
  "id": "string",
  "type": "networkobject",
  "links": {
    "self": "string"
  }
}