{
  "items": [
    {
      "version": "string",
      "name": "string",
      "id": "string",
      "type": "objectnatrulecontainer",
      "links": {
        "self": "string"
      }
    },
    {
      "version": "string",
      "name": "string",
      "id": "string",
      "type": "objectnatrulecontainer",
      "links": {
        "self": "string"
      }
    },
    {
      "version": "string",
      "name": "string",
      "id": "string",
      "type": "objectnatrulecontainer",
      "links": {
        "self": "string"
      }
    },
    {
      "version": "string",
      "name": "string",
      "id": "string",
      "type": "objectnatrulecontainer",
      "links": {
        "self": "string"
      }
    }
  ],
  "paging": {
    "prev": [
      "string",
      "string",
      "string",
      "string",
      "string",
      "string",
      "string",
      "string",
      "string"
    ],
    "next": [
      "string",
      "string",
      "string",
      "string",
      "string",
      "string"
    ],
    "limit": 10,
    "offset": 10,
    "count": 1,
    "pages": 9
  }
}