{
  "numberOfObjectsToDeploy": 10,
  "deployedConfigChecksum": {
    "version": "string",
    "checksum": "string",
    "lastUpdatedTimestamp": 3,
    "updatedFrom": "SYNCED_FROM_PEER",
    "id": "string",
    "type": "deployedconfigchecksum"
  },
  "forceDeployment": true,
  "configError": false,
  "id": "string",
  "type": "DeploymentData",
  "links": {
    "self": "string"
  }
}