{
  "version": "string",
  "scheduleType": "NONE",
  "user": "string",
  "forceOperation": false,
  "jobHistoryUuid": "string",
  "ipAddress": "string",
  "name": "string",
  "description": "string",
  "jobName": "string",
  "id": "string",
  "type": "geolocationupdateimmediate",
  "links": {
    "self": "string"
  }
}