{
  "version": "string",
  "name": "string",
  "description": "string",
  "isSystemDefined": true,
  "icmpv6Type": "TIME_EXCEEDED",
  "icmpv6Code": "ROUTER_RENUMBERING_RESULT",
  "id": "string",
  "type": "icmpv6portobject",
  "links": {
    "self": "string"
  }
}