{
  "items": [
    {
      "version": "string",
      "jobName": "string",
      "jobDescription": "string",
      "user": "string",
      "startDateTime": "string",
      "endDateTime": "string",
      "status": "FAILED",
      "statusMessage": "string",
      "scheduleUuid": "string",
      "id": "string",
      "type": "jobhistorygeolocation",
      "links": {
        "self": "string"
      }
    }
  ],
  "paging": {
    "prev": [
      "string",
      "string"
    ],
    "next": [
      "string",
      "string",
      "string",
      "string",
      "string"
    ],
    "limit": 4,
    "offset": 2,
    "count": 1,
    "pages": 2
  }
}