{
  "items": [
    {
      "version": "string",
      "enabled": true,
      "description": "string",
      "ntpServers": [
        "string",
        "string",
        "string",
        "string",
        "string"
      ],
      "id": "string",
      "type": "ntp",
      "links": {
        "self": "string"
      }
    },
    {
      "version": "string",
      "enabled": true,
      "description": "string",
      "ntpServers": [
        "string",
        "string",
        "string",
        "string",
        "string",
        "string",
        "string",
        "string",
        "string",
        "string"
      ],
      "id": "string",
      "type": "ntp",
      "links": {
        "self": "string"
      }
    },
    {
      "version": "string",
      "enabled": true,
      "description": "string",
      "ntpServers": [
        "string",
        "string",
        "string",
        "string",
        "string",
        "string"
      ],
      "id": "string",
      "type": "ntp",
      "links": {
        "self": "string"
      }
    },
    {
      "version": "string",
      "enabled": true,
      "description": "string",
      "ntpServers": [
        "string",
        "string",
        "string",
        "string",
        "string",
        "string",
        "string",
        "string"
      ],
      "id": "string",
      "type": "ntp",
      "links": {
        "self": "string"
      }
    },
    {
      "version": "string",
      "enabled": true,
      "description": "string",
      "ntpServers": [
        "string",
        "string",
        "string",
        "string",
        "string",
        "string",
        "string",
        "string",
        "string",
        "string"
      ],
      "id": "string",
      "type": "ntp",
      "links": {
        "self": "string"
      }
    }
  ],
  "paging": {
    "prev": [
      "string",
      "string",
      "string",
      "string",
      "string",
      "string",
      "string",
      "string",
      "string"
    ],
    "next": [
      "string",
      "string",
      "string",
      "string",
      "string"
    ],
    "limit": 6,
    "offset": 4,
    "count": 6,
    "pages": 10
  }
}