{
  "actions": [
    {
      "name": "getIPV6PrefixListList",
      "protocol": "REST",
      "method": "GET",
      "entitypath": "{base_path}/{version}/object/ipv6prefixlists?{query}",
      "requestSchema": "schema.json",
      "responseSchema": "schema.json",
      "timeout": 0,
      "sendEmpty": false,
      "sendGetBody": false,
      "requestDatatype": "JSON",
      "responseDatatype": "JSON",
      "headers": {},
      "responseObjects": [
        {
          "type": "default",
          "key": "",
          "mockFile": "mockdatafiles/getIPV6PrefixListList-default.json"
        }
      ]
    },
    {
      "name": "addIPV6PrefixList",
      "protocol": "REST",
      "method": "POST",
      "entitypath": "{base_path}/{version}/object/ipv6prefixlists?{query}",
      "requestSchema": "schema.json",
      "responseSchema": "schema.json",
      "timeout": 0,
      "sendEmpty": false,
      "requestDatatype": "JSON",
      "responseDatatype": "JSON",
      "headers": {},
      "responseObjects": [
        {
          "type": "default",
          "key": "",
          "mockFile": "mockdatafiles/addIPV6PrefixList-default.json"
        }
      ]
    },
    {
      "name": "getIPV6PrefixList",
      "protocol": "REST",
      "method": "GET",
      "entitypath": "{base_path}/{version}/object/ipv6prefixlists/{pathv1}?{query}",
      "requestSchema": "schema.json",
      "responseSchema": "schema.json",
      "timeout": 0,
      "sendEmpty": false,
      "sendGetBody": false,
      "requestDatatype": "JSON",
      "responseDatatype": "JSON",
      "headers": {},
      "responseObjects": [
        {
          "type": "default",
          "key": "",
          "mockFile": "mockdatafiles/getIPV6PrefixList-default.json"
        }
      ]
    },
    {
      "name": "editIPV6PrefixList",
      "protocol": "REST",
      "method": "PUT",
      "entitypath": "{base_path}/{version}/object/ipv6prefixlists/{pathv1}?{query}",
      "requestSchema": "schema.json",
      "responseSchema": "schema.json",
      "timeout": 0,
      "sendEmpty": false,
      "requestDatatype": "JSON",
      "responseDatatype": "JSON",
      "headers": {},
      "responseObjects": [
        {
          "type": "default",
          "key": "",
          "mockFile": "mockdatafiles/editIPV6PrefixList-default.json"
        }
      ]
    },
    {
      "name": "deleteIPV6PrefixList",
      "protocol": "REST",
      "method": "DELETE",
      "entitypath": "{base_path}/{version}/object/ipv6prefixlists/{pathv1}?{query}",
      "requestSchema": "schema.json",
      "responseSchema": "schema.json",
      "timeout": 0,
      "sendEmpty": false,
      "requestDatatype": "JSON",
      "responseDatatype": "JSON",
      "headers": {},
      "responseObjects": [
        {
          "type": "default",
          "key": "",
          "mockFile": ""
        }
      ]
    }
  ]
}