{
  "version": "string",
  "name": "string",
  "banner": "string",
  "dnsServerGroup": {
    "id": "string",
    "type": "string",
    "version": "string",
    "name": "string"
  },
  "defaultDomainName": "string",
  "simultaneousLoginPerUser": 3,
  "maxConnectionTimeout": 3,
  "maxConnectionTimeAlertInterval": 9,
  "vpnIdleTimeout": 7,
  "vpnIdleTimeoutAlertInterval": 2,
  "ipv4LocalAddressPool": [
    {
      "id": "string",
      "type": "string",
      "version": "string",
      "name": "string"
    },
    {
      "id": "string",
      "type": "string",
      "version": "string",
      "name": "string"
    },
    {
      "id": "string",
      "type": "string",
      "version": "string",
      "name": "string"
    },
    {
      "id": "string",
      "type": "string",
      "version": "string",
      "name": "string"
    },
    {
      "id": "string",
      "type": "string",
      "version": "string",
      "name": "string"
    },
    {
      "id": "string",
      "type": "string",
      "version": "string",
      "name": "string"
    }
  ],
  "ipv6LocalAddressPool": [
    {
      "id": "string",
      "type": "string",
      "version": "string",
      "name": "string"
    },
    {
      "id": "string",
      "type": "string",
      "version": "string",
      "name": "string"
    },
    {
      "id": "string",
      "type": "string",
      "version": "string",
      "name": "string"
    },
    {
      "id": "string",
      "type": "string",
      "version": "string",
      "name": "string"
    },
    {
      "id": "string",
      "type": "string",
      "version": "string",
      "name": "string"
    },
    {
      "id": "string",
      "type": "string",
      "version": "string",
      "name": "string"
    },
    {
      "id": "string",
      "type": "string",
      "version": "string",
      "name": "string"
    },
    {
      "id": "string",
      "type": "string",
      "version": "string",
      "name": "string"
    }
  ],
  "dhcpScope": {
    "id": "string",
    "type": "string",
    "version": "string",
    "name": "string"
  },
  "ipv4SplitTunnelSetting": "TUNNEL_ALL",
  "ipv6SplitTunnelSetting": "EXCLUDE_SPECIFIED_OVER_TUNNEL",
  "ipv4SplitTunnelNetworks": [
    {
      "id": "string",
      "type": "string",
      "version": "string",
      "name": "string"
    },
    {
      "id": "string",
      "type": "string",
      "version": "string",
      "name": "string"
    },
    {
      "id": "string",
      "type": "string",
      "version": "string",
      "name": "string"
    },
    {
      "id": "string",
      "type": "string",
      "version": "string",
      "name": "string"
    },
    {
      "id": "string",
      "type": "string",
      "version": "string",
      "name": "string"
    },
    {
      "id": "string",
      "type": "string",
      "version": "string",
      "name": "string"
    },
    {
      "id": "string",
      "type": "string",
      "version": "string",
      "name": "string"
    }
  ],
  "ipv6SplitTunnelNetworks": [
    {
      "id": "string",
      "type": "string",
      "version": "string",
      "name": "string"
    },
    {
      "id": "string",
      "type": "string",
      "version": "string",
      "name": "string"
    },
    {
      "id": "string",
      "type": "string",
      "version": "string",
      "name": "string"
    },
    {
      "id": "string",
      "type": "string",
      "version": "string",
      "name": "string"
    },
    {
      "id": "string",
      "type": "string",
      "version": "string",
      "name": "string"
    }
  ],
  "splitDNSRequestPolicy": "TUNNEL_ALL",
  "splitDNSDomainList": "string",
  "scepForwardingUrl": "string",
  "periodicClientCertAuthenticationInterval": 4,
  "enableDTLS": true,
  "enableDTLSCompression": true,
  "sslCompression": "DEFLATE",
  "enableSSLrekey": false,
  "rekeyMethod": "NEW_TUNNEL",
  "rekeyInterval": 7,
  "ignoreDFBit": false,
  "bypassUnsupportProtocol": true,
  "mtuSize": 5,
  "useAlwaysOnVPNSettingInProfile": true,
  "enableKeepAliveMessages": true,
  "keepAliveMessageInterval": 9,
  "enableGatewayDPD": false,
  "gatewayDPDInterval": 7,
  "enableClientDPD": true,
  "clientDPDInterval": 1,
  "clientProfiles": [
    {
      "id": "string",
      "type": "string",
      "version": "string",
      "name": "string"
    },
    {
      "id": "string",
      "type": "string",
      "version": "string",
      "name": "string"
    },
    {
      "id": "string",
      "type": "string",
      "version": "string",
      "name": "string"
    },
    {
      "id": "string",
      "type": "string",
      "version": "string",
      "name": "string"
    },
    {
      "id": "string",
      "type": "string",
      "version": "string",
      "name": "string"
    },
    {
      "id": "string",
      "type": "string",
      "version": "string",
      "name": "string"
    },
    {
      "id": "string",
      "type": "string",
      "version": "string",
      "name": "string"
    },
    {
      "id": "string",
      "type": "string",
      "version": "string",
      "name": "string"
    }
  ],
  "keepInstallerOnClient": false,
  "vpnTrafficFilterACL": {
    "id": "string",
    "type": "string",
    "version": "string",
    "name": "string"
  },
  "enableRestrictVPNToVLAN": true,
  "restrictVPNToVLANId": 1,
  "clientFirewallPrivateNetworkRules": {
    "id": "string",
    "type": "string",
    "version": "string",
    "name": "string"
  },
  "clientFirewallPublicNetworkRules": {
    "id": "string",
    "type": "string",
    "version": "string",
    "name": "string"
  },
  "browserProxyType": "AUTO_DETECT",
  "proxy": {
    "serverHost": "string",
    "port": 4,
    "type": "serverhostandport"
  },
  "proxyExceptions": [
    {
      "serverHost": "string",
      "port": 4,
      "type": "serverhostandport"
    },
    {
      "serverHost": "string",
      "port": 10,
      "type": "serverhostandport"
    },
    {
      "serverHost": "string",
      "port": 7,
      "type": "serverhostandport"
    },
    {
      "serverHost": "string",
      "port": 7,
      "type": "serverhostandport"
    },
    {
      "serverHost": "string",
      "port": 1,
      "type": "serverhostandport"
    },
    {
      "serverHost": "string",
      "port": 7,
      "type": "serverhostandport"
    },
    {
      "serverHost": "string",
      "port": 1,
      "type": "serverhostandport"
    },
    {
      "serverHost": "string",
      "port": 3,
      "type": "serverhostandport"
    },
    {
      "serverHost": "string",
      "port": 7,
      "type": "serverhostandport"
    },
    {
      "serverHost": "string",
      "port": 3,
      "type": "serverhostandport"
    }
  ],
  "isEnablePeriodicClientCertAuthentication": true,
  "id": "string",
  "type": "ravpngrouppolicy",
  "links": {
    "self": "string"
  }
}