{
  "version": "string",
  "name": "string",
  "description": "string",
  "timeZoneObject": {
    "id": "string",
    "type": "string",
    "version": "string",
    "name": "string"
  },
  "id": "string",
  "type": "timezonesetting",
  "links": {
    "self": "string"
  }
}