{
  "actions": [
    {
      "name": "getGeoLocationList",
      "protocol": "REST",
      "method": "GET",
      "entitypath": "{base_path}/{version}/object/geolocations?{query}",
      "requestSchema": "schema.json",
      "responseSchema": "schema.json",
      "timeout": 0,
      "sendEmpty": false,
      "sendGetBody": false,
      "requestDatatype": "JSON",
      "responseDatatype": "JSON",
      "headers": {},
      "responseObjects": [
        {
          "type": "default",
          "key": "",
          "mockFile": "mockdatafiles/getGeoLocationList-default.json"
        }
      ]
    },
    {
      "name": "addGeoLocation",
      "protocol": "REST",
      "method": "POST",
      "entitypath": "{base_path}/{version}/object/geolocations?{query}",
      "requestSchema": "schema.json",
      "responseSchema": "schema.json",
      "timeout": 0,
      "sendEmpty": false,
      "requestDatatype": "JSON",
      "responseDatatype": "JSON",
      "headers": {},
      "responseObjects": [
        {
          "type": "default",
          "key": "",
          "mockFile": "mockdatafiles/addGeoLocation-default.json"
        }
      ]
    },
    {
      "name": "getGeoLocation",
      "protocol": "REST",
      "method": "GET",
      "entitypath": "{base_path}/{version}/object/geolocations/{pathv1}?{query}",
      "requestSchema": "schema.json",
      "responseSchema": "schema.json",
      "timeout": 0,
      "sendEmpty": false,
      "sendGetBody": false,
      "requestDatatype": "JSON",
      "responseDatatype": "JSON",
      "headers": {},
      "responseObjects": [
        {
          "type": "default",
          "key": "",
          "mockFile": "mockdatafiles/getGeoLocation-default.json"
        }
      ]
    },
    {
      "name": "editGeoLocation",
      "protocol": "REST",
      "method": "PUT",
      "entitypath": "{base_path}/{version}/object/geolocations/{pathv1}?{query}",
      "requestSchema": "schema.json",
      "responseSchema": "schema.json",
      "timeout": 0,
      "sendEmpty": false,
      "requestDatatype": "JSON",
      "responseDatatype": "JSON",
      "headers": {},
      "responseObjects": [
        {
          "type": "default",
          "key": "",
          "mockFile": "mockdatafiles/editGeoLocation-default.json"
        }
      ]
    },
    {
      "name": "deleteGeoLocation",
      "protocol": "REST",
      "method": "DELETE",
      "entitypath": "{base_path}/{version}/object/geolocations/{pathv1}?{query}",
      "requestSchema": "schema.json",
      "responseSchema": "schema.json",
      "timeout": 0,
      "sendEmpty": false,
      "requestDatatype": "JSON",
      "responseDatatype": "JSON",
      "headers": {},
      "responseObjects": [
        {
          "type": "default",
          "key": "",
          "mockFile": ""
        }
      ]
    }
  ]
}