{
  "actions": [
    {
      "name": "getPullFileJobList",
      "protocol": "REST",
      "method": "GET",
      "entitypath": "{base_path}/{version}/jobs/pullfilejob?{query}",
      "requestSchema": "schema.json",
      "responseSchema": "schema.json",
      "timeout": 0,
      "sendEmpty": false,
      "sendGetBody": false,
      "requestDatatype": "JSON",
      "responseDatatype": "JSON",
      "headers": {},
      "responseObjects": [
        {
          "type": "default",
          "key": "",
          "mockFile": "mockdatafiles/getPullFileJobList-default.json"
        }
      ]
    },
    {
      "name": "getPullFileJob",
      "protocol": "REST",
      "method": "GET",
      "entitypath": "{base_path}/{version}/jobs/pullfilejob/{pathv1}?{query}",
      "requestSchema": "schema.json",
      "responseSchema": "schema.json",
      "timeout": 0,
      "sendEmpty": false,
      "sendGetBody": false,
      "requestDatatype": "JSON",
      "responseDatatype": "JSON",
      "headers": {},
      "responseObjects": [
        {
          "type": "default",
          "key": "",
          "mockFile": "mockdatafiles/getPullFileJob-default.json"
        }
      ]
    },
    {
      "name": "deletePullFileJob",
      "protocol": "REST",
      "method": "DELETE",
      "entitypath": "{base_path}/{version}/jobs/pullfilejob/{pathv1}?{query}",
      "requestSchema": "schema.json",
      "responseSchema": "schema.json",
      "timeout": 0,
      "sendEmpty": false,
      "requestDatatype": "JSON",
      "responseDatatype": "JSON",
      "headers": {},
      "responseObjects": [
        {
          "type": "default",
          "key": "",
          "mockFile": ""
        }
      ]
    }
  ]
}