{
  "removedInterfaces": [
    {
      "id": "string",
      "type": "string",
      "version": "string",
      "name": "string"
    },
    {
      "id": "string",
      "type": "string",
      "version": "string",
      "name": "string"
    },
    {
      "id": "string",
      "type": "string",
      "version": "string",
      "name": "string"
    },
    {
      "id": "string",
      "type": "string",
      "version": "string",
      "name": "string"
    },
    {
      "id": "string",
      "type": "string",
      "version": "string",
      "name": "string"
    },
    {
      "id": "string",
      "type": "string",
      "version": "string",
      "name": "string"
    },
    {
      "id": "string",
      "type": "string",
      "version": "string",
      "name": "string"
    },
    {
      "id": "string",
      "type": "string",
      "version": "string",
      "name": "string"
    },
    {
      "id": "string",
      "type": "string",
      "version": "string",
      "name": "string"
    }
  ],
  "newInterfaces": [
    {
      "id": "string",
      "type": "string",
      "version": "string",
      "name": "string"
    },
    {
      "id": "string",
      "type": "string",
      "version": "string",
      "name": "string"
    }
  ],
  "returnedInterfaces": [
    {
      "id": "string",
      "type": "string",
      "version": "string",
      "name": "string"
    },
    {
      "id": "string",
      "type": "string",
      "version": "string",
      "name": "string"
    },
    {
      "id": "string",
      "type": "string",
      "version": "string",
      "name": "string"
    },
    {
      "id": "string",
      "type": "string",
      "version": "string",
      "name": "string"
    },
    {
      "id": "string",
      "type": "string",
      "version": "string",
      "name": "string"
    },
    {
      "id": "string",
      "type": "string",
      "version": "string",
      "name": "string"
    },
    {
      "id": "string",
      "type": "string",
      "version": "string",
      "name": "string"
    },
    {
      "id": "string",
      "type": "string",
      "version": "string",
      "name": "string"
    },
    {
      "id": "string",
      "type": "string",
      "version": "string",
      "name": "string"
    },
    {
      "id": "string",
      "type": "string",
      "version": "string",
      "name": "string"
    }
  ],
  "id": "string",
  "type": "InterfacePresenceChange",
  "links": {
    "self": "string"
  }
}