{
  "actions": [
    {
      "name": "getIPV4PrefixListList",
      "protocol": "REST",
      "method": "GET",
      "entitypath": "{base_path}/{version}/object/ipv4prefixlists?{query}",
      "requestSchema": "schema.json",
      "responseSchema": "schema.json",
      "timeout": 0,
      "sendEmpty": false,
      "sendGetBody": false,
      "requestDatatype": "JSON",
      "responseDatatype": "JSON",
      "headers": {},
      "responseObjects": [
        {
          "type": "default",
          "key": "",
          "mockFile": "mockdatafiles/getIPV4PrefixListList-default.json"
        }
      ]
    },
    {
      "name": "addIPV4PrefixList",
      "protocol": "REST",
      "method": "POST",
      "entitypath": "{base_path}/{version}/object/ipv4prefixlists?{query}",
      "requestSchema": "schema.json",
      "responseSchema": "schema.json",
      "timeout": 0,
      "sendEmpty": false,
      "requestDatatype": "JSON",
      "responseDatatype": "JSON",
      "headers": {},
      "responseObjects": [
        {
          "type": "default",
          "key": "",
          "mockFile": "mockdatafiles/addIPV4PrefixList-default.json"
        }
      ]
    },
    {
      "name": "getIPV4PrefixList",
      "protocol": "REST",
      "method": "GET",
      "entitypath": "{base_path}/{version}/object/ipv4prefixlists/{pathv1}?{query}",
      "requestSchema": "schema.json",
      "responseSchema": "schema.json",
      "timeout": 0,
      "sendEmpty": false,
      "sendGetBody": false,
      "requestDatatype": "JSON",
      "responseDatatype": "JSON",
      "headers": {},
      "responseObjects": [
        {
          "type": "default",
          "key": "",
          "mockFile": "mockdatafiles/getIPV4PrefixList-default.json"
        }
      ]
    },
    {
      "name": "editIPV4PrefixList",
      "protocol": "REST",
      "method": "PUT",
      "entitypath": "{base_path}/{version}/object/ipv4prefixlists/{pathv1}?{query}",
      "requestSchema": "schema.json",
      "responseSchema": "schema.json",
      "timeout": 0,
      "sendEmpty": false,
      "requestDatatype": "JSON",
      "responseDatatype": "JSON",
      "headers": {},
      "responseObjects": [
        {
          "type": "default",
          "key": "",
          "mockFile": "mockdatafiles/editIPV4PrefixList-default.json"
        }
      ]
    },
    {
      "name": "deleteIPV4PrefixList",
      "protocol": "REST",
      "method": "DELETE",
      "entitypath": "{base_path}/{version}/object/ipv4prefixlists/{pathv1}?{query}",
      "requestSchema": "schema.json",
      "responseSchema": "schema.json",
      "timeout": 0,
      "sendEmpty": false,
      "requestDatatype": "JSON",
      "responseDatatype": "JSON",
      "headers": {},
      "responseObjects": [
        {
          "type": "default",
          "key": "",
          "mockFile": ""
        }
      ]
    }
  ]
}