{
  "version": "string",
  "name": "string",
  "description": "string",
  "hardwareName": "string",
  "monitorInterface": false,
  "ipv4": {
    "ipType": "STATIC",
    "defaultRouteUsingDHCP": false,
    "dhcpRouteMetric": 8,
    "ipAddress": {
      "ipAddress": "string",
      "netmask": "string",
      "standbyIpAddress": "string",
      "type": "haipv4address"
    },
    "addressNull": false,
    "dhcp": false,
    "type": "interfaceipv4"
  },
  "ipv6": {
    "enabled": true,
    "autoConfig": false,
    "dhcpForManagedConfig": true,
    "dhcpForOtherConfig": false,
    "enableRA": false,
    "dadAttempts": 2,
    "linkLocalAddress": {
      "ipAddress": "string",
      "standbyIpAddress": "string",
      "type": "haipv6address"
    },
    "ipAddresses": [
      {
        "ipAddress": "string",
        "standbyIpAddress": "string",
        "type": "haipv6address"
      }
    ],
    "prefixes": [
      {
        "prefix": "string",
        "type": "ipv6prefix"
      },
      {
        "prefix": "string",
        "type": "ipv6prefix"
      },
      {
        "prefix": "string",
        "type": "ipv6prefix"
      },
      {
        "prefix": "string",
        "type": "ipv6prefix"
      },
      {
        "prefix": "string",
        "type": "ipv6prefix"
      },
      {
        "prefix": "string",
        "type": "ipv6prefix"
      }
    ],
    "type": "interfaceipv6"
  },
  "managementOnly": false,
  "managementInterface": false,
  "mode": "SWITCHPORT",
  "linkState": "DOWN",
  "mtu": 6,
  "enabled": true,
  "macAddress": "string",
  "standbyMacAddress": "string",
  "pppoe": {
    "vpdnGrpName": "string",
    "pppoeUser": "string",
    "pppoePassword": "*********",
    "pppAuthType": "CHAP",
    "setRoute": true,
    "pppoeMetric": 7,
    "ipIsDynamic": true,
    "type": "pppoverethernet"
  },
  "etherChannelID": 5,
  "memberInterfaces": [
    {
      "id": "string",
      "type": "string",
      "version": "string",
      "name": "string"
    },
    {
      "id": "string",
      "type": "string",
      "version": "string",
      "name": "string"
    },
    {
      "id": "string",
      "type": "string",
      "version": "string",
      "name": "string"
    },
    {
      "id": "string",
      "type": "string",
      "version": "string",
      "name": "string"
    }
  ],
  "lacpMode": "PASSIVE",
  "speedType": "TEN_THOUSAND",
  "duplexType": "IGNORE",
  "tenGigabitInterface": true,
  "gigabitInterface": true,
  "id": "string",
  "type": "etherchannelinterface",
  "links": {
    "self": "string"
  }
}