{
  "reasons": [
    "FILE_POLICY_CONFIGURED",
    "SSL_ENABLED",
    "VDB_UPDATE",
    "SSL_DISABLED"
  ],
  "id": "string",
  "type": "TrafficInterruptionReasons",
  "links": {
    "self": "string"
  }
}