{
  "actions": [
    {
      "name": "getAnyConnectClientProfileList",
      "protocol": "REST",
      "method": "GET",
      "entitypath": "{base_path}/{version}/object/anyconnectclientprofiles?{query}",
      "requestSchema": "schema.json",
      "responseSchema": "schema.json",
      "timeout": 0,
      "sendEmpty": false,
      "sendGetBody": false,
      "requestDatatype": "JSON",
      "responseDatatype": "JSON",
      "headers": {},
      "responseObjects": [
        {
          "type": "default",
          "key": "",
          "mockFile": "mockdatafiles/getAnyConnectClientProfileList-default.json"
        }
      ]
    },
    {
      "name": "addAnyConnectClientProfile",
      "protocol": "REST",
      "method": "POST",
      "entitypath": "{base_path}/{version}/object/anyconnectclientprofiles?{query}",
      "requestSchema": "schema.json",
      "responseSchema": "schema.json",
      "timeout": 0,
      "sendEmpty": false,
      "requestDatatype": "JSON",
      "responseDatatype": "JSON",
      "headers": {},
      "responseObjects": [
        {
          "type": "default",
          "key": "",
          "mockFile": "mockdatafiles/addAnyConnectClientProfile-default.json"
        }
      ]
    },
    {
      "name": "getAnyConnectClientProfile",
      "protocol": "REST",
      "method": "GET",
      "entitypath": "{base_path}/{version}/object/anyconnectclientprofiles/{pathv1}?{query}",
      "requestSchema": "schema.json",
      "responseSchema": "schema.json",
      "timeout": 0,
      "sendEmpty": false,
      "sendGetBody": false,
      "requestDatatype": "JSON",
      "responseDatatype": "JSON",
      "headers": {},
      "responseObjects": [
        {
          "type": "default",
          "key": "",
          "mockFile": "mockdatafiles/getAnyConnectClientProfile-default.json"
        }
      ]
    },
    {
      "name": "editAnyConnectClientProfile",
      "protocol": "REST",
      "method": "PUT",
      "entitypath": "{base_path}/{version}/object/anyconnectclientprofiles/{pathv1}?{query}",
      "requestSchema": "schema.json",
      "responseSchema": "schema.json",
      "timeout": 0,
      "sendEmpty": false,
      "requestDatatype": "JSON",
      "responseDatatype": "JSON",
      "headers": {},
      "responseObjects": [
        {
          "type": "default",
          "key": "",
          "mockFile": "mockdatafiles/editAnyConnectClientProfile-default.json"
        }
      ]
    },
    {
      "name": "deleteAnyConnectClientProfile",
      "protocol": "REST",
      "method": "DELETE",
      "entitypath": "{base_path}/{version}/object/anyconnectclientprofiles/{pathv1}?{query}",
      "requestSchema": "schema.json",
      "responseSchema": "schema.json",
      "timeout": 0,
      "sendEmpty": false,
      "requestDatatype": "JSON",
      "responseDatatype": "JSON",
      "headers": {},
      "responseObjects": [
        {
          "type": "default",
          "key": "",
          "mockFile": ""
        }
      ]
    }
  ]
}