{
  "version": "string",
  "name": "string",
  "description": "string",
  "sourceInterface": {
    "id": "string",
    "type": "string",
    "version": "string",
    "name": "string"
  },
  "destinationInterface": {
    "id": "string",
    "type": "string",
    "version": "string",
    "name": "string"
  },
  "natType": "STATIC",
  "patOptions": {
    "patPoolAddress": {
      "id": "string",
      "type": "string",
      "version": "string",
      "name": "string"
    },
    "interfacePat": false,
    "roundRobin": true,
    "flat": false,
    "extended": false,
    "includeReserve": false,
    "type": "patoptions"
  },
  "netToNet": true,
  "noProxyArp": true,
  "dns": false,
  "interfaceIPv6": false,
  "routeLookup": true,
  "enabled": false,
  "interfaceInOriginalDestination": true,
  "interfaceInTranslatedSource": false,
  "originalSource": {
    "id": "string",
    "type": "string",
    "version": "string",
    "name": "string"
  },
  "originalDestination": {
    "id": "string",
    "type": "string",
    "version": "string",
    "name": "string"
  },
  "originalSourcePort": {
    "id": "string",
    "type": "string",
    "version": "string",
    "name": "string"
  },
  "originalDestinationPort": {
    "id": "string",
    "type": "string",
    "version": "string",
    "name": "string"
  },
  "translatedSource": {
    "id": "string",
    "type": "string",
    "version": "string",
    "name": "string"
  },
  "translatedDestination": {
    "id": "string",
    "type": "string",
    "version": "string",
    "name": "string"
  },
  "translatedSourcePort": {
    "id": "string",
    "type": "string",
    "version": "string",
    "name": "string"
  },
  "translatedDestinationPort": {
    "id": "string",
    "type": "string",
    "version": "string",
    "name": "string"
  },
  "unidirectional": false,
  "rulePosition": 5,
  "id": "string",
  "type": "manualnatrule",
  "links": {
    "self": "string"
  }
}