{
  "items": [
    {
      "version": "string",
      "name": "string",
      "description": "string",
      "asNumber": "string",
      "routerId": "string",
      "scanTime": 4,
      "aggregateTimer": 7,
      "bgpNextHopTriggerDelay": 4,
      "bgpNextHopTriggerEnable": true,
      "maxasLimit": 9,
      "logNeighborChanges": false,
      "transportPathMtuDiscovery": true,
      "fastExternalFallOver": true,
      "enforceFirstAs": false,
      "asnotationDot": false,
      "bgpTimers": {
        "keepAlive": 10,
        "holdTime": 8,
        "minHoldTime": 2,
        "type": "bgptimers"
      },
      "bgpGracefulRestart": {
        "gracefulRestart": true,
        "gracefulRestartRestartTime": 8,
        "gracefulRestartStalePathTime": 7,
        "type": "bgpgracefulrestart"
      },
      "bgpBestPath": {
        "defaultLocalPreferenceValue": 3,
        "alwaysCompareMed": true,
        "bestPathCompareRouterId": false,
        "deterministicMed": false,
        "bestPathMedMissingAsWorst": true,
        "type": "bgpbestpath"
      },
      "id": "string",
      "type": "bgpgeneralsettings",
      "links": {
        "self": "string"
      }
    },
    {
      "version": "string",
      "name": "string",
      "description": "string",
      "asNumber": "string",
      "routerId": "string",
      "scanTime": 5,
      "aggregateTimer": 1,
      "bgpNextHopTriggerDelay": 9,
      "bgpNextHopTriggerEnable": false,
      "maxasLimit": 7,
      "logNeighborChanges": true,
      "transportPathMtuDiscovery": false,
      "fastExternalFallOver": true,
      "enforceFirstAs": false,
      "asnotationDot": false,
      "bgpTimers": {
        "keepAlive": 1,
        "holdTime": 7,
        "minHoldTime": 7,
        "type": "bgptimers"
      },
      "bgpGracefulRestart": {
        "gracefulRestart": false,
        "gracefulRestartRestartTime": 2,
        "gracefulRestartStalePathTime": 4,
        "type": "bgpgracefulrestart"
      },
      "bgpBestPath": {
        "defaultLocalPreferenceValue": 9,
        "alwaysCompareMed": true,
        "bestPathCompareRouterId": false,
        "deterministicMed": false,
        "bestPathMedMissingAsWorst": true,
        "type": "bgpbestpath"
      },
      "id": "string",
      "type": "bgpgeneralsettings",
      "links": {
        "self": "string"
      }
    },
    {
      "version": "string",
      "name": "string",
      "description": "string",
      "asNumber": "string",
      "routerId": "string",
      "scanTime": 9,
      "aggregateTimer": 6,
      "bgpNextHopTriggerDelay": 8,
      "bgpNextHopTriggerEnable": true,
      "maxasLimit": 6,
      "logNeighborChanges": false,
      "transportPathMtuDiscovery": false,
      "fastExternalFallOver": false,
      "enforceFirstAs": false,
      "asnotationDot": false,
      "bgpTimers": {
        "keepAlive": 2,
        "holdTime": 5,
        "minHoldTime": 2,
        "type": "bgptimers"
      },
      "bgpGracefulRestart": {
        "gracefulRestart": false,
        "gracefulRestartRestartTime": 4,
        "gracefulRestartStalePathTime": 6,
        "type": "bgpgracefulrestart"
      },
      "bgpBestPath": {
        "defaultLocalPreferenceValue": 3,
        "alwaysCompareMed": true,
        "bestPathCompareRouterId": false,
        "deterministicMed": true,
        "bestPathMedMissingAsWorst": false,
        "type": "bgpbestpath"
      },
      "id": "string",
      "type": "bgpgeneralsettings",
      "links": {
        "self": "string"
      }
    }
  ],
  "paging": {
    "prev": [
      "string",
      "string",
      "string",
      "string"
    ],
    "next": [
      "string"
    ],
    "limit": 1,
    "offset": 6,
    "count": 1,
    "pages": 10
  }
}