{
  "version": "string",
  "name": "string",
  "description": "string",
  "hardwareName": "string",
  "monitorInterface": true,
  "ipv4": {
    "ipType": "PPPOE",
    "defaultRouteUsingDHCP": true,
    "dhcpRouteMetric": 3,
    "ipAddress": {
      "ipAddress": "string",
      "netmask": "string",
      "standbyIpAddress": "string",
      "type": "haipv4address"
    },
    "addressNull": false,
    "dhcp": true,
    "type": "interfaceipv4"
  },
  "ipv6": {
    "enabled": false,
    "autoConfig": false,
    "dhcpForManagedConfig": true,
    "dhcpForOtherConfig": true,
    "enableRA": false,
    "dadAttempts": 9,
    "linkLocalAddress": {
      "ipAddress": "string",
      "standbyIpAddress": "string",
      "type": "haipv6address"
    },
    "ipAddresses": [
      {
        "ipAddress": "string",
        "standbyIpAddress": "string",
        "type": "haipv6address"
      },
      {
        "ipAddress": "string",
        "standbyIpAddress": "string",
        "type": "haipv6address"
      },
      {
        "ipAddress": "string",
        "standbyIpAddress": "string",
        "type": "haipv6address"
      },
      {
        "ipAddress": "string",
        "standbyIpAddress": "string",
        "type": "haipv6address"
      },
      {
        "ipAddress": "string",
        "standbyIpAddress": "string",
        "type": "haipv6address"
      },
      {
        "ipAddress": "string",
        "standbyIpAddress": "string",
        "type": "haipv6address"
      },
      {
        "ipAddress": "string",
        "standbyIpAddress": "string",
        "type": "haipv6address"
      },
      {
        "ipAddress": "string",
        "standbyIpAddress": "string",
        "type": "haipv6address"
      }
    ],
    "prefixes": [
      {
        "prefix": "string",
        "type": "ipv6prefix"
      },
      {
        "prefix": "string",
        "type": "ipv6prefix"
      },
      {
        "prefix": "string",
        "type": "ipv6prefix"
      },
      {
        "prefix": "string",
        "type": "ipv6prefix"
      },
      {
        "prefix": "string",
        "type": "ipv6prefix"
      },
      {
        "prefix": "string",
        "type": "ipv6prefix"
      },
      {
        "prefix": "string",
        "type": "ipv6prefix"
      },
      {
        "prefix": "string",
        "type": "ipv6prefix"
      },
      {
        "prefix": "string",
        "type": "ipv6prefix"
      }
    ],
    "type": "interfaceipv6"
  },
  "managementOnly": false,
  "managementInterface": true,
  "mode": "SWITCHPORT",
  "linkState": "DOWN",
  "mtu": 3,
  "enabled": true,
  "macAddress": "string",
  "standbyMacAddress": "string",
  "pppoe": {
    "vpdnGrpName": "string",
    "pppoeUser": "string",
    "pppoePassword": "*********",
    "pppAuthType": "PAP",
    "setRoute": true,
    "pppoeMetric": 1,
    "ipIsDynamic": false,
    "type": "pppoverethernet"
  },
  "vlanId": 7,
  "tenGigabitInterface": false,
  "gigabitInterface": true,
  "id": "string",
  "type": "vlaninterface",
  "links": {
    "self": "string"
  }
}