{
  "version": "string",
  "name": "string",
  "deviceInterface": {
    "id": "string",
    "type": "string",
    "version": "string",
    "name": "string"
  },
  "useManagementInterface": true,
  "protocol": "UDP",
  "id": "string",
  "host": "string",
  "port": "string",
  "type": "syslogserver",
  "links": {
    "self": "string"
  }
}