{
  "items": [
    {
      "version": "string",
      "scheduleType": "WEEKLY",
      "user": "string",
      "forceOperation": false,
      "jobHistoryUuid": "string",
      "ipAddress": "string",
      "masked": true,
      "jobName": "string",
      "id": "string",
      "type": "scheduleexportconfig",
      "links": {
        "self": "string"
      }
    },
    {
      "version": "string",
      "scheduleType": "CRON",
      "user": "string",
      "forceOperation": false,
      "jobHistoryUuid": "string",
      "ipAddress": "string",
      "masked": true,
      "jobName": "string",
      "id": "string",
      "type": "scheduleexportconfig",
      "links": {
        "self": "string"
      }
    },
    {
      "version": "string",
      "scheduleType": "IMMEDIATE",
      "user": "string",
      "forceOperation": true,
      "jobHistoryUuid": "string",
      "ipAddress": "string",
      "masked": true,
      "jobName": "string",
      "id": "string",
      "type": "scheduleexportconfig",
      "links": {
        "self": "string"
      }
    },
    {
      "version": "string",
      "scheduleType": "NONE",
      "user": "string",
      "forceOperation": true,
      "jobHistoryUuid": "string",
      "ipAddress": "string",
      "masked": false,
      "jobName": "string",
      "id": "string",
      "type": "scheduleexportconfig",
      "links": {
        "self": "string"
      }
    },
    {
      "version": "string",
      "scheduleType": "SINGLE",
      "user": "string",
      "forceOperation": false,
      "jobHistoryUuid": "string",
      "ipAddress": "string",
      "masked": true,
      "jobName": "string",
      "id": "string",
      "type": "scheduleexportconfig",
      "links": {
        "self": "string"
      }
    },
    {
      "version": "string",
      "scheduleType": "HOURLY",
      "user": "string",
      "forceOperation": true,
      "jobHistoryUuid": "string",
      "ipAddress": "string",
      "masked": true,
      "jobName": "string",
      "id": "string",
      "type": "scheduleexportconfig",
      "links": {
        "self": "string"
      }
    }
  ],
  "paging": {
    "prev": [
      "string",
      "string",
      "string",
      "string"
    ],
    "next": [
      "string",
      "string",
      "string",
      "string",
      "string",
      "string",
      "string",
      "string",
      "string"
    ],
    "limit": 7,
    "offset": 10,
    "count": 7,
    "pages": 5
  }
}