{
  "version": "string",
  "scheduleType": "MONTHLY",
  "user": "string",
  "forceOperation": false,
  "jobHistoryUuid": "string",
  "runTimes": "string",
  "name": "string",
  "description": "string",
  "jobName": "string",
  "id": "string",
  "type": "securityintelligenceupdatefeedsschedule",
  "links": {
    "self": "string"
  }
}