{
  "version": "string",
  "name": "string",
  "description": "string",
  "isSystemDefined": true,
  "port": "string",
  "id": "string",
  "type": "tcpportobject",
  "links": {
    "self": "string"
  }
}