{
  "actions": [
    {
      "name": "getUserList",
      "protocol": "REST",
      "method": "GET",
      "entitypath": "{base_path}/{version}/object/users?{query}",
      "requestSchema": "schema.json",
      "responseSchema": "schema.json",
      "timeout": 0,
      "sendEmpty": false,
      "sendGetBody": false,
      "requestDatatype": "JSON",
      "responseDatatype": "JSON",
      "headers": {},
      "responseObjects": [
        {
          "type": "default",
          "key": "",
          "mockFile": "mockdatafiles/getUserList-default.json"
        }
      ]
    },
    {
      "name": "addUser",
      "protocol": "REST",
      "method": "POST",
      "entitypath": "{base_path}/{version}/object/users?{query}",
      "requestSchema": "schema.json",
      "responseSchema": "schema.json",
      "timeout": 0,
      "sendEmpty": false,
      "requestDatatype": "JSON",
      "responseDatatype": "JSON",
      "headers": {},
      "responseObjects": [
        {
          "type": "default",
          "key": "",
          "mockFile": "mockdatafiles/addUser-default.json"
        }
      ]
    },
    {
      "name": "getUser",
      "protocol": "REST",
      "method": "GET",
      "entitypath": "{base_path}/{version}/object/users/{pathv1}?{query}",
      "requestSchema": "schema.json",
      "responseSchema": "schema.json",
      "timeout": 0,
      "sendEmpty": false,
      "sendGetBody": false,
      "requestDatatype": "JSON",
      "responseDatatype": "JSON",
      "headers": {},
      "responseObjects": [
        {
          "type": "default",
          "key": "",
          "mockFile": "mockdatafiles/getUser-default.json"
        }
      ]
    },
    {
      "name": "editUser",
      "protocol": "REST",
      "method": "PUT",
      "entitypath": "{base_path}/{version}/object/users/{pathv1}?{query}",
      "requestSchema": "schema.json",
      "responseSchema": "schema.json",
      "timeout": 0,
      "sendEmpty": false,
      "requestDatatype": "JSON",
      "responseDatatype": "JSON",
      "headers": {},
      "responseObjects": [
        {
          "type": "default",
          "key": "",
          "mockFile": "mockdatafiles/editUser-default.json"
        }
      ]
    },
    {
      "name": "deleteUser",
      "protocol": "REST",
      "method": "DELETE",
      "entitypath": "{base_path}/{version}/object/users/{pathv1}?{query}",
      "requestSchema": "schema.json",
      "responseSchema": "schema.json",
      "timeout": 0,
      "sendEmpty": false,
      "requestDatatype": "JSON",
      "responseDatatype": "JSON",
      "headers": {},
      "responseObjects": [
        {
          "type": "default",
          "key": "",
          "mockFile": ""
        }
      ]
    }
  ]
}