{
  "items": [
    {
      "version": "string",
      "name": "string",
      "description": "string",
      "password": "*********",
      "id": "string",
      "type": "secret",
      "links": {
        "self": "string"
      }
    },
    {
      "version": "string",
      "name": "string",
      "description": "string",
      "password": "*********",
      "id": "string",
      "type": "secret",
      "links": {
        "self": "string"
      }
    },
    {
      "version": "string",
      "name": "string",
      "description": "string",
      "password": "*********",
      "id": "string",
      "type": "secret",
      "links": {
        "self": "string"
      }
    },
    {
      "version": "string",
      "name": "string",
      "description": "string",
      "password": "*********",
      "id": "string",
      "type": "secret",
      "links": {
        "self": "string"
      }
    },
    {
      "version": "string",
      "name": "string",
      "description": "string",
      "password": "*********",
      "id": "string",
      "type": "secret",
      "links": {
        "self": "string"
      }
    },
    {
      "version": "string",
      "name": "string",
      "description": "string",
      "password": "*********",
      "id": "string",
      "type": "secret",
      "links": {
        "self": "string"
      }
    },
    {
      "version": "string",
      "name": "string",
      "description": "string",
      "password": "*********",
      "id": "string",
      "type": "secret",
      "links": {
        "self": "string"
      }
    },
    {
      "version": "string",
      "name": "string",
      "description": "string",
      "password": "*********",
      "id": "string",
      "type": "secret",
      "links": {
        "self": "string"
      }
    },
    {
      "version": "string",
      "name": "string",
      "description": "string",
      "password": "*********",
      "id": "string",
      "type": "secret",
      "links": {
        "self": "string"
      }
    }
  ],
  "paging": {
    "prev": [
      "string"
    ],
    "next": [
      "string",
      "string",
      "string",
      "string",
      "string",
      "string",
      "string"
    ],
    "limit": 6,
    "offset": 1,
    "count": 1,
    "pages": 4
  }
}