{
  "version": "string",
  "name": "string",
  "cert": "*********",
  "privateKey": "*********",
  "passPhrase": "string",
  "issuerCommonName": "string",
  "issuerCountry": "string",
  "issuerLocality": "string",
  "issuerOrganization": "string",
  "issuerOrganizationUnit": "string",
  "issuerState": "string",
  "subjectCommonName": "string",
  "subjectCountry": "string",
  "subjectDistinguishedName": "string",
  "subjectLocality": "string",
  "subjectOrganization": "string",
  "subjectOrganizationUnit": "string",
  "subjectState": "string",
  "validityStartDate": "string",
  "validityEndDate": "string",
  "isSystemDefined": true,
  "id": "string",
  "type": "externalcacertificate",
  "links": {
    "self": "string"
  }
}