{
  "items": [
    {
      "version": "string",
      "name": "string",
      "longDescription": "string",
      "shortDescription": "string",
      "id": "string",
      "type": "networkfeedcategory",
      "links": {
        "self": "string"
      }
    },
    {
      "version": "string",
      "name": "string",
      "longDescription": "string",
      "shortDescription": "string",
      "id": "string",
      "type": "networkfeedcategory",
      "links": {
        "self": "string"
      }
    },
    {
      "version": "string",
      "name": "string",
      "longDescription": "string",
      "shortDescription": "string",
      "id": "string",
      "type": "networkfeedcategory",
      "links": {
        "self": "string"
      }
    },
    {
      "version": "string",
      "name": "string",
      "longDescription": "string",
      "shortDescription": "string",
      "id": "string",
      "type": "networkfeedcategory",
      "links": {
        "self": "string"
      }
    },
    {
      "version": "string",
      "name": "string",
      "longDescription": "string",
      "shortDescription": "string",
      "id": "string",
      "type": "networkfeedcategory",
      "links": {
        "self": "string"
      }
    },
    {
      "version": "string",
      "name": "string",
      "longDescription": "string",
      "shortDescription": "string",
      "id": "string",
      "type": "networkfeedcategory",
      "links": {
        "self": "string"
      }
    }
  ],
  "paging": {
    "prev": [
      "string",
      "string",
      "string",
      "string",
      "string"
    ],
    "next": [
      "string",
      "string",
      "string"
    ],
    "limit": 5,
    "offset": 5,
    "count": 9,
    "pages": 7
  }
}