{
  "version": "string",
  "name": "string",
  "ldapAttributeMaps": [
    {
      "ldapName": "string",
      "ciscoName": "ACCESS_HOURS",
      "valueMappings": [
        {
          "ldapValue": "string",
          "ciscoValue": "string",
          "type": "ldaptociscovaluemapping"
        },
        {
          "ldapValue": "string",
          "ciscoValue": "string",
          "type": "ldaptociscovaluemapping"
        },
        {
          "ldapValue": "string",
          "ciscoValue": "string",
          "type": "ldaptociscovaluemapping"
        },
        {
          "ldapValue": "string",
          "ciscoValue": "string",
          "type": "ldaptociscovaluemapping"
        },
        {
          "ldapValue": "string",
          "ciscoValue": "string",
          "type": "ldaptociscovaluemapping"
        },
        {
          "ldapValue": "string",
          "ciscoValue": "string",
          "type": "ldaptociscovaluemapping"
        },
        {
          "ldapValue": "string",
          "ciscoValue": "string",
          "type": "ldaptociscovaluemapping"
        },
        {
          "ldapValue": "string",
          "ciscoValue": "string",
          "type": "ldaptociscovaluemapping"
        },
        {
          "ldapValue": "string",
          "ciscoValue": "string",
          "type": "ldaptociscovaluemapping"
        },
        {
          "ldapValue": "string",
          "ciscoValue": "string",
          "type": "ldaptociscovaluemapping"
        }
      ],
      "type": "ldapattributemapping"
    },
    {
      "ldapName": "string",
      "ciscoName": "IPSEC_SPLIT_DNS_NAMES",
      "valueMappings": [
        {
          "ldapValue": "string",
          "ciscoValue": "string",
          "type": "ldaptociscovaluemapping"
        },
        {
          "ldapValue": "string",
          "ciscoValue": "string",
          "type": "ldaptociscovaluemapping"
        }
      ],
      "type": "ldapattributemapping"
    },
    {
      "ldapName": "string",
      "ciscoName": "IPSEC_DEFAULT_DOMAIN",
      "valueMappings": [
        {
          "ldapValue": "string",
          "ciscoValue": "string",
          "type": "ldaptociscovaluemapping"
        },
        {
          "ldapValue": "string",
          "ciscoValue": "string",
          "type": "ldaptociscovaluemapping"
        },
        {
          "ldapValue": "string",
          "ciscoValue": "string",
          "type": "ldaptociscovaluemapping"
        },
        {
          "ldapValue": "string",
          "ciscoValue": "string",
          "type": "ldaptociscovaluemapping"
        },
        {
          "ldapValue": "string",
          "ciscoValue": "string",
          "type": "ldaptociscovaluemapping"
        },
        {
          "ldapValue": "string",
          "ciscoValue": "string",
          "type": "ldaptociscovaluemapping"
        },
        {
          "ldapValue": "string",
          "ciscoValue": "string",
          "type": "ldaptociscovaluemapping"
        },
        {
          "ldapValue": "string",
          "ciscoValue": "string",
          "type": "ldaptociscovaluemapping"
        }
      ],
      "type": "ldapattributemapping"
    }
  ],
  "ldapAttributeToGroupPolicyMappings": [
    {
      "ldapName": "string",
      "valueMappings": [
        {
          "ldapValue": "string",
          "groupPolicy": {
            "id": "string",
            "type": "string",
            "version": "string",
            "name": "string"
          },
          "type": "ldaptogrouppolicyvaluemapping"
        },
        {
          "ldapValue": "string",
          "groupPolicy": {
            "id": "string",
            "type": "string",
            "version": "string",
            "name": "string"
          },
          "type": "ldaptogrouppolicyvaluemapping"
        },
        {
          "ldapValue": "string",
          "groupPolicy": {
            "id": "string",
            "type": "string",
            "version": "string",
            "name": "string"
          },
          "type": "ldaptogrouppolicyvaluemapping"
        },
        {
          "ldapValue": "string",
          "groupPolicy": {
            "id": "string",
            "type": "string",
            "version": "string",
            "name": "string"
          },
          "type": "ldaptogrouppolicyvaluemapping"
        },
        {
          "ldapValue": "string",
          "groupPolicy": {
            "id": "string",
            "type": "string",
            "version": "string",
            "name": "string"
          },
          "type": "ldaptogrouppolicyvaluemapping"
        },
        {
          "ldapValue": "string",
          "groupPolicy": {
            "id": "string",
            "type": "string",
            "version": "string",
            "name": "string"
          },
          "type": "ldaptogrouppolicyvaluemapping"
        },
        {
          "ldapValue": "string",
          "groupPolicy": {
            "id": "string",
            "type": "string",
            "version": "string",
            "name": "string"
          },
          "type": "ldaptogrouppolicyvaluemapping"
        },
        {
          "ldapValue": "string",
          "groupPolicy": {
            "id": "string",
            "type": "string",
            "version": "string",
            "name": "string"
          },
          "type": "ldaptogrouppolicyvaluemapping"
        },
        {
          "ldapValue": "string",
          "groupPolicy": {
            "id": "string",
            "type": "string",
            "version": "string",
            "name": "string"
          },
          "type": "ldaptogrouppolicyvaluemapping"
        }
      ],
      "type": "ldapattributetogrouppolicymapping"
    },
    {
      "ldapName": "string",
      "valueMappings": [
        {
          "ldapValue": "string",
          "groupPolicy": {
            "id": "string",
            "type": "string",
            "version": "string",
            "name": "string"
          },
          "type": "ldaptogrouppolicyvaluemapping"
        },
        {
          "ldapValue": "string",
          "groupPolicy": {
            "id": "string",
            "type": "string",
            "version": "string",
            "name": "string"
          },
          "type": "ldaptogrouppolicyvaluemapping"
        },
        {
          "ldapValue": "string",
          "groupPolicy": {
            "id": "string",
            "type": "string",
            "version": "string",
            "name": "string"
          },
          "type": "ldaptogrouppolicyvaluemapping"
        },
        {
          "ldapValue": "string",
          "groupPolicy": {
            "id": "string",
            "type": "string",
            "version": "string",
            "name": "string"
          },
          "type": "ldaptogrouppolicyvaluemapping"
        },
        {
          "ldapValue": "string",
          "groupPolicy": {
            "id": "string",
            "type": "string",
            "version": "string",
            "name": "string"
          },
          "type": "ldaptogrouppolicyvaluemapping"
        }
      ],
      "type": "ldapattributetogrouppolicymapping"
    },
    {
      "ldapName": "string",
      "valueMappings": [
        {
          "ldapValue": "string",
          "groupPolicy": {
            "id": "string",
            "type": "string",
            "version": "string",
            "name": "string"
          },
          "type": "ldaptogrouppolicyvaluemapping"
        },
        {
          "ldapValue": "string",
          "groupPolicy": {
            "id": "string",
            "type": "string",
            "version": "string",
            "name": "string"
          },
          "type": "ldaptogrouppolicyvaluemapping"
        }
      ],
      "type": "ldapattributetogrouppolicymapping"
    },
    {
      "ldapName": "string",
      "valueMappings": [
        {
          "ldapValue": "string",
          "groupPolicy": {
            "id": "string",
            "type": "string",
            "version": "string",
            "name": "string"
          },
          "type": "ldaptogrouppolicyvaluemapping"
        },
        {
          "ldapValue": "string",
          "groupPolicy": {
            "id": "string",
            "type": "string",
            "version": "string",
            "name": "string"
          },
          "type": "ldaptogrouppolicyvaluemapping"
        },
        {
          "ldapValue": "string",
          "groupPolicy": {
            "id": "string",
            "type": "string",
            "version": "string",
            "name": "string"
          },
          "type": "ldaptogrouppolicyvaluemapping"
        },
        {
          "ldapValue": "string",
          "groupPolicy": {
            "id": "string",
            "type": "string",
            "version": "string",
            "name": "string"
          },
          "type": "ldaptogrouppolicyvaluemapping"
        },
        {
          "ldapValue": "string",
          "groupPolicy": {
            "id": "string",
            "type": "string",
            "version": "string",
            "name": "string"
          },
          "type": "ldaptogrouppolicyvaluemapping"
        },
        {
          "ldapValue": "string",
          "groupPolicy": {
            "id": "string",
            "type": "string",
            "version": "string",
            "name": "string"
          },
          "type": "ldaptogrouppolicyvaluemapping"
        },
        {
          "ldapValue": "string",
          "groupPolicy": {
            "id": "string",
            "type": "string",
            "version": "string",
            "name": "string"
          },
          "type": "ldaptogrouppolicyvaluemapping"
        },
        {
          "ldapValue": "string",
          "groupPolicy": {
            "id": "string",
            "type": "string",
            "version": "string",
            "name": "string"
          },
          "type": "ldaptogrouppolicyvaluemapping"
        }
      ],
      "type": "ldapattributetogrouppolicymapping"
    },
    {
      "ldapName": "string",
      "valueMappings": [
        {
          "ldapValue": "string",
          "groupPolicy": {
            "id": "string",
            "type": "string",
            "version": "string",
            "name": "string"
          },
          "type": "ldaptogrouppolicyvaluemapping"
        },
        {
          "ldapValue": "string",
          "groupPolicy": {
            "id": "string",
            "type": "string",
            "version": "string",
            "name": "string"
          },
          "type": "ldaptogrouppolicyvaluemapping"
        }
      ],
      "type": "ldapattributetogrouppolicymapping"
    }
  ],
  "id": "string",
  "type": "ldapattributemap",
  "links": {
    "self": "string"
  }
}