{
  "version": "string",
  "name": "string",
  "maxFailedAttempts": 4,
  "deadTime": 5,
  "description": "string",
  "radiusIdentitySources": [
    {
      "id": "string",
      "type": "string",
      "version": "string",
      "name": "string"
    },
    {
      "id": "string",
      "type": "string",
      "version": "string",
      "name": "string"
    },
    {
      "id": "string",
      "type": "string",
      "version": "string",
      "name": "string"
    }
  ],
  "activeDirectoryRealm": {
    "id": "string",
    "type": "string",
    "version": "string",
    "name": "string"
  },
  "enableDynamicAuthorization": true,
  "dynamicAuthorizationPort": 4,
  "id": "string",
  "type": "radiusidentitysourcegroup",
  "links": {
    "self": "string"
  }
}