{
  "actions": [
    {
      "name": "startHAResume",
      "protocol": "REST",
      "method": "POST",
      "entitypath": "{base_path}/{version}/devices/default/action/ha/resume?{query}",
      "requestSchema": "schema.json",
      "responseSchema": "schema.json",
      "timeout": 0,
      "sendEmpty": false,
      "requestDatatype": "JSON",
      "responseDatatype": "JSON",
      "headers": {},
      "responseObjects": [
        {
          "type": "default",
          "key": "",
          "mockFile": "mockdatafiles/startHAResume-default.json"
        }
      ]
    },
    {
      "name": "startHASuspend",
      "protocol": "REST",
      "method": "POST",
      "entitypath": "{base_path}/{version}/devices/default/action/ha/suspend?{query}",
      "requestSchema": "schema.json",
      "responseSchema": "schema.json",
      "timeout": 0,
      "sendEmpty": false,
      "requestDatatype": "JSON",
      "responseDatatype": "JSON",
      "headers": {},
      "responseObjects": [
        {
          "type": "default",
          "key": "",
          "mockFile": "mockdatafiles/startHASuspend-default.json"
        }
      ]
    },
    {
      "name": "startHAFailover",
      "protocol": "REST",
      "method": "POST",
      "entitypath": "{base_path}/{version}/devices/default/action/ha/failover?{query}",
      "requestSchema": "schema.json",
      "responseSchema": "schema.json",
      "timeout": 0,
      "sendEmpty": false,
      "requestDatatype": "JSON",
      "responseDatatype": "JSON",
      "headers": {},
      "responseObjects": [
        {
          "type": "default",
          "key": "",
          "mockFile": "mockdatafiles/startHAFailover-default.json"
        }
      ]
    },
    {
      "name": "addHAStatus",
      "protocol": "REST",
      "method": "POST",
      "entitypath": "{base_path}/{version}/devices/default/action/ha/reset?{query}",
      "requestSchema": "schema.json",
      "responseSchema": "schema.json",
      "timeout": 0,
      "sendEmpty": false,
      "requestDatatype": "JSON",
      "responseDatatype": "JSON",
      "headers": {},
      "responseObjects": [
        {
          "type": "default",
          "key": "",
          "mockFile": "mockdatafiles/addHAStatus-default.json"
        }
      ]
    }
  ]
}