{
  "version": "string",
  "name": "string",
  "encryptionTypes": [
    "AES_GCM192",
    "AES192",
    "AES_GMAC192"
  ],
  "integrityTypes": [
    "SHA1",
    "MD5",
    "SHA512",
    "SHA512",
    "SHA256",
    "SHA256",
    "SHA384"
  ],
  "cryptoRestricted": false,
  "defaultAssignable": false,
  "summaryLabel": "string",
  "id": "string",
  "isSystemDefined": true,
  "type": "ikevtwoproposal",
  "links": {
    "self": "string"
  }
}