{
  "items": [
    {
      "version": "string",
      "name": "string",
      "description": "string",
      "interfaces": [
        {
          "id": "string",
          "type": "string",
          "version": "string",
          "name": "string"
        },
        {
          "id": "string",
          "type": "string",
          "version": "string",
          "name": "string"
        },
        {
          "id": "string",
          "type": "string",
          "version": "string",
          "name": "string"
        },
        {
          "id": "string",
          "type": "string",
          "version": "string",
          "name": "string"
        },
        {
          "id": "string",
          "type": "string",
          "version": "string",
          "name": "string"
        },
        {
          "id": "string",
          "type": "string",
          "version": "string",
          "name": "string"
        },
        {
          "id": "string",
          "type": "string",
          "version": "string",
          "name": "string"
        }
      ],
      "mode": "SWITCHPORT",
      "id": "string",
      "type": "securityzone",
      "links": {
        "self": "string"
      }
    },
    {
      "version": "string",
      "name": "string",
      "description": "string",
      "interfaces": [
        {
          "id": "string",
          "type": "string",
          "version": "string",
          "name": "string"
        },
        {
          "id": "string",
          "type": "string",
          "version": "string",
          "name": "string"
        }
      ],
      "mode": "PASSIVE",
      "id": "string",
      "type": "securityzone",
      "links": {
        "self": "string"
      }
    },
    {
      "version": "string",
      "name": "string",
      "description": "string",
      "interfaces": [
        {
          "id": "string",
          "type": "string",
          "version": "string",
          "name": "string"
        },
        {
          "id": "string",
          "type": "string",
          "version": "string",
          "name": "string"
        },
        {
          "id": "string",
          "type": "string",
          "version": "string",
          "name": "string"
        },
        {
          "id": "string",
          "type": "string",
          "version": "string",
          "name": "string"
        },
        {
          "id": "string",
          "type": "string",
          "version": "string",
          "name": "string"
        },
        {
          "id": "string",
          "type": "string",
          "version": "string",
          "name": "string"
        }
      ],
      "mode": "PASSIVE",
      "id": "string",
      "type": "securityzone",
      "links": {
        "self": "string"
      }
    },
    {
      "version": "string",
      "name": "string",
      "description": "string",
      "interfaces": [
        {
          "id": "string",
          "type": "string",
          "version": "string",
          "name": "string"
        },
        {
          "id": "string",
          "type": "string",
          "version": "string",
          "name": "string"
        },
        {
          "id": "string",
          "type": "string",
          "version": "string",
          "name": "string"
        },
        {
          "id": "string",
          "type": "string",
          "version": "string",
          "name": "string"
        },
        {
          "id": "string",
          "type": "string",
          "version": "string",
          "name": "string"
        },
        {
          "id": "string",
          "type": "string",
          "version": "string",
          "name": "string"
        }
      ],
      "mode": "BRIDGEGROUPMEMBER",
      "id": "string",
      "type": "securityzone",
      "links": {
        "self": "string"
      }
    },
    {
      "version": "string",
      "name": "string",
      "description": "string",
      "interfaces": [
        {
          "id": "string",
          "type": "string",
          "version": "string",
          "name": "string"
        },
        {
          "id": "string",
          "type": "string",
          "version": "string",
          "name": "string"
        },
        {
          "id": "string",
          "type": "string",
          "version": "string",
          "name": "string"
        },
        {
          "id": "string",
          "type": "string",
          "version": "string",
          "name": "string"
        },
        {
          "id": "string",
          "type": "string",
          "version": "string",
          "name": "string"
        },
        {
          "id": "string",
          "type": "string",
          "version": "string",
          "name": "string"
        },
        {
          "id": "string",
          "type": "string",
          "version": "string",
          "name": "string"
        },
        {
          "id": "string",
          "type": "string",
          "version": "string",
          "name": "string"
        },
        {
          "id": "string",
          "type": "string",
          "version": "string",
          "name": "string"
        },
        {
          "id": "string",
          "type": "string",
          "version": "string",
          "name": "string"
        }
      ],
      "mode": "SWITCHPORT",
      "id": "string",
      "type": "securityzone",
      "links": {
        "self": "string"
      }
    },
    {
      "version": "string",
      "name": "string",
      "description": "string",
      "interfaces": [
        {
          "id": "string",
          "type": "string",
          "version": "string",
          "name": "string"
        },
        {
          "id": "string",
          "type": "string",
          "version": "string",
          "name": "string"
        },
        {
          "id": "string",
          "type": "string",
          "version": "string",
          "name": "string"
        },
        {
          "id": "string",
          "type": "string",
          "version": "string",
          "name": "string"
        },
        {
          "id": "string",
          "type": "string",
          "version": "string",
          "name": "string"
        },
        {
          "id": "string",
          "type": "string",
          "version": "string",
          "name": "string"
        },
        {
          "id": "string",
          "type": "string",
          "version": "string",
          "name": "string"
        },
        {
          "id": "string",
          "type": "string",
          "version": "string",
          "name": "string"
        },
        {
          "id": "string",
          "type": "string",
          "version": "string",
          "name": "string"
        },
        {
          "id": "string",
          "type": "string",
          "version": "string",
          "name": "string"
        }
      ],
      "mode": "BRIDGEGROUPMEMBER",
      "id": "string",
      "type": "securityzone",
      "links": {
        "self": "string"
      }
    }
  ],
  "paging": {
    "prev": [
      "string",
      "string",
      "string",
      "string"
    ],
    "next": [
      "string",
      "string",
      "string",
      "string",
      "string",
      "string",
      "string"
    ],
    "limit": 4,
    "offset": 10,
    "count": 7,
    "pages": 7
  }
}