{
  "items": [
    {
      "version": "string",
      "name": "string",
      "description": "string",
      "hardwareName": "string",
      "monitorInterface": true,
      "ipv4": {
        "ipType": "STATIC",
        "defaultRouteUsingDHCP": true,
        "dhcpRouteMetric": 9,
        "ipAddress": {
          "ipAddress": "string",
          "netmask": "string",
          "standbyIpAddress": "string",
          "type": "haipv4address"
        },
        "addressNull": true,
        "dhcp": false,
        "type": "interfaceipv4"
      },
      "ipv6": {
        "enabled": false,
        "autoConfig": false,
        "dhcpForManagedConfig": true,
        "dhcpForOtherConfig": false,
        "enableRA": true,
        "dadAttempts": 4,
        "linkLocalAddress": {
          "ipAddress": "string",
          "standbyIpAddress": "string",
          "type": "haipv6address"
        },
        "ipAddresses": [
          {
            "ipAddress": "string",
            "standbyIpAddress": "string",
            "type": "haipv6address"
          },
          {
            "ipAddress": "string",
            "standbyIpAddress": "string",
            "type": "haipv6address"
          },
          {
            "ipAddress": "string",
            "standbyIpAddress": "string",
            "type": "haipv6address"
          }
        ],
        "prefixes": [
          {
            "prefix": "string",
            "type": "ipv6prefix"
          },
          {
            "prefix": "string",
            "type": "ipv6prefix"
          },
          {
            "prefix": "string",
            "type": "ipv6prefix"
          },
          {
            "prefix": "string",
            "type": "ipv6prefix"
          }
        ],
        "type": "interfaceipv6"
      },
      "managementOnly": false,
      "managementInterface": false,
      "mode": "PASSIVE",
      "linkState": "UP",
      "mtu": 8,
      "enabled": false,
      "macAddress": "string",
      "standbyMacAddress": "string",
      "pppoe": {
        "vpdnGrpName": "string",
        "pppoeUser": "string",
        "pppoePassword": "*********",
        "pppAuthType": "MSCHAP",
        "setRoute": true,
        "pppoeMetric": 9,
        "ipIsDynamic": false,
        "type": "pppoverethernet"
      },
      "present": false,
      "rulePosition": 2,
      "tenGigabitInterface": false,
      "gigabitInterface": true,
      "id": "string",
      "subIntfId": 1,
      "vlanId": 6,
      "type": "subinterface",
      "links": {
        "self": "string"
      }
    }
  ],
  "paging": {
    "prev": [
      "string"
    ],
    "next": [
      "string",
      "string",
      "string",
      "string",
      "string",
      "string",
      "string",
      "string",
      "string"
    ],
    "limit": 10,
    "offset": 2,
    "count": 1,
    "pages": 1
  }
}