{
  "items": [
    {
      "version": "string",
      "name": "string",
      "banner": "string",
      "dnsServerGroup": {
        "id": "string",
        "type": "string",
        "version": "string",
        "name": "string"
      },
      "defaultDomainName": "string",
      "simultaneousLoginPerUser": 5,
      "maxConnectionTimeout": 1,
      "maxConnectionTimeAlertInterval": 10,
      "vpnIdleTimeout": 2,
      "vpnIdleTimeoutAlertInterval": 7,
      "ipv4LocalAddressPool": [
        {
          "id": "string",
          "type": "string",
          "version": "string",
          "name": "string"
        },
        {
          "id": "string",
          "type": "string",
          "version": "string",
          "name": "string"
        },
        {
          "id": "string",
          "type": "string",
          "version": "string",
          "name": "string"
        },
        {
          "id": "string",
          "type": "string",
          "version": "string",
          "name": "string"
        },
        {
          "id": "string",
          "type": "string",
          "version": "string",
          "name": "string"
        },
        {
          "id": "string",
          "type": "string",
          "version": "string",
          "name": "string"
        }
      ],
      "ipv6LocalAddressPool": [
        {
          "id": "string",
          "type": "string",
          "version": "string",
          "name": "string"
        },
        {
          "id": "string",
          "type": "string",
          "version": "string",
          "name": "string"
        },
        {
          "id": "string",
          "type": "string",
          "version": "string",
          "name": "string"
        },
        {
          "id": "string",
          "type": "string",
          "version": "string",
          "name": "string"
        },
        {
          "id": "string",
          "type": "string",
          "version": "string",
          "name": "string"
        },
        {
          "id": "string",
          "type": "string",
          "version": "string",
          "name": "string"
        },
        {
          "id": "string",
          "type": "string",
          "version": "string",
          "name": "string"
        },
        {
          "id": "string",
          "type": "string",
          "version": "string",
          "name": "string"
        },
        {
          "id": "string",
          "type": "string",
          "version": "string",
          "name": "string"
        }
      ],
      "dhcpScope": {
        "id": "string",
        "type": "string",
        "version": "string",
        "name": "string"
      },
      "ipv4SplitTunnelSetting": "TUNNEL_SPECIFIED",
      "ipv6SplitTunnelSetting": "TUNNEL_SPECIFIED",
      "ipv4SplitTunnelNetworks": [
        {
          "id": "string",
          "type": "string",
          "version": "string",
          "name": "string"
        },
        {
          "id": "string",
          "type": "string",
          "version": "string",
          "name": "string"
        }
      ],
      "ipv6SplitTunnelNetworks": [
        {
          "id": "string",
          "type": "string",
          "version": "string",
          "name": "string"
        },
        {
          "id": "string",
          "type": "string",
          "version": "string",
          "name": "string"
        },
        {
          "id": "string",
          "type": "string",
          "version": "string",
          "name": "string"
        },
        {
          "id": "string",
          "type": "string",
          "version": "string",
          "name": "string"
        },
        {
          "id": "string",
          "type": "string",
          "version": "string",
          "name": "string"
        },
        {
          "id": "string",
          "type": "string",
          "version": "string",
          "name": "string"
        },
        {
          "id": "string",
          "type": "string",
          "version": "string",
          "name": "string"
        }
      ],
      "splitDNSRequestPolicy": "TUNNEL_SPECIFIED_DOMAINS",
      "splitDNSDomainList": "string",
      "scepForwardingUrl": "string",
      "periodicClientCertAuthenticationInterval": 8,
      "enableDTLS": false,
      "enableDTLSCompression": true,
      "sslCompression": "DEFLATE",
      "enableSSLrekey": false,
      "rekeyMethod": "EXISTING_TUNNEL",
      "rekeyInterval": 5,
      "ignoreDFBit": false,
      "bypassUnsupportProtocol": false,
      "mtuSize": 9,
      "useAlwaysOnVPNSettingInProfile": true,
      "enableKeepAliveMessages": true,
      "keepAliveMessageInterval": 8,
      "enableGatewayDPD": false,
      "gatewayDPDInterval": 1,
      "enableClientDPD": true,
      "clientDPDInterval": 8,
      "clientProfiles": [
        {
          "id": "string",
          "type": "string",
          "version": "string",
          "name": "string"
        },
        {
          "id": "string",
          "type": "string",
          "version": "string",
          "name": "string"
        },
        {
          "id": "string",
          "type": "string",
          "version": "string",
          "name": "string"
        },
        {
          "id": "string",
          "type": "string",
          "version": "string",
          "name": "string"
        }
      ],
      "keepInstallerOnClient": false,
      "vpnTrafficFilterACL": {
        "id": "string",
        "type": "string",
        "version": "string",
        "name": "string"
      },
      "enableRestrictVPNToVLAN": false,
      "restrictVPNToVLANId": 1,
      "clientFirewallPrivateNetworkRules": {
        "id": "string",
        "type": "string",
        "version": "string",
        "name": "string"
      },
      "clientFirewallPublicNetworkRules": {
        "id": "string",
        "type": "string",
        "version": "string",
        "name": "string"
      },
      "browserProxyType": "NO_PROXY",
      "proxy": {
        "serverHost": "string",
        "port": 8,
        "type": "serverhostandport"
      },
      "proxyExceptions": [
        {
          "serverHost": "string",
          "port": 2,
          "type": "serverhostandport"
        },
        {
          "serverHost": "string",
          "port": 4,
          "type": "serverhostandport"
        },
        {
          "serverHost": "string",
          "port": 4,
          "type": "serverhostandport"
        },
        {
          "serverHost": "string",
          "port": 8,
          "type": "serverhostandport"
        },
        {
          "serverHost": "string",
          "port": 7,
          "type": "serverhostandport"
        },
        {
          "serverHost": "string",
          "port": 1,
          "type": "serverhostandport"
        },
        {
          "serverHost": "string",
          "port": 5,
          "type": "serverhostandport"
        }
      ],
      "isEnablePeriodicClientCertAuthentication": true,
      "id": "string",
      "type": "ravpngrouppolicy",
      "links": {
        "self": "string"
      }
    },
    {
      "version": "string",
      "name": "string",
      "banner": "string",
      "dnsServerGroup": {
        "id": "string",
        "type": "string",
        "version": "string",
        "name": "string"
      },
      "defaultDomainName": "string",
      "simultaneousLoginPerUser": 2,
      "maxConnectionTimeout": 7,
      "maxConnectionTimeAlertInterval": 1,
      "vpnIdleTimeout": 3,
      "vpnIdleTimeoutAlertInterval": 9,
      "ipv4LocalAddressPool": [
        {
          "id": "string",
          "type": "string",
          "version": "string",
          "name": "string"
        },
        {
          "id": "string",
          "type": "string",
          "version": "string",
          "name": "string"
        },
        {
          "id": "string",
          "type": "string",
          "version": "string",
          "name": "string"
        },
        {
          "id": "string",
          "type": "string",
          "version": "string",
          "name": "string"
        },
        {
          "id": "string",
          "type": "string",
          "version": "string",
          "name": "string"
        }
      ],
      "ipv6LocalAddressPool": [
        {
          "id": "string",
          "type": "string",
          "version": "string",
          "name": "string"
        },
        {
          "id": "string",
          "type": "string",
          "version": "string",
          "name": "string"
        }
      ],
      "dhcpScope": {
        "id": "string",
        "type": "string",
        "version": "string",
        "name": "string"
      },
      "ipv4SplitTunnelSetting": "USE_SPLIT_TUNNEL_SETTING",
      "ipv6SplitTunnelSetting": "TUNNEL_ALL",
      "ipv4SplitTunnelNetworks": [
        {
          "id": "string",
          "type": "string",
          "version": "string",
          "name": "string"
        },
        {
          "id": "string",
          "type": "string",
          "version": "string",
          "name": "string"
        },
        {
          "id": "string",
          "type": "string",
          "version": "string",
          "name": "string"
        },
        {
          "id": "string",
          "type": "string",
          "version": "string",
          "name": "string"
        },
        {
          "id": "string",
          "type": "string",
          "version": "string",
          "name": "string"
        },
        {
          "id": "string",
          "type": "string",
          "version": "string",
          "name": "string"
        }
      ],
      "ipv6SplitTunnelNetworks": [
        {
          "id": "string",
          "type": "string",
          "version": "string",
          "name": "string"
        }
      ],
      "splitDNSRequestPolicy": "USE_SPLIT_TUNNEL_SETTING",
      "splitDNSDomainList": "string",
      "scepForwardingUrl": "string",
      "periodicClientCertAuthenticationInterval": 6,
      "enableDTLS": false,
      "enableDTLSCompression": true,
      "sslCompression": "LZS",
      "enableSSLrekey": false,
      "rekeyMethod": "EXISTING_TUNNEL",
      "rekeyInterval": 10,
      "ignoreDFBit": true,
      "bypassUnsupportProtocol": false,
      "mtuSize": 4,
      "useAlwaysOnVPNSettingInProfile": true,
      "enableKeepAliveMessages": true,
      "keepAliveMessageInterval": 10,
      "enableGatewayDPD": true,
      "gatewayDPDInterval": 3,
      "enableClientDPD": true,
      "clientDPDInterval": 9,
      "clientProfiles": [
        {
          "id": "string",
          "type": "string",
          "version": "string",
          "name": "string"
        },
        {
          "id": "string",
          "type": "string",
          "version": "string",
          "name": "string"
        },
        {
          "id": "string",
          "type": "string",
          "version": "string",
          "name": "string"
        },
        {
          "id": "string",
          "type": "string",
          "version": "string",
          "name": "string"
        },
        {
          "id": "string",
          "type": "string",
          "version": "string",
          "name": "string"
        }
      ],
      "keepInstallerOnClient": false,
      "vpnTrafficFilterACL": {
        "id": "string",
        "type": "string",
        "version": "string",
        "name": "string"
      },
      "enableRestrictVPNToVLAN": true,
      "restrictVPNToVLANId": 9,
      "clientFirewallPrivateNetworkRules": {
        "id": "string",
        "type": "string",
        "version": "string",
        "name": "string"
      },
      "clientFirewallPublicNetworkRules": {
        "id": "string",
        "type": "string",
        "version": "string",
        "name": "string"
      },
      "browserProxyType": "USE_SERVER",
      "proxy": {
        "serverHost": "string",
        "port": 6,
        "type": "serverhostandport"
      },
      "proxyExceptions": [
        {
          "serverHost": "string",
          "port": 2,
          "type": "serverhostandport"
        },
        {
          "serverHost": "string",
          "port": 7,
          "type": "serverhostandport"
        }
      ],
      "isEnablePeriodicClientCertAuthentication": true,
      "id": "string",
      "type": "ravpngrouppolicy",
      "links": {
        "self": "string"
      }
    },
    {
      "version": "string",
      "name": "string",
      "banner": "string",
      "dnsServerGroup": {
        "id": "string",
        "type": "string",
        "version": "string",
        "name": "string"
      },
      "defaultDomainName": "string",
      "simultaneousLoginPerUser": 1,
      "maxConnectionTimeout": 6,
      "maxConnectionTimeAlertInterval": 5,
      "vpnIdleTimeout": 8,
      "vpnIdleTimeoutAlertInterval": 6,
      "ipv4LocalAddressPool": [
        {
          "id": "string",
          "type": "string",
          "version": "string",
          "name": "string"
        },
        {
          "id": "string",
          "type": "string",
          "version": "string",
          "name": "string"
        }
      ],
      "ipv6LocalAddressPool": [
        {
          "id": "string",
          "type": "string",
          "version": "string",
          "name": "string"
        },
        {
          "id": "string",
          "type": "string",
          "version": "string",
          "name": "string"
        },
        {
          "id": "string",
          "type": "string",
          "version": "string",
          "name": "string"
        },
        {
          "id": "string",
          "type": "string",
          "version": "string",
          "name": "string"
        },
        {
          "id": "string",
          "type": "string",
          "version": "string",
          "name": "string"
        }
      ],
      "dhcpScope": {
        "id": "string",
        "type": "string",
        "version": "string",
        "name": "string"
      },
      "ipv4SplitTunnelSetting": "TUNNEL_SPECIFIED",
      "ipv6SplitTunnelSetting": "TUNNEL_SPECIFIED_DOMAINS",
      "ipv4SplitTunnelNetworks": [
        {
          "id": "string",
          "type": "string",
          "version": "string",
          "name": "string"
        },
        {
          "id": "string",
          "type": "string",
          "version": "string",
          "name": "string"
        },
        {
          "id": "string",
          "type": "string",
          "version": "string",
          "name": "string"
        },
        {
          "id": "string",
          "type": "string",
          "version": "string",
          "name": "string"
        },
        {
          "id": "string",
          "type": "string",
          "version": "string",
          "name": "string"
        },
        {
          "id": "string",
          "type": "string",
          "version": "string",
          "name": "string"
        },
        {
          "id": "string",
          "type": "string",
          "version": "string",
          "name": "string"
        },
        {
          "id": "string",
          "type": "string",
          "version": "string",
          "name": "string"
        }
      ],
      "ipv6SplitTunnelNetworks": [
        {
          "id": "string",
          "type": "string",
          "version": "string",
          "name": "string"
        },
        {
          "id": "string",
          "type": "string",
          "version": "string",
          "name": "string"
        },
        {
          "id": "string",
          "type": "string",
          "version": "string",
          "name": "string"
        },
        {
          "id": "string",
          "type": "string",
          "version": "string",
          "name": "string"
        },
        {
          "id": "string",
          "type": "string",
          "version": "string",
          "name": "string"
        },
        {
          "id": "string",
          "type": "string",
          "version": "string",
          "name": "string"
        },
        {
          "id": "string",
          "type": "string",
          "version": "string",
          "name": "string"
        },
        {
          "id": "string",
          "type": "string",
          "version": "string",
          "name": "string"
        },
        {
          "id": "string",
          "type": "string",
          "version": "string",
          "name": "string"
        }
      ],
      "splitDNSRequestPolicy": "TUNNEL_SPECIFIED_DOMAINS",
      "splitDNSDomainList": "string",
      "scepForwardingUrl": "string",
      "periodicClientCertAuthenticationInterval": 7,
      "enableDTLS": false,
      "enableDTLSCompression": false,
      "sslCompression": "LZS",
      "enableSSLrekey": true,
      "rekeyMethod": "NEW_TUNNEL",
      "rekeyInterval": 8,
      "ignoreDFBit": false,
      "bypassUnsupportProtocol": false,
      "mtuSize": 7,
      "useAlwaysOnVPNSettingInProfile": true,
      "enableKeepAliveMessages": false,
      "keepAliveMessageInterval": 6,
      "enableGatewayDPD": false,
      "gatewayDPDInterval": 7,
      "enableClientDPD": true,
      "clientDPDInterval": 6,
      "clientProfiles": [
        {
          "id": "string",
          "type": "string",
          "version": "string",
          "name": "string"
        },
        {
          "id": "string",
          "type": "string",
          "version": "string",
          "name": "string"
        },
        {
          "id": "string",
          "type": "string",
          "version": "string",
          "name": "string"
        },
        {
          "id": "string",
          "type": "string",
          "version": "string",
          "name": "string"
        }
      ],
      "keepInstallerOnClient": false,
      "vpnTrafficFilterACL": {
        "id": "string",
        "type": "string",
        "version": "string",
        "name": "string"
      },
      "enableRestrictVPNToVLAN": true,
      "restrictVPNToVLANId": 4,
      "clientFirewallPrivateNetworkRules": {
        "id": "string",
        "type": "string",
        "version": "string",
        "name": "string"
      },
      "clientFirewallPublicNetworkRules": {
        "id": "string",
        "type": "string",
        "version": "string",
        "name": "string"
      },
      "browserProxyType": "NO_PROXY",
      "proxy": {
        "serverHost": "string",
        "port": 9,
        "type": "serverhostandport"
      },
      "proxyExceptions": [
        {
          "serverHost": "string",
          "port": 6,
          "type": "serverhostandport"
        },
        {
          "serverHost": "string",
          "port": 7,
          "type": "serverhostandport"
        },
        {
          "serverHost": "string",
          "port": 4,
          "type": "serverhostandport"
        },
        {
          "serverHost": "string",
          "port": 3,
          "type": "serverhostandport"
        },
        {
          "serverHost": "string",
          "port": 1,
          "type": "serverhostandport"
        },
        {
          "serverHost": "string",
          "port": 3,
          "type": "serverhostandport"
        },
        {
          "serverHost": "string",
          "port": 8,
          "type": "serverhostandport"
        }
      ],
      "isEnablePeriodicClientCertAuthentication": false,
      "id": "string",
      "type": "ravpngrouppolicy",
      "links": {
        "self": "string"
      }
    },
    {
      "version": "string",
      "name": "string",
      "banner": "string",
      "dnsServerGroup": {
        "id": "string",
        "type": "string",
        "version": "string",
        "name": "string"
      },
      "defaultDomainName": "string",
      "simultaneousLoginPerUser": 5,
      "maxConnectionTimeout": 2,
      "maxConnectionTimeAlertInterval": 1,
      "vpnIdleTimeout": 8,
      "vpnIdleTimeoutAlertInterval": 7,
      "ipv4LocalAddressPool": [
        {
          "id": "string",
          "type": "string",
          "version": "string",
          "name": "string"
        }
      ],
      "ipv6LocalAddressPool": [
        {
          "id": "string",
          "type": "string",
          "version": "string",
          "name": "string"
        },
        {
          "id": "string",
          "type": "string",
          "version": "string",
          "name": "string"
        },
        {
          "id": "string",
          "type": "string",
          "version": "string",
          "name": "string"
        },
        {
          "id": "string",
          "type": "string",
          "version": "string",
          "name": "string"
        },
        {
          "id": "string",
          "type": "string",
          "version": "string",
          "name": "string"
        },
        {
          "id": "string",
          "type": "string",
          "version": "string",
          "name": "string"
        },
        {
          "id": "string",
          "type": "string",
          "version": "string",
          "name": "string"
        },
        {
          "id": "string",
          "type": "string",
          "version": "string",
          "name": "string"
        }
      ],
      "dhcpScope": {
        "id": "string",
        "type": "string",
        "version": "string",
        "name": "string"
      },
      "ipv4SplitTunnelSetting": "TUNNEL_SPECIFIED_DOMAINS",
      "ipv6SplitTunnelSetting": "TUNNEL_SPECIFIED_DOMAINS",
      "ipv4SplitTunnelNetworks": [
        {
          "id": "string",
          "type": "string",
          "version": "string",
          "name": "string"
        }
      ],
      "ipv6SplitTunnelNetworks": [
        {
          "id": "string",
          "type": "string",
          "version": "string",
          "name": "string"
        },
        {
          "id": "string",
          "type": "string",
          "version": "string",
          "name": "string"
        },
        {
          "id": "string",
          "type": "string",
          "version": "string",
          "name": "string"
        }
      ],
      "splitDNSRequestPolicy": "TUNNEL_ALL",
      "splitDNSDomainList": "string",
      "scepForwardingUrl": "string",
      "periodicClientCertAuthenticationInterval": 1,
      "enableDTLS": false,
      "enableDTLSCompression": true,
      "sslCompression": "DISABLED",
      "enableSSLrekey": false,
      "rekeyMethod": "NEW_TUNNEL",
      "rekeyInterval": 4,
      "ignoreDFBit": false,
      "bypassUnsupportProtocol": false,
      "mtuSize": 6,
      "useAlwaysOnVPNSettingInProfile": false,
      "enableKeepAliveMessages": false,
      "keepAliveMessageInterval": 5,
      "enableGatewayDPD": true,
      "gatewayDPDInterval": 6,
      "enableClientDPD": true,
      "clientDPDInterval": 6,
      "clientProfiles": [
        {
          "id": "string",
          "type": "string",
          "version": "string",
          "name": "string"
        },
        {
          "id": "string",
          "type": "string",
          "version": "string",
          "name": "string"
        },
        {
          "id": "string",
          "type": "string",
          "version": "string",
          "name": "string"
        },
        {
          "id": "string",
          "type": "string",
          "version": "string",
          "name": "string"
        }
      ],
      "keepInstallerOnClient": false,
      "vpnTrafficFilterACL": {
        "id": "string",
        "type": "string",
        "version": "string",
        "name": "string"
      },
      "enableRestrictVPNToVLAN": true,
      "restrictVPNToVLANId": 3,
      "clientFirewallPrivateNetworkRules": {
        "id": "string",
        "type": "string",
        "version": "string",
        "name": "string"
      },
      "clientFirewallPublicNetworkRules": {
        "id": "string",
        "type": "string",
        "version": "string",
        "name": "string"
      },
      "browserProxyType": "USE_SERVER",
      "proxy": {
        "serverHost": "string",
        "port": 8,
        "type": "serverhostandport"
      },
      "proxyExceptions": [
        {
          "serverHost": "string",
          "port": 6,
          "type": "serverhostandport"
        },
        {
          "serverHost": "string",
          "port": 1,
          "type": "serverhostandport"
        }
      ],
      "isEnablePeriodicClientCertAuthentication": false,
      "id": "string",
      "type": "ravpngrouppolicy",
      "links": {
        "self": "string"
      }
    },
    {
      "version": "string",
      "name": "string",
      "banner": "string",
      "dnsServerGroup": {
        "id": "string",
        "type": "string",
        "version": "string",
        "name": "string"
      },
      "defaultDomainName": "string",
      "simultaneousLoginPerUser": 1,
      "maxConnectionTimeout": 4,
      "maxConnectionTimeAlertInterval": 2,
      "vpnIdleTimeout": 2,
      "vpnIdleTimeoutAlertInterval": 8,
      "ipv4LocalAddressPool": [
        {
          "id": "string",
          "type": "string",
          "version": "string",
          "name": "string"
        },
        {
          "id": "string",
          "type": "string",
          "version": "string",
          "name": "string"
        },
        {
          "id": "string",
          "type": "string",
          "version": "string",
          "name": "string"
        },
        {
          "id": "string",
          "type": "string",
          "version": "string",
          "name": "string"
        },
        {
          "id": "string",
          "type": "string",
          "version": "string",
          "name": "string"
        }
      ],
      "ipv6LocalAddressPool": [
        {
          "id": "string",
          "type": "string",
          "version": "string",
          "name": "string"
        },
        {
          "id": "string",
          "type": "string",
          "version": "string",
          "name": "string"
        },
        {
          "id": "string",
          "type": "string",
          "version": "string",
          "name": "string"
        },
        {
          "id": "string",
          "type": "string",
          "version": "string",
          "name": "string"
        },
        {
          "id": "string",
          "type": "string",
          "version": "string",
          "name": "string"
        },
        {
          "id": "string",
          "type": "string",
          "version": "string",
          "name": "string"
        },
        {
          "id": "string",
          "type": "string",
          "version": "string",
          "name": "string"
        },
        {
          "id": "string",
          "type": "string",
          "version": "string",
          "name": "string"
        },
        {
          "id": "string",
          "type": "string",
          "version": "string",
          "name": "string"
        }
      ],
      "dhcpScope": {
        "id": "string",
        "type": "string",
        "version": "string",
        "name": "string"
      },
      "ipv4SplitTunnelSetting": "TUNNEL_ALL",
      "ipv6SplitTunnelSetting": "TUNNEL_SPECIFIED",
      "ipv4SplitTunnelNetworks": [
        {
          "id": "string",
          "type": "string",
          "version": "string",
          "name": "string"
        },
        {
          "id": "string",
          "type": "string",
          "version": "string",
          "name": "string"
        },
        {
          "id": "string",
          "type": "string",
          "version": "string",
          "name": "string"
        },
        {
          "id": "string",
          "type": "string",
          "version": "string",
          "name": "string"
        },
        {
          "id": "string",
          "type": "string",
          "version": "string",
          "name": "string"
        },
        {
          "id": "string",
          "type": "string",
          "version": "string",
          "name": "string"
        },
        {
          "id": "string",
          "type": "string",
          "version": "string",
          "name": "string"
        },
        {
          "id": "string",
          "type": "string",
          "version": "string",
          "name": "string"
        }
      ],
      "ipv6SplitTunnelNetworks": [
        {
          "id": "string",
          "type": "string",
          "version": "string",
          "name": "string"
        },
        {
          "id": "string",
          "type": "string",
          "version": "string",
          "name": "string"
        },
        {
          "id": "string",
          "type": "string",
          "version": "string",
          "name": "string"
        },
        {
          "id": "string",
          "type": "string",
          "version": "string",
          "name": "string"
        },
        {
          "id": "string",
          "type": "string",
          "version": "string",
          "name": "string"
        }
      ],
      "splitDNSRequestPolicy": "TUNNEL_SPECIFIED_DOMAINS",
      "splitDNSDomainList": "string",
      "scepForwardingUrl": "string",
      "periodicClientCertAuthenticationInterval": 8,
      "enableDTLS": false,
      "enableDTLSCompression": false,
      "sslCompression": "DISABLED",
      "enableSSLrekey": true,
      "rekeyMethod": "EXISTING_TUNNEL",
      "rekeyInterval": 6,
      "ignoreDFBit": true,
      "bypassUnsupportProtocol": false,
      "mtuSize": 2,
      "useAlwaysOnVPNSettingInProfile": false,
      "enableKeepAliveMessages": false,
      "keepAliveMessageInterval": 1,
      "enableGatewayDPD": false,
      "gatewayDPDInterval": 6,
      "enableClientDPD": true,
      "clientDPDInterval": 3,
      "clientProfiles": [
        {
          "id": "string",
          "type": "string",
          "version": "string",
          "name": "string"
        },
        {
          "id": "string",
          "type": "string",
          "version": "string",
          "name": "string"
        },
        {
          "id": "string",
          "type": "string",
          "version": "string",
          "name": "string"
        },
        {
          "id": "string",
          "type": "string",
          "version": "string",
          "name": "string"
        },
        {
          "id": "string",
          "type": "string",
          "version": "string",
          "name": "string"
        },
        {
          "id": "string",
          "type": "string",
          "version": "string",
          "name": "string"
        },
        {
          "id": "string",
          "type": "string",
          "version": "string",
          "name": "string"
        },
        {
          "id": "string",
          "type": "string",
          "version": "string",
          "name": "string"
        },
        {
          "id": "string",
          "type": "string",
          "version": "string",
          "name": "string"
        },
        {
          "id": "string",
          "type": "string",
          "version": "string",
          "name": "string"
        }
      ],
      "keepInstallerOnClient": false,
      "vpnTrafficFilterACL": {
        "id": "string",
        "type": "string",
        "version": "string",
        "name": "string"
      },
      "enableRestrictVPNToVLAN": true,
      "restrictVPNToVLANId": 7,
      "clientFirewallPrivateNetworkRules": {
        "id": "string",
        "type": "string",
        "version": "string",
        "name": "string"
      },
      "clientFirewallPublicNetworkRules": {
        "id": "string",
        "type": "string",
        "version": "string",
        "name": "string"
      },
      "browserProxyType": "NO_MODIFY",
      "proxy": {
        "serverHost": "string",
        "port": 9,
        "type": "serverhostandport"
      },
      "proxyExceptions": [
        {
          "serverHost": "string",
          "port": 3,
          "type": "serverhostandport"
        },
        {
          "serverHost": "string",
          "port": 7,
          "type": "serverhostandport"
        },
        {
          "serverHost": "string",
          "port": 9,
          "type": "serverhostandport"
        },
        {
          "serverHost": "string",
          "port": 5,
          "type": "serverhostandport"
        },
        {
          "serverHost": "string",
          "port": 3,
          "type": "serverhostandport"
        },
        {
          "serverHost": "string",
          "port": 7,
          "type": "serverhostandport"
        },
        {
          "serverHost": "string",
          "port": 3,
          "type": "serverhostandport"
        },
        {
          "serverHost": "string",
          "port": 9,
          "type": "serverhostandport"
        }
      ],
      "isEnablePeriodicClientCertAuthentication": true,
      "id": "string",
      "type": "ravpngrouppolicy",
      "links": {
        "self": "string"
      }
    },
    {
      "version": "string",
      "name": "string",
      "banner": "string",
      "dnsServerGroup": {
        "id": "string",
        "type": "string",
        "version": "string",
        "name": "string"
      },
      "defaultDomainName": "string",
      "simultaneousLoginPerUser": 7,
      "maxConnectionTimeout": 8,
      "maxConnectionTimeAlertInterval": 2,
      "vpnIdleTimeout": 3,
      "vpnIdleTimeoutAlertInterval": 7,
      "ipv4LocalAddressPool": [
        {
          "id": "string",
          "type": "string",
          "version": "string",
          "name": "string"
        },
        {
          "id": "string",
          "type": "string",
          "version": "string",
          "name": "string"
        },
        {
          "id": "string",
          "type": "string",
          "version": "string",
          "name": "string"
        },
        {
          "id": "string",
          "type": "string",
          "version": "string",
          "name": "string"
        },
        {
          "id": "string",
          "type": "string",
          "version": "string",
          "name": "string"
        },
        {
          "id": "string",
          "type": "string",
          "version": "string",
          "name": "string"
        }
      ],
      "ipv6LocalAddressPool": [
        {
          "id": "string",
          "type": "string",
          "version": "string",
          "name": "string"
        }
      ],
      "dhcpScope": {
        "id": "string",
        "type": "string",
        "version": "string",
        "name": "string"
      },
      "ipv4SplitTunnelSetting": "TUNNEL_SPECIFIED",
      "ipv6SplitTunnelSetting": "TUNNEL_SPECIFIED",
      "ipv4SplitTunnelNetworks": [
        {
          "id": "string",
          "type": "string",
          "version": "string",
          "name": "string"
        }
      ],
      "ipv6SplitTunnelNetworks": [
        {
          "id": "string",
          "type": "string",
          "version": "string",
          "name": "string"
        },
        {
          "id": "string",
          "type": "string",
          "version": "string",
          "name": "string"
        },
        {
          "id": "string",
          "type": "string",
          "version": "string",
          "name": "string"
        },
        {
          "id": "string",
          "type": "string",
          "version": "string",
          "name": "string"
        },
        {
          "id": "string",
          "type": "string",
          "version": "string",
          "name": "string"
        },
        {
          "id": "string",
          "type": "string",
          "version": "string",
          "name": "string"
        }
      ],
      "splitDNSRequestPolicy": "USE_SPLIT_TUNNEL_SETTING",
      "splitDNSDomainList": "string",
      "scepForwardingUrl": "string",
      "periodicClientCertAuthenticationInterval": 4,
      "enableDTLS": false,
      "enableDTLSCompression": true,
      "sslCompression": "LZS",
      "enableSSLrekey": false,
      "rekeyMethod": "NEW_TUNNEL",
      "rekeyInterval": 5,
      "ignoreDFBit": false,
      "bypassUnsupportProtocol": true,
      "mtuSize": 10,
      "useAlwaysOnVPNSettingInProfile": false,
      "enableKeepAliveMessages": false,
      "keepAliveMessageInterval": 2,
      "enableGatewayDPD": false,
      "gatewayDPDInterval": 9,
      "enableClientDPD": true,
      "clientDPDInterval": 7,
      "clientProfiles": [
        {
          "id": "string",
          "type": "string",
          "version": "string",
          "name": "string"
        },
        {
          "id": "string",
          "type": "string",
          "version": "string",
          "name": "string"
        },
        {
          "id": "string",
          "type": "string",
          "version": "string",
          "name": "string"
        },
        {
          "id": "string",
          "type": "string",
          "version": "string",
          "name": "string"
        },
        {
          "id": "string",
          "type": "string",
          "version": "string",
          "name": "string"
        },
        {
          "id": "string",
          "type": "string",
          "version": "string",
          "name": "string"
        }
      ],
      "keepInstallerOnClient": false,
      "vpnTrafficFilterACL": {
        "id": "string",
        "type": "string",
        "version": "string",
        "name": "string"
      },
      "enableRestrictVPNToVLAN": true,
      "restrictVPNToVLANId": 2,
      "clientFirewallPrivateNetworkRules": {
        "id": "string",
        "type": "string",
        "version": "string",
        "name": "string"
      },
      "clientFirewallPublicNetworkRules": {
        "id": "string",
        "type": "string",
        "version": "string",
        "name": "string"
      },
      "browserProxyType": "USE_SERVER",
      "proxy": {
        "serverHost": "string",
        "port": 1,
        "type": "serverhostandport"
      },
      "proxyExceptions": [
        {
          "serverHost": "string",
          "port": 9,
          "type": "serverhostandport"
        },
        {
          "serverHost": "string",
          "port": 2,
          "type": "serverhostandport"
        }
      ],
      "isEnablePeriodicClientCertAuthentication": false,
      "id": "string",
      "type": "ravpngrouppolicy",
      "links": {
        "self": "string"
      }
    },
    {
      "version": "string",
      "name": "string",
      "banner": "string",
      "dnsServerGroup": {
        "id": "string",
        "type": "string",
        "version": "string",
        "name": "string"
      },
      "defaultDomainName": "string",
      "simultaneousLoginPerUser": 1,
      "maxConnectionTimeout": 6,
      "maxConnectionTimeAlertInterval": 5,
      "vpnIdleTimeout": 3,
      "vpnIdleTimeoutAlertInterval": 9,
      "ipv4LocalAddressPool": [
        {
          "id": "string",
          "type": "string",
          "version": "string",
          "name": "string"
        },
        {
          "id": "string",
          "type": "string",
          "version": "string",
          "name": "string"
        },
        {
          "id": "string",
          "type": "string",
          "version": "string",
          "name": "string"
        },
        {
          "id": "string",
          "type": "string",
          "version": "string",
          "name": "string"
        },
        {
          "id": "string",
          "type": "string",
          "version": "string",
          "name": "string"
        },
        {
          "id": "string",
          "type": "string",
          "version": "string",
          "name": "string"
        },
        {
          "id": "string",
          "type": "string",
          "version": "string",
          "name": "string"
        }
      ],
      "ipv6LocalAddressPool": [
        {
          "id": "string",
          "type": "string",
          "version": "string",
          "name": "string"
        }
      ],
      "dhcpScope": {
        "id": "string",
        "type": "string",
        "version": "string",
        "name": "string"
      },
      "ipv4SplitTunnelSetting": "TUNNEL_SPECIFIED_DOMAINS",
      "ipv6SplitTunnelSetting": "EXCLUDE_SPECIFIED_OVER_TUNNEL",
      "ipv4SplitTunnelNetworks": [
        {
          "id": "string",
          "type": "string",
          "version": "string",
          "name": "string"
        },
        {
          "id": "string",
          "type": "string",
          "version": "string",
          "name": "string"
        },
        {
          "id": "string",
          "type": "string",
          "version": "string",
          "name": "string"
        },
        {
          "id": "string",
          "type": "string",
          "version": "string",
          "name": "string"
        },
        {
          "id": "string",
          "type": "string",
          "version": "string",
          "name": "string"
        },
        {
          "id": "string",
          "type": "string",
          "version": "string",
          "name": "string"
        },
        {
          "id": "string",
          "type": "string",
          "version": "string",
          "name": "string"
        },
        {
          "id": "string",
          "type": "string",
          "version": "string",
          "name": "string"
        }
      ],
      "ipv6SplitTunnelNetworks": [
        {
          "id": "string",
          "type": "string",
          "version": "string",
          "name": "string"
        },
        {
          "id": "string",
          "type": "string",
          "version": "string",
          "name": "string"
        },
        {
          "id": "string",
          "type": "string",
          "version": "string",
          "name": "string"
        },
        {
          "id": "string",
          "type": "string",
          "version": "string",
          "name": "string"
        },
        {
          "id": "string",
          "type": "string",
          "version": "string",
          "name": "string"
        },
        {
          "id": "string",
          "type": "string",
          "version": "string",
          "name": "string"
        },
        {
          "id": "string",
          "type": "string",
          "version": "string",
          "name": "string"
        },
        {
          "id": "string",
          "type": "string",
          "version": "string",
          "name": "string"
        }
      ],
      "splitDNSRequestPolicy": "USE_SPLIT_TUNNEL_SETTING",
      "splitDNSDomainList": "string",
      "scepForwardingUrl": "string",
      "periodicClientCertAuthenticationInterval": 1,
      "enableDTLS": true,
      "enableDTLSCompression": true,
      "sslCompression": "DEFLATE",
      "enableSSLrekey": true,
      "rekeyMethod": "NEW_TUNNEL",
      "rekeyInterval": 6,
      "ignoreDFBit": true,
      "bypassUnsupportProtocol": false,
      "mtuSize": 1,
      "useAlwaysOnVPNSettingInProfile": true,
      "enableKeepAliveMessages": true,
      "keepAliveMessageInterval": 6,
      "enableGatewayDPD": false,
      "gatewayDPDInterval": 2,
      "enableClientDPD": false,
      "clientDPDInterval": 2,
      "clientProfiles": [
        {
          "id": "string",
          "type": "string",
          "version": "string",
          "name": "string"
        },
        {
          "id": "string",
          "type": "string",
          "version": "string",
          "name": "string"
        },
        {
          "id": "string",
          "type": "string",
          "version": "string",
          "name": "string"
        },
        {
          "id": "string",
          "type": "string",
          "version": "string",
          "name": "string"
        },
        {
          "id": "string",
          "type": "string",
          "version": "string",
          "name": "string"
        },
        {
          "id": "string",
          "type": "string",
          "version": "string",
          "name": "string"
        },
        {
          "id": "string",
          "type": "string",
          "version": "string",
          "name": "string"
        }
      ],
      "keepInstallerOnClient": false,
      "vpnTrafficFilterACL": {
        "id": "string",
        "type": "string",
        "version": "string",
        "name": "string"
      },
      "enableRestrictVPNToVLAN": false,
      "restrictVPNToVLANId": 5,
      "clientFirewallPrivateNetworkRules": {
        "id": "string",
        "type": "string",
        "version": "string",
        "name": "string"
      },
      "clientFirewallPublicNetworkRules": {
        "id": "string",
        "type": "string",
        "version": "string",
        "name": "string"
      },
      "browserProxyType": "USE_SERVER",
      "proxy": {
        "serverHost": "string",
        "port": 7,
        "type": "serverhostandport"
      },
      "proxyExceptions": [
        {
          "serverHost": "string",
          "port": 8,
          "type": "serverhostandport"
        },
        {
          "serverHost": "string",
          "port": 10,
          "type": "serverhostandport"
        },
        {
          "serverHost": "string",
          "port": 6,
          "type": "serverhostandport"
        },
        {
          "serverHost": "string",
          "port": 8,
          "type": "serverhostandport"
        },
        {
          "serverHost": "string",
          "port": 5,
          "type": "serverhostandport"
        },
        {
          "serverHost": "string",
          "port": 5,
          "type": "serverhostandport"
        }
      ],
      "isEnablePeriodicClientCertAuthentication": true,
      "id": "string",
      "type": "ravpngrouppolicy",
      "links": {
        "self": "string"
      }
    },
    {
      "version": "string",
      "name": "string",
      "banner": "string",
      "dnsServerGroup": {
        "id": "string",
        "type": "string",
        "version": "string",
        "name": "string"
      },
      "defaultDomainName": "string",
      "simultaneousLoginPerUser": 6,
      "maxConnectionTimeout": 8,
      "maxConnectionTimeAlertInterval": 8,
      "vpnIdleTimeout": 5,
      "vpnIdleTimeoutAlertInterval": 4,
      "ipv4LocalAddressPool": [
        {
          "id": "string",
          "type": "string",
          "version": "string",
          "name": "string"
        },
        {
          "id": "string",
          "type": "string",
          "version": "string",
          "name": "string"
        },
        {
          "id": "string",
          "type": "string",
          "version": "string",
          "name": "string"
        },
        {
          "id": "string",
          "type": "string",
          "version": "string",
          "name": "string"
        },
        {
          "id": "string",
          "type": "string",
          "version": "string",
          "name": "string"
        },
        {
          "id": "string",
          "type": "string",
          "version": "string",
          "name": "string"
        }
      ],
      "ipv6LocalAddressPool": [
        {
          "id": "string",
          "type": "string",
          "version": "string",
          "name": "string"
        },
        {
          "id": "string",
          "type": "string",
          "version": "string",
          "name": "string"
        },
        {
          "id": "string",
          "type": "string",
          "version": "string",
          "name": "string"
        },
        {
          "id": "string",
          "type": "string",
          "version": "string",
          "name": "string"
        },
        {
          "id": "string",
          "type": "string",
          "version": "string",
          "name": "string"
        },
        {
          "id": "string",
          "type": "string",
          "version": "string",
          "name": "string"
        },
        {
          "id": "string",
          "type": "string",
          "version": "string",
          "name": "string"
        },
        {
          "id": "string",
          "type": "string",
          "version": "string",
          "name": "string"
        },
        {
          "id": "string",
          "type": "string",
          "version": "string",
          "name": "string"
        }
      ],
      "dhcpScope": {
        "id": "string",
        "type": "string",
        "version": "string",
        "name": "string"
      },
      "ipv4SplitTunnelSetting": "TUNNEL_ALL",
      "ipv6SplitTunnelSetting": "EXCLUDE_SPECIFIED_OVER_TUNNEL",
      "ipv4SplitTunnelNetworks": [
        {
          "id": "string",
          "type": "string",
          "version": "string",
          "name": "string"
        },
        {
          "id": "string",
          "type": "string",
          "version": "string",
          "name": "string"
        },
        {
          "id": "string",
          "type": "string",
          "version": "string",
          "name": "string"
        },
        {
          "id": "string",
          "type": "string",
          "version": "string",
          "name": "string"
        },
        {
          "id": "string",
          "type": "string",
          "version": "string",
          "name": "string"
        },
        {
          "id": "string",
          "type": "string",
          "version": "string",
          "name": "string"
        },
        {
          "id": "string",
          "type": "string",
          "version": "string",
          "name": "string"
        }
      ],
      "ipv6SplitTunnelNetworks": [
        {
          "id": "string",
          "type": "string",
          "version": "string",
          "name": "string"
        },
        {
          "id": "string",
          "type": "string",
          "version": "string",
          "name": "string"
        },
        {
          "id": "string",
          "type": "string",
          "version": "string",
          "name": "string"
        },
        {
          "id": "string",
          "type": "string",
          "version": "string",
          "name": "string"
        },
        {
          "id": "string",
          "type": "string",
          "version": "string",
          "name": "string"
        }
      ],
      "splitDNSRequestPolicy": "TUNNEL_SPECIFIED_DOMAINS",
      "splitDNSDomainList": "string",
      "scepForwardingUrl": "string",
      "periodicClientCertAuthenticationInterval": 3,
      "enableDTLS": true,
      "enableDTLSCompression": false,
      "sslCompression": "DEFLATE",
      "enableSSLrekey": false,
      "rekeyMethod": "NEW_TUNNEL",
      "rekeyInterval": 3,
      "ignoreDFBit": false,
      "bypassUnsupportProtocol": true,
      "mtuSize": 4,
      "useAlwaysOnVPNSettingInProfile": true,
      "enableKeepAliveMessages": false,
      "keepAliveMessageInterval": 3,
      "enableGatewayDPD": true,
      "gatewayDPDInterval": 5,
      "enableClientDPD": true,
      "clientDPDInterval": 10,
      "clientProfiles": [
        {
          "id": "string",
          "type": "string",
          "version": "string",
          "name": "string"
        },
        {
          "id": "string",
          "type": "string",
          "version": "string",
          "name": "string"
        },
        {
          "id": "string",
          "type": "string",
          "version": "string",
          "name": "string"
        }
      ],
      "keepInstallerOnClient": false,
      "vpnTrafficFilterACL": {
        "id": "string",
        "type": "string",
        "version": "string",
        "name": "string"
      },
      "enableRestrictVPNToVLAN": true,
      "restrictVPNToVLANId": 1,
      "clientFirewallPrivateNetworkRules": {
        "id": "string",
        "type": "string",
        "version": "string",
        "name": "string"
      },
      "clientFirewallPublicNetworkRules": {
        "id": "string",
        "type": "string",
        "version": "string",
        "name": "string"
      },
      "browserProxyType": "AUTO_DETECT",
      "proxy": {
        "serverHost": "string",
        "port": 7,
        "type": "serverhostandport"
      },
      "proxyExceptions": [
        {
          "serverHost": "string",
          "port": 2,
          "type": "serverhostandport"
        },
        {
          "serverHost": "string",
          "port": 6,
          "type": "serverhostandport"
        },
        {
          "serverHost": "string",
          "port": 3,
          "type": "serverhostandport"
        },
        {
          "serverHost": "string",
          "port": 7,
          "type": "serverhostandport"
        },
        {
          "serverHost": "string",
          "port": 2,
          "type": "serverhostandport"
        },
        {
          "serverHost": "string",
          "port": 6,
          "type": "serverhostandport"
        }
      ],
      "isEnablePeriodicClientCertAuthentication": true,
      "id": "string",
      "type": "ravpngrouppolicy",
      "links": {
        "self": "string"
      }
    },
    {
      "version": "string",
      "name": "string",
      "banner": "string",
      "dnsServerGroup": {
        "id": "string",
        "type": "string",
        "version": "string",
        "name": "string"
      },
      "defaultDomainName": "string",
      "simultaneousLoginPerUser": 8,
      "maxConnectionTimeout": 4,
      "maxConnectionTimeAlertInterval": 6,
      "vpnIdleTimeout": 3,
      "vpnIdleTimeoutAlertInterval": 1,
      "ipv4LocalAddressPool": [
        {
          "id": "string",
          "type": "string",
          "version": "string",
          "name": "string"
        },
        {
          "id": "string",
          "type": "string",
          "version": "string",
          "name": "string"
        },
        {
          "id": "string",
          "type": "string",
          "version": "string",
          "name": "string"
        },
        {
          "id": "string",
          "type": "string",
          "version": "string",
          "name": "string"
        },
        {
          "id": "string",
          "type": "string",
          "version": "string",
          "name": "string"
        },
        {
          "id": "string",
          "type": "string",
          "version": "string",
          "name": "string"
        },
        {
          "id": "string",
          "type": "string",
          "version": "string",
          "name": "string"
        },
        {
          "id": "string",
          "type": "string",
          "version": "string",
          "name": "string"
        },
        {
          "id": "string",
          "type": "string",
          "version": "string",
          "name": "string"
        },
        {
          "id": "string",
          "type": "string",
          "version": "string",
          "name": "string"
        }
      ],
      "ipv6LocalAddressPool": [
        {
          "id": "string",
          "type": "string",
          "version": "string",
          "name": "string"
        },
        {
          "id": "string",
          "type": "string",
          "version": "string",
          "name": "string"
        }
      ],
      "dhcpScope": {
        "id": "string",
        "type": "string",
        "version": "string",
        "name": "string"
      },
      "ipv4SplitTunnelSetting": "EXCLUDE_SPECIFIED_OVER_TUNNEL",
      "ipv6SplitTunnelSetting": "TUNNEL_SPECIFIED_DOMAINS",
      "ipv4SplitTunnelNetworks": [
        {
          "id": "string",
          "type": "string",
          "version": "string",
          "name": "string"
        },
        {
          "id": "string",
          "type": "string",
          "version": "string",
          "name": "string"
        },
        {
          "id": "string",
          "type": "string",
          "version": "string",
          "name": "string"
        },
        {
          "id": "string",
          "type": "string",
          "version": "string",
          "name": "string"
        },
        {
          "id": "string",
          "type": "string",
          "version": "string",
          "name": "string"
        },
        {
          "id": "string",
          "type": "string",
          "version": "string",
          "name": "string"
        },
        {
          "id": "string",
          "type": "string",
          "version": "string",
          "name": "string"
        }
      ],
      "ipv6SplitTunnelNetworks": [
        {
          "id": "string",
          "type": "string",
          "version": "string",
          "name": "string"
        },
        {
          "id": "string",
          "type": "string",
          "version": "string",
          "name": "string"
        },
        {
          "id": "string",
          "type": "string",
          "version": "string",
          "name": "string"
        }
      ],
      "splitDNSRequestPolicy": "USE_SPLIT_TUNNEL_SETTING",
      "splitDNSDomainList": "string",
      "scepForwardingUrl": "string",
      "periodicClientCertAuthenticationInterval": 10,
      "enableDTLS": true,
      "enableDTLSCompression": false,
      "sslCompression": "LZS",
      "enableSSLrekey": true,
      "rekeyMethod": "NEW_TUNNEL",
      "rekeyInterval": 8,
      "ignoreDFBit": false,
      "bypassUnsupportProtocol": false,
      "mtuSize": 4,
      "useAlwaysOnVPNSettingInProfile": true,
      "enableKeepAliveMessages": true,
      "keepAliveMessageInterval": 2,
      "enableGatewayDPD": true,
      "gatewayDPDInterval": 10,
      "enableClientDPD": true,
      "clientDPDInterval": 3,
      "clientProfiles": [
        {
          "id": "string",
          "type": "string",
          "version": "string",
          "name": "string"
        },
        {
          "id": "string",
          "type": "string",
          "version": "string",
          "name": "string"
        },
        {
          "id": "string",
          "type": "string",
          "version": "string",
          "name": "string"
        },
        {
          "id": "string",
          "type": "string",
          "version": "string",
          "name": "string"
        },
        {
          "id": "string",
          "type": "string",
          "version": "string",
          "name": "string"
        }
      ],
      "keepInstallerOnClient": false,
      "vpnTrafficFilterACL": {
        "id": "string",
        "type": "string",
        "version": "string",
        "name": "string"
      },
      "enableRestrictVPNToVLAN": false,
      "restrictVPNToVLANId": 10,
      "clientFirewallPrivateNetworkRules": {
        "id": "string",
        "type": "string",
        "version": "string",
        "name": "string"
      },
      "clientFirewallPublicNetworkRules": {
        "id": "string",
        "type": "string",
        "version": "string",
        "name": "string"
      },
      "browserProxyType": "AUTO_DETECT",
      "proxy": {
        "serverHost": "string",
        "port": 10,
        "type": "serverhostandport"
      },
      "proxyExceptions": [
        {
          "serverHost": "string",
          "port": 7,
          "type": "serverhostandport"
        }
      ],
      "isEnablePeriodicClientCertAuthentication": true,
      "id": "string",
      "type": "ravpngrouppolicy",
      "links": {
        "self": "string"
      }
    },
    {
      "version": "string",
      "name": "string",
      "banner": "string",
      "dnsServerGroup": {
        "id": "string",
        "type": "string",
        "version": "string",
        "name": "string"
      },
      "defaultDomainName": "string",
      "simultaneousLoginPerUser": 5,
      "maxConnectionTimeout": 5,
      "maxConnectionTimeAlertInterval": 6,
      "vpnIdleTimeout": 6,
      "vpnIdleTimeoutAlertInterval": 5,
      "ipv4LocalAddressPool": [
        {
          "id": "string",
          "type": "string",
          "version": "string",
          "name": "string"
        }
      ],
      "ipv6LocalAddressPool": [
        {
          "id": "string",
          "type": "string",
          "version": "string",
          "name": "string"
        },
        {
          "id": "string",
          "type": "string",
          "version": "string",
          "name": "string"
        },
        {
          "id": "string",
          "type": "string",
          "version": "string",
          "name": "string"
        }
      ],
      "dhcpScope": {
        "id": "string",
        "type": "string",
        "version": "string",
        "name": "string"
      },
      "ipv4SplitTunnelSetting": "USE_SPLIT_TUNNEL_SETTING",
      "ipv6SplitTunnelSetting": "EXCLUDE_SPECIFIED_OVER_TUNNEL",
      "ipv4SplitTunnelNetworks": [
        {
          "id": "string",
          "type": "string",
          "version": "string",
          "name": "string"
        },
        {
          "id": "string",
          "type": "string",
          "version": "string",
          "name": "string"
        },
        {
          "id": "string",
          "type": "string",
          "version": "string",
          "name": "string"
        }
      ],
      "ipv6SplitTunnelNetworks": [
        {
          "id": "string",
          "type": "string",
          "version": "string",
          "name": "string"
        },
        {
          "id": "string",
          "type": "string",
          "version": "string",
          "name": "string"
        },
        {
          "id": "string",
          "type": "string",
          "version": "string",
          "name": "string"
        },
        {
          "id": "string",
          "type": "string",
          "version": "string",
          "name": "string"
        },
        {
          "id": "string",
          "type": "string",
          "version": "string",
          "name": "string"
        },
        {
          "id": "string",
          "type": "string",
          "version": "string",
          "name": "string"
        },
        {
          "id": "string",
          "type": "string",
          "version": "string",
          "name": "string"
        },
        {
          "id": "string",
          "type": "string",
          "version": "string",
          "name": "string"
        }
      ],
      "splitDNSRequestPolicy": "USE_SPLIT_TUNNEL_SETTING",
      "splitDNSDomainList": "string",
      "scepForwardingUrl": "string",
      "periodicClientCertAuthenticationInterval": 3,
      "enableDTLS": false,
      "enableDTLSCompression": false,
      "sslCompression": "DEFLATE",
      "enableSSLrekey": true,
      "rekeyMethod": "EXISTING_TUNNEL",
      "rekeyInterval": 2,
      "ignoreDFBit": true,
      "bypassUnsupportProtocol": true,
      "mtuSize": 8,
      "useAlwaysOnVPNSettingInProfile": false,
      "enableKeepAliveMessages": true,
      "keepAliveMessageInterval": 5,
      "enableGatewayDPD": false,
      "gatewayDPDInterval": 5,
      "enableClientDPD": false,
      "clientDPDInterval": 5,
      "clientProfiles": [
        {
          "id": "string",
          "type": "string",
          "version": "string",
          "name": "string"
        },
        {
          "id": "string",
          "type": "string",
          "version": "string",
          "name": "string"
        },
        {
          "id": "string",
          "type": "string",
          "version": "string",
          "name": "string"
        },
        {
          "id": "string",
          "type": "string",
          "version": "string",
          "name": "string"
        },
        {
          "id": "string",
          "type": "string",
          "version": "string",
          "name": "string"
        },
        {
          "id": "string",
          "type": "string",
          "version": "string",
          "name": "string"
        },
        {
          "id": "string",
          "type": "string",
          "version": "string",
          "name": "string"
        }
      ],
      "keepInstallerOnClient": true,
      "vpnTrafficFilterACL": {
        "id": "string",
        "type": "string",
        "version": "string",
        "name": "string"
      },
      "enableRestrictVPNToVLAN": false,
      "restrictVPNToVLANId": 3,
      "clientFirewallPrivateNetworkRules": {
        "id": "string",
        "type": "string",
        "version": "string",
        "name": "string"
      },
      "clientFirewallPublicNetworkRules": {
        "id": "string",
        "type": "string",
        "version": "string",
        "name": "string"
      },
      "browserProxyType": "USE_SERVER",
      "proxy": {
        "serverHost": "string",
        "port": 1,
        "type": "serverhostandport"
      },
      "proxyExceptions": [
        {
          "serverHost": "string",
          "port": 5,
          "type": "serverhostandport"
        }
      ],
      "isEnablePeriodicClientCertAuthentication": false,
      "id": "string",
      "type": "ravpngrouppolicy",
      "links": {
        "self": "string"
      }
    }
  ],
  "paging": {
    "prev": [
      "string",
      "string",
      "string",
      "string",
      "string",
      "string",
      "string",
      "string",
      "string"
    ],
    "next": [
      "string",
      "string"
    ],
    "limit": 8,
    "offset": 8,
    "count": 3,
    "pages": 9
  }
}