{
  "userName": "string",
  "identitySourceId": "string",
  "issuedAt": 1,
  "expiresAt": 8,
  "sessionDuration": "string",
  "id": "string",
  "type": "ActiveUserSessions",
  "links": {
    "self": "string"
  }
}