{
  "actions": [
    {
      "name": "getStandardCommunityListList",
      "protocol": "REST",
      "method": "GET",
      "entitypath": "{base_path}/{version}/object/standardcommunitylists?{query}",
      "requestSchema": "schema.json",
      "responseSchema": "schema.json",
      "timeout": 0,
      "sendEmpty": false,
      "sendGetBody": false,
      "requestDatatype": "JSON",
      "responseDatatype": "JSON",
      "headers": {},
      "responseObjects": [
        {
          "type": "default",
          "key": "",
          "mockFile": "mockdatafiles/getStandardCommunityListList-default.json"
        }
      ]
    },
    {
      "name": "addStandardCommunityList",
      "protocol": "REST",
      "method": "POST",
      "entitypath": "{base_path}/{version}/object/standardcommunitylists?{query}",
      "requestSchema": "schema.json",
      "responseSchema": "schema.json",
      "timeout": 0,
      "sendEmpty": false,
      "requestDatatype": "JSON",
      "responseDatatype": "JSON",
      "headers": {},
      "responseObjects": [
        {
          "type": "default",
          "key": "",
          "mockFile": "mockdatafiles/addStandardCommunityList-default.json"
        }
      ]
    },
    {
      "name": "getStandardCommunityList",
      "protocol": "REST",
      "method": "GET",
      "entitypath": "{base_path}/{version}/object/standardcommunitylists/{pathv1}?{query}",
      "requestSchema": "schema.json",
      "responseSchema": "schema.json",
      "timeout": 0,
      "sendEmpty": false,
      "sendGetBody": false,
      "requestDatatype": "JSON",
      "responseDatatype": "JSON",
      "headers": {},
      "responseObjects": [
        {
          "type": "default",
          "key": "",
          "mockFile": "mockdatafiles/getStandardCommunityList-default.json"
        }
      ]
    },
    {
      "name": "editStandardCommunityList",
      "protocol": "REST",
      "method": "PUT",
      "entitypath": "{base_path}/{version}/object/standardcommunitylists/{pathv1}?{query}",
      "requestSchema": "schema.json",
      "responseSchema": "schema.json",
      "timeout": 0,
      "sendEmpty": false,
      "requestDatatype": "JSON",
      "responseDatatype": "JSON",
      "headers": {},
      "responseObjects": [
        {
          "type": "default",
          "key": "",
          "mockFile": "mockdatafiles/editStandardCommunityList-default.json"
        }
      ]
    },
    {
      "name": "deleteStandardCommunityList",
      "protocol": "REST",
      "method": "DELETE",
      "entitypath": "{base_path}/{version}/object/standardcommunitylists/{pathv1}?{query}",
      "requestSchema": "schema.json",
      "responseSchema": "schema.json",
      "timeout": 0,
      "sendEmpty": false,
      "requestDatatype": "JSON",
      "responseDatatype": "JSON",
      "headers": {},
      "responseObjects": [
        {
          "type": "default",
          "key": "",
          "mockFile": ""
        }
      ]
    }
  ]
}