{
  "$id": "schema.json",
  "type": "object",
  "schema": "http://json-schema.org/draft-07/schema#",
  "translate": false,
  "dynamicfields": true,
  "properties": {
    "ph_request_type": {
      "type": "string",
      "description": "type of request (internal to adapter)",
      "default": "getAllAccessPolicy",
      "enum": [
        "getAllAccessPolicy",
        "createAccessPolicy",
        "getAllAccessRule",
        "createAccessRule",
        "updateAccessRule1",
        "getAccessRule",
        "updateAccessRule",
        "deleteAccessRule",
        "getAllDefaultAction",
        "getDefaultAction",
        "updateDefaultAction",
        "getAllAccessPolicyLoggingSettingModel",
        "getAccessPolicyLoggingSettingModel",
        "updateAccessPolicyLoggingSettingModel",
        "getHitCount",
        "updateHitCount",
        "deleteHitCount",
        "getAccessPolicy",
        "updateAccessPolicy",
        "deleteAccessPolicy",
        "getAllFilePolicy",
        "getFilePolicy",
        "getAllFTDNatPolicy",
        "createFTDNatPolicy",
        "getAllFTDAutoNatRule",
        "createFTDAutoNatRule",
        "getFTDAutoNatRule",
        "updateFTDAutoNatRule",
        "deleteFTDAutoNatRule",
        "getAllFTDManualNatRule",
        "createFTDManualNatRule",
        "getFTDManualNatRule",
        "updateFTDManualNatRule",
        "deleteFTDManualNatRule",
        "getAllFTDNatRule",
        "getFTDNatRule",
        "getFTDNatPolicy",
        "updateFTDNatPolicy",
        "deleteFTDNatPolicy",
        "getAllFTDS2SVpnModel",
        "createFTDS2SVpnModel",
        "getAllVpnAdvancedSettings",
        "getVpnAdvancedSettings",
        "updateVpnAdvancedSettings",
        "getAllVpnEndpoint",
        "createVpnEndpoint",
        "getVpnEndpoint",
        "updateVpnEndpoint",
        "deleteVpnEndpoint",
        "getAllVpnIkeSettings",
        "getVpnIkeSettings",
        "updateVpnIkeSettings",
        "getAllVpnIPSecSettings",
        "getVpnIPSecSettings",
        "updateVpnIPSecSettings",
        "getFTDS2SVpnModel",
        "updateFTDS2SVpnModel",
        "deleteFTDS2SVpnModel",
        "getAllIntrusionPolicy",
        "getIntrusionPolicy",
        "getAllPrefilterPolicy",
        "getPrefilterHitCount",
        "updatePrefilterHitCount",
        "deletePrefilterHitCount",
        "getPrefilterPolicy",
        "getAllSNMPConfig",
        "getSNMPConfig",
        "getAllSyslogConfig",
        "getSyslogConfig"
      ],
      "external_name": "ph_request_type"
    }
  },
  "definitions": {}
}