{
  "links": {
    "self": "https://example.cisco.com/api/fmc_config/v1/domain/domainUUID/object/ranges/Range-obj-UUID-1",
    "parent": "https://example.cisco.com/api/fmc_config/v1/domain/domainUUID/object/networkaddresses"
  },
  "type": "Range",
  "value": "2003::3-2003::4",
  "overridable": false,
  "description": "Test Description",
  "name": "TestRange2",
  "id": "Range-obj-UUID-1",
  "metadata": {
    "lastUser": {
      "name": "testuser"
    },
    "domain": {
      "name": "Global \\ TestDomain",
      "id": "domainUUID"
    },
    "ipType": "V_6",
    "parentType": "NetworkAddress"
  }
}