{
  "name": "InterfaceGroupObject5",
  "id": "Interface-group-UUID-1",
  "type": "InterfaceGroup",
  "links": {
    "self": "https://example.cisco.com/api/fmc_config/v1/domain/domainUUID/object/interfacegroups/Interface-group-UUID-1",
    "parent": "https://example.cisco.com/api/fmc_config/v1/domain/domainUUID/object/interfaceobjects/"
  },
  "metadata": {
    "timestamp": 1459973987,
    "readOnly": {
      "state": true
    },
    "domain": {
      "id": "domainUUID",
      "type": "Domain",
      "name": "Global"
    },
    "lastUser": {
      "name": "admin",
      "id": "User-UUID",
      "type": "User"
    }
  },
  "interfaceMode": "INLINE",
  "interfaces": [
    {
      "type": "FPPhysicalInterface",
      "id": "Intf-UUID-1",
      "name": "eth1"
    }
  ]
}