{
  "links": {
    "parent": "string",
    "self": "string"
  },
  "paging": {
    "pages": 4,
    "offset": 9,
    "limit": 7,
    "count": 4
  },
  "items": [
    {
      "logEnd": true,
      "metadata": {
        "lastUser": {
          "name": "string",
          "links": {
            "parent": "string",
            "self": "string"
          },
          "id": "string",
          "type": "string"
        },
        "domain": {
          "name": "string",
          "links": {
            "parent": "string",
            "self": "string"
          },
          "id": "string",
          "type": "string"
        },
        "readOnly": {
          "reason": "DOMAIN",
          "state": false
        },
        "timestamp": 1
      },
      "logBegin": false,
      "snmpConfig": {
        "name": "string",
        "links": {},
        "id": "string",
        "type": "string"
      },
      "intrusionPolicy": {
        "inlineDrop": 4,
        "metadata": {
          "lastUser": {
            "name": "string",
            "links": {},
            "id": "string",
            "type": "string"
          },
          "domain": {
            "name": "string",
            "links": {},
            "id": "string",
            "type": "string"
          },
          "readOnly": {
            "reason": {},
            "state": false
          },
          "timestamp": 5
        },
        "name": "string",
        "basePolicy": {},
        "description": "string",
        "links": {
          "parent": "string",
          "self": "string"
        },
        "id": "string",
        "type": "string",
        "version": "string"
      },
      "sendEventsToFMC": false,
      "description": "string",
      "type": "string",
      "variableSet": {
        "name": "string",
        "links": {},
        "id": "string",
        "type": "string"
      },
      "version": "string",
      "syslogConfig": {
        "name": "string",
        "links": {},
        "id": "string",
        "type": "string"
      },
      "name": "string",
      "action": "TRUST",
      "links": {
        "parent": "string",
        "self": "string"
      },
      "id": "string"
    },
    {
      "logEnd": false,
      "metadata": {
        "lastUser": {
          "name": "string",
          "links": {
            "parent": "string",
            "self": "string"
          },
          "id": "string",
          "type": "string"
        },
        "domain": {
          "name": "string",
          "links": {
            "parent": "string",
            "self": "string"
          },
          "id": "string",
          "type": "string"
        },
        "readOnly": {
          "reason": "DOMAIN",
          "state": true
        },
        "timestamp": 8
      },
      "logBegin": false,
      "snmpConfig": {
        "name": "string",
        "links": {},
        "id": "string",
        "type": "string"
      },
      "intrusionPolicy": {
        "inlineDrop": 6,
        "metadata": {
          "lastUser": {
            "name": "string",
            "links": {},
            "id": "string",
            "type": "string"
          },
          "domain": {
            "name": "string",
            "links": {},
            "id": "string",
            "type": "string"
          },
          "readOnly": {
            "reason": {},
            "state": false
          },
          "timestamp": 3
        },
        "name": "string",
        "basePolicy": {},
        "description": "string",
        "links": {
          "parent": "string",
          "self": "string"
        },
        "id": "string",
        "type": "string",
        "version": "string"
      },
      "sendEventsToFMC": true,
      "description": "string",
      "type": "string",
      "variableSet": {
        "name": "string",
        "links": {},
        "id": "string",
        "type": "string"
      },
      "version": "string",
      "syslogConfig": {
        "name": "string",
        "links": {},
        "id": "string",
        "type": "string"
      },
      "name": "string",
      "action": "TRUST",
      "links": {
        "parent": "string",
        "self": "string"
      },
      "id": "string"
    },
    {
      "logEnd": true,
      "metadata": {
        "lastUser": {
          "name": "string",
          "links": {
            "parent": "string",
            "self": "string"
          },
          "id": "string",
          "type": "string"
        },
        "domain": {
          "name": "string",
          "links": {
            "parent": "string",
            "self": "string"
          },
          "id": "string",
          "type": "string"
        },
        "readOnly": {
          "reason": "SYSTEM",
          "state": true
        },
        "timestamp": 8
      },
      "logBegin": false,
      "snmpConfig": {
        "name": "string",
        "links": {},
        "id": "string",
        "type": "string"
      },
      "intrusionPolicy": {
        "inlineDrop": 7,
        "metadata": {
          "lastUser": {
            "name": "string",
            "links": {},
            "id": "string",
            "type": "string"
          },
          "domain": {
            "name": "string",
            "links": {},
            "id": "string",
            "type": "string"
          },
          "readOnly": {
            "reason": {},
            "state": false
          },
          "timestamp": 3
        },
        "name": "string",
        "basePolicy": {},
        "description": "string",
        "links": {
          "parent": "string",
          "self": "string"
        },
        "id": "string",
        "type": "string",
        "version": "string"
      },
      "sendEventsToFMC": true,
      "description": "string",
      "type": "string",
      "variableSet": {
        "name": "string",
        "links": {},
        "id": "string",
        "type": "string"
      },
      "version": "string",
      "syslogConfig": {
        "name": "string",
        "links": {},
        "id": "string",
        "type": "string"
      },
      "name": "string",
      "action": "BLOCK",
      "links": {
        "parent": "string",
        "self": "string"
      },
      "id": "string"
    },
    {
      "logEnd": false,
      "metadata": {
        "lastUser": {
          "name": "string",
          "links": {
            "parent": "string",
            "self": "string"
          },
          "id": "string",
          "type": "string"
        },
        "domain": {
          "name": "string",
          "links": {
            "parent": "string",
            "self": "string"
          },
          "id": "string",
          "type": "string"
        },
        "readOnly": {
          "reason": "DOMAIN",
          "state": true
        },
        "timestamp": 9
      },
      "logBegin": false,
      "snmpConfig": {
        "name": "string",
        "links": {},
        "id": "string",
        "type": "string"
      },
      "intrusionPolicy": {
        "inlineDrop": 2,
        "metadata": {
          "lastUser": {
            "name": "string",
            "links": {},
            "id": "string",
            "type": "string"
          },
          "domain": {
            "name": "string",
            "links": {},
            "id": "string",
            "type": "string"
          },
          "readOnly": {
            "reason": {},
            "state": false
          },
          "timestamp": 5
        },
        "name": "string",
        "basePolicy": {},
        "description": "string",
        "links": {
          "parent": "string",
          "self": "string"
        },
        "id": "string",
        "type": "string",
        "version": "string"
      },
      "sendEventsToFMC": true,
      "description": "string",
      "type": "string",
      "variableSet": {
        "name": "string",
        "links": {},
        "id": "string",
        "type": "string"
      },
      "version": "string",
      "syslogConfig": {
        "name": "string",
        "links": {},
        "id": "string",
        "type": "string"
      },
      "name": "string",
      "action": "NETWORK_DISCOVERY",
      "links": {
        "parent": "string",
        "self": "string"
      },
      "id": "string"
    },
    {
      "logEnd": true,
      "metadata": {
        "lastUser": {
          "name": "string",
          "links": {
            "parent": "string",
            "self": "string"
          },
          "id": "string",
          "type": "string"
        },
        "domain": {
          "name": "string",
          "links": {
            "parent": "string",
            "self": "string"
          },
          "id": "string",
          "type": "string"
        },
        "readOnly": {
          "reason": "SYSTEM",
          "state": true
        },
        "timestamp": 5
      },
      "logBegin": false,
      "snmpConfig": {
        "name": "string",
        "links": {},
        "id": "string",
        "type": "string"
      },
      "intrusionPolicy": {
        "inlineDrop": 2,
        "metadata": {
          "lastUser": {
            "name": "string",
            "links": {},
            "id": "string",
            "type": "string"
          },
          "domain": {
            "name": "string",
            "links": {},
            "id": "string",
            "type": "string"
          },
          "readOnly": {
            "reason": {},
            "state": true
          },
          "timestamp": 4
        },
        "name": "string",
        "basePolicy": {},
        "description": "string",
        "links": {
          "parent": "string",
          "self": "string"
        },
        "id": "string",
        "type": "string",
        "version": "string"
      },
      "sendEventsToFMC": false,
      "description": "string",
      "type": "string",
      "variableSet": {
        "name": "string",
        "links": {},
        "id": "string",
        "type": "string"
      },
      "version": "string",
      "syslogConfig": {
        "name": "string",
        "links": {},
        "id": "string",
        "type": "string"
      },
      "name": "string",
      "action": "NETWORK_DISCOVERY",
      "links": {
        "parent": "string",
        "self": "string"
      },
      "id": "string"
    },
    {
      "logEnd": true,
      "metadata": {
        "lastUser": {
          "name": "string",
          "links": {
            "parent": "string",
            "self": "string"
          },
          "id": "string",
          "type": "string"
        },
        "domain": {
          "name": "string",
          "links": {
            "parent": "string",
            "self": "string"
          },
          "id": "string",
          "type": "string"
        },
        "readOnly": {
          "reason": "RBAC",
          "state": false
        },
        "timestamp": 9
      },
      "logBegin": true,
      "snmpConfig": {
        "name": "string",
        "links": {},
        "id": "string",
        "type": "string"
      },
      "intrusionPolicy": {
        "inlineDrop": 6,
        "metadata": {
          "lastUser": {
            "name": "string",
            "links": {},
            "id": "string",
            "type": "string"
          },
          "domain": {
            "name": "string",
            "links": {},
            "id": "string",
            "type": "string"
          },
          "readOnly": {
            "reason": {},
            "state": false
          },
          "timestamp": 2
        },
        "name": "string",
        "basePolicy": {},
        "description": "string",
        "links": {
          "parent": "string",
          "self": "string"
        },
        "id": "string",
        "type": "string",
        "version": "string"
      },
      "sendEventsToFMC": false,
      "description": "string",
      "type": "string",
      "variableSet": {
        "name": "string",
        "links": {},
        "id": "string",
        "type": "string"
      },
      "version": "string",
      "syslogConfig": {
        "name": "string",
        "links": {},
        "id": "string",
        "type": "string"
      },
      "name": "string",
      "action": "BLOCK",
      "links": {
        "parent": "string",
        "self": "string"
      },
      "id": "string"
    },
    {
      "logEnd": true,
      "metadata": {
        "lastUser": {
          "name": "string",
          "links": {
            "parent": "string",
            "self": "string"
          },
          "id": "string",
          "type": "string"
        },
        "domain": {
          "name": "string",
          "links": {
            "parent": "string",
            "self": "string"
          },
          "id": "string",
          "type": "string"
        },
        "readOnly": {
          "reason": "DOMAIN",
          "state": false
        },
        "timestamp": 3
      },
      "logBegin": false,
      "snmpConfig": {
        "name": "string",
        "links": {},
        "id": "string",
        "type": "string"
      },
      "intrusionPolicy": {
        "inlineDrop": 6,
        "metadata": {
          "lastUser": {
            "name": "string",
            "links": {},
            "id": "string",
            "type": "string"
          },
          "domain": {
            "name": "string",
            "links": {},
            "id": "string",
            "type": "string"
          },
          "readOnly": {
            "reason": {},
            "state": true
          },
          "timestamp": 5
        },
        "name": "string",
        "basePolicy": {},
        "description": "string",
        "links": {
          "parent": "string",
          "self": "string"
        },
        "id": "string",
        "type": "string",
        "version": "string"
      },
      "sendEventsToFMC": false,
      "description": "string",
      "type": "string",
      "variableSet": {
        "name": "string",
        "links": {},
        "id": "string",
        "type": "string"
      },
      "version": "string",
      "syslogConfig": {
        "name": "string",
        "links": {},
        "id": "string",
        "type": "string"
      },
      "name": "string",
      "action": "NETWORK_DISCOVERY",
      "links": {
        "parent": "string",
        "self": "string"
      },
      "id": "string"
    }
  ]
}