{
  "actions": [
    {
      "name": "getAllDeviceGroup",
      "protocol": "REST",
      "method": "GET",
      "entitypath": "{base_path}/{version}/api/fmc_config/v1/domain/{pathv1}/devicegroups/devicegrouprecords?{query}",
      "requestSchema": "schema.json",
      "responseSchema": "schema.json",
      "timeout": 0,
      "sendEmpty": false,
      "sendGetBody": false,
      "requestDatatype": "JSON",
      "responseDatatype": "JSON",
      "headers": {},
      "responseObjects": [
        {
          "type": "default",
          "key": "",
          "mockFile": "mockdatafiles/getAllDeviceGroup-default.json"
        }
      ]
    },
    {
      "name": "createDeviceGroup",
      "protocol": "REST",
      "method": "POST",
      "entitypath": "{base_path}/{version}/api/fmc_config/v1/domain/{pathv1}/devicegroups/devicegrouprecords?{query}",
      "requestSchema": "schema.json",
      "responseSchema": "schema.json",
      "timeout": 0,
      "sendEmpty": false,
      "requestDatatype": "JSON",
      "responseDatatype": "JSON",
      "headers": {},
      "responseObjects": [
        {
          "type": "default",
          "key": "",
          "mockFile": "mockdatafiles/createDeviceGroup-default.json"
        }
      ]
    },
    {
      "name": "getDeviceGroup",
      "protocol": "REST",
      "method": "GET",
      "entitypath": "{base_path}/{version}/api/fmc_config/v1/domain/{pathv1}/devicegroups/devicegrouprecords/{pathv2}?{query}",
      "requestSchema": "schema.json",
      "responseSchema": "schema.json",
      "timeout": 0,
      "sendEmpty": false,
      "sendGetBody": false,
      "requestDatatype": "JSON",
      "responseDatatype": "JSON",
      "headers": {},
      "responseObjects": [
        {
          "type": "default",
          "key": "",
          "mockFile": "mockdatafiles/getDeviceGroup-default.json"
        }
      ]
    },
    {
      "name": "updateDeviceGroup",
      "protocol": "REST",
      "method": "PUT",
      "entitypath": "{base_path}/{version}/api/fmc_config/v1/domain/{pathv1}/devicegroups/devicegrouprecords/{pathv2}?{query}",
      "requestSchema": "schema.json",
      "responseSchema": "schema.json",
      "timeout": 0,
      "sendEmpty": false,
      "requestDatatype": "JSON",
      "responseDatatype": "JSON",
      "headers": {},
      "responseObjects": [
        {
          "type": "default",
          "key": "",
          "mockFile": "mockdatafiles/updateDeviceGroup-default.json"
        }
      ]
    },
    {
      "name": "deleteDeviceGroup",
      "protocol": "REST",
      "method": "DELETE",
      "entitypath": "{base_path}/{version}/api/fmc_config/v1/domain/{pathv1}/devicegroups/devicegrouprecords/{pathv2}?{query}",
      "requestSchema": "schema.json",
      "responseSchema": "schema.json",
      "timeout": 0,
      "sendEmpty": false,
      "requestDatatype": "JSON",
      "responseDatatype": "JSON",
      "headers": {},
      "responseObjects": [
        {
          "type": "default",
          "key": "",
          "mockFile": "mockdatafiles/deleteDeviceGroup-default.json"
        }
      ]
    }
  ]
}