{
  "actions": [
    {
      "name": "getTaskStatus",
      "protocol": "REST",
      "method": "GET",
      "entitypath": "{base_path}/{version}/api/fmc_config/v1/domain/{pathv1}/job/taskstatuses/{pathv2}?{query}",
      "requestSchema": "schema.json",
      "responseSchema": "schema.json",
      "timeout": 0,
      "sendEmpty": false,
      "sendGetBody": false,
      "requestDatatype": "JSON",
      "responseDatatype": "JSON",
      "headers": {},
      "responseObjects": [
        {
          "type": "default",
          "key": "",
          "mockFile": "mockdatafiles/getTaskStatus-default.json"
        }
      ]
    }
  ]
}