{
  "metadata": {
    "section": "BEFORE_AUTO",
    "index": -1,
    "timestamp": 1488950245960,
    "domain": {
      "name": "Global",
      "id": "domainUuid",
      "type": "Domain"
    }
  },
  "links": {
    "self": "<fmc_url>/api/fmc_config/v1/domain/domainUuid/policy/ftdnatpolicies/natPolicyUuid/manualnatrules/manualNatRuleUuid1",
    "parent": "<fmc_url>/api/fmc_config/v1/domain/domainUuid/policy/ftdnatpolicies/natPolicyUuid/natrules"
  },
  "unidirectional": true,
  "originalSource": {
    "type": "Network",
    "id": "networkObjUuid",
    "name": "any"
  },
  "interfaceInOriginalDestination": false,
  "interfaceInTranslatedSource": true,
  "enabled": true,
  "type": "FTDManualNatRule",
  "destinationInterface": {
    "name": "seczonemanual",
    "id": "secZoneObjUuid2",
    "type": "SecurityZone"
  },
  "dns": false,
  "interfaceIpv6": false,
  "noProxyArp": false,
  "netToNet": false,
  "natType": "DYNAMIC",
  "sourceInterface": {
    "name": "seczonebefore",
    "id": "secZoneObjUuid",
    "type": "SecurityZone"
  },
  "id": "manualNatRuleUuid1"
}