{
  "metadata": {
    "lastUser": {
      "name": "string",
      "links": {
        "parent": "string",
        "self": "string"
      },
      "id": "string",
      "type": "string"
    },
    "parentPolicy": {
      "name": "string",
      "links": {},
      "id": "string",
      "type": "string"
    },
    "inherit": false,
    "domain": {
      "name": "string",
      "links": {
        "parent": "string",
        "self": "string"
      },
      "id": "string",
      "type": "string"
    },
    "readOnly": {
      "reason": "RBAC",
      "state": false
    },
    "timestamp": 2
  },
  "defaultAction": {
    "logEnd": true,
    "logBegin": true,
    "metadata": {},
    "snmpConfig": {},
    "intrusionPolicy": {},
    "sendEventsToFMC": false,
    "description": "string",
    "type": "string",
    "variableSet": {},
    "version": "string",
    "syslogConfig": {},
    "name": "string",
    "action": {},
    "links": {},
    "id": "string"
  },
  "name": "string",
  "description": "string",
  "links": {
    "parent": "string",
    "self": "string"
  },
  "rules": {},
  "id": "string",
  "type": "string",
  "version": "string"
}