{
  "links": {
    "self": "/fmc_config/v1/domain/default/object/ikev2policies?offset=0&limit=2"
  },
  "items": [
    {
      "links": {
        "self": "/fmc_config/v1/domain/default/object/ikev2policies/ikev2Object1UUID"
      },
      "type": "Ikev2Policy",
      "id": "ikev2Object1UUID",
      "name": "ikev2_test"
    },
    {
      "links": {
        "self": "/fmc_config/v1/domain/default/object/ikev2policies/ikev2Object2UUID"
      },
      "type": "Ikev2Policy",
      "id": "ikev2Object2UUID",
      "name": "ikev2_test2"
    }
  ],
  "paging": {
    "offset": 0,
    "limit": 2,
    "count": 2,
    "pages": 1
  }
}