{
  "metadata": {
    "lastUser": {
      "name": "string",
      "links": {
        "parent": "string",
        "self": "string"
      },
      "id": "string",
      "type": "string"
    },
    "task": {
      "taskType": {},
      "subTasks": [
        {},
        {},
        {},
        {},
        {},
        {},
        {}
      ],
      "name": "string",
      "description": "string",
      "links": {},
      "id": "string",
      "message": "string",
      "type": "string",
      "status": "string"
    },
    "ruleIndex": 6,
    "domain": {
      "name": "string",
      "links": {
        "parent": "string",
        "self": "string"
      },
      "id": "string",
      "type": "string"
    },
    "deviceRuleId": "string",
    "timestamp": 2,
    "policy": {
      "metadata": {
        "lastUser": {
          "name": "string",
          "links": {},
          "id": "string",
          "type": "string"
        },
        "domain": {
          "name": "string",
          "links": {},
          "id": "string",
          "type": "string"
        },
        "readOnly": {
          "reason": {},
          "state": true
        },
        "timestamp": 2
      },
      "name": "string",
      "description": "string",
      "links": {
        "parent": "string",
        "self": "string"
      },
      "id": "string",
      "type": "string",
      "version": "string"
    }
  },
  "lastFetchTimeStamp": "string",
  "hitCount": 4,
  "firstHitTimeStamp": "string",
  "rule": {
    "metadata": {
      "lastUser": {
        "name": "string",
        "links": {},
        "id": "string",
        "type": "string"
      },
      "domain": {
        "name": "string",
        "links": {},
        "id": "string",
        "type": "string"
      },
      "readOnly": {
        "reason": {},
        "state": false
      },
      "timestamp": 10
    },
    "name": "string",
    "description": "string",
    "links": {
      "parent": "string",
      "self": "string"
    },
    "id": "string",
    "type": "string",
    "version": "string"
  },
  "lastHitTimeStamp": "string",
  "description": "string",
  "links": {
    "parent": "string",
    "self": "string"
  },
  "type": "string",
  "version": "string"
}