{
  "items": [
    {
      "name": "TT_obj1",
      "id": "tunnelTagObj1UUID",
      "type": "TunnelTag",
      "links": {
        "self": "/fmc_config/v1/domain/domainUUID/object/tunneltags/tunnelTagObj1UUID"
      }
    },
    {
      "name": "TT_obj2",
      "id": "tunnelTagObj2UUID",
      "type": "TunnelTag",
      "links": {
        "self": "/fmc_config/v1/domain/domainUUID/object/tunneltags/tunnelTagObj2UUID"
      }
    },
    {
      "name": "TT_obj3",
      "id": "tunnelTagObj3UUID",
      "type": "TunnelTag",
      "links": {
        "self": "/fmc_config/v1/domain/domainUUID/object/tunneltags/tunnelTagObj3UUID"
      }
    }
  ],
  "paging": {
    "offset": 0,
    "limit": 3,
    "count": 3,
    "pages": 1
  }
}