{
  "originalNetwork": {
    "type": "Network",
    "id": "Network object uuid"
  },
  "translatedNetwork": {
    "type": "Network",
    "id": "Network object uuid"
  },
  "id": "autoNatRuleUuid",
  "type": "FTDAutoNatRule",
  "natType": "STATIC",
  "interfaceIpv6": false,
  "fallThrough": false,
  "dns": false,
  "routeLookup": false,
  "noProxyArp": false,
  "netToNet": false,
  "sourceInterface": {
    "id": "security zone uuid",
    "type": "SecurityZone"
  },
  "destinationInterface": {
    "id": "security zone uuid",
    "type": "SecurityZone"
  }
}