{
  "name": "Redundant4",
  "type": "RedundantInterface",
  "primaryInterface": {
    "name": "GigabitEthernet0/0",
    "type": "PhysicalInterface",
    "id": "interface UUID"
  },
  "redundantId": 4,
  "secondaryInterface": {
    "name": "GigabitEthernet0/1",
    "type": "PhysicalInterface",
    "id": "interface UUID"
  },
  "enabled": true,
  "MTU": 1500,
  "ifname": "redInter",
  "managementOnly": false,
  "ipv4": {
    "static": {}
  },
  "ipv6": {
    "enforceEUI64": false,
    "enableAutoConfig": false,
    "enableDHCPAddrConfig": true,
    "enableDHCPNonAddrConfig": false,
    "dadAttempts": 1,
    "nsInterval": 1000,
    "reachableTime": 0,
    "enableRA": true,
    "raLifeTime": 1800,
    "raInterval": 200,
    "enableIPV6": false
  },
  "enableAntiSpoofing": false,
  "overrideDefaultFragmentSetting": {},
  "id": "00000000-0000-0ed3-0000-206158430258",
  "links": {
    "self": "/fmc_config/v1/domain/domainUUID/devices/devicerecords/containerUUID/redundantinterfaces/redundantinterfaceUUID"
  },
  "metadata": {
    "readOnly": {
      "state": false
    },
    "timestamp": 1458597038,
    "lastUser": {
      "name": "admin",
      "id": "UserUUID",
      "type": "user"
    },
    "domain": {
      "name": "Global",
      "id": "DomainUUID",
      "type": "domain"
    },
    "activity": 0,
    "link": 0,
    "speed": -1
  }
}