{
  "metadata": {
    "lastUser": {
      "name": "pvs"
    },
    "domain": {
      "name": "Global \\ Asia",
      "id": "subdomain_id"
    }
  },
  "links": {
    "self": "https://fmc_host_ip/api/fmc_config/v1/domain/global/object/urls/urlObjectUUID"
  },
  "type": "Url",
  "url": "www.cisco.com",
  "overridable": true,
  "overrides": {
    "parent": {
      "id": "urlObjectUUID",
      "type": "Url"
    },
    "target": {
      "name": "Global \\ Asia",
      "id": "subdomain_id",
      "type": "Domain"
    }
  },
  "description": " ",
  "name": "pvs_global_url",
  "id": "urlObjectUUID"
}